Raspbian Package Auto-Building

Buildd status for libundead (bookworm-staging)

Debian PTSTrackerChangelogBugspackages.d.obuildd.d.o

Package(s): Suite:
Compact mode Co-maintainers

ArchitectureVersionStatusForBuilddStateMiscLogs
Buildd exposure stats armhf  1.0.10-1Build-Attempted30d 18h 59mtestbuildduncompiledmisc:optionalold | all (3)

Tail of log for libundead on armhf:

/<<PKGBUILDDIR>>/src/undead/stream.d:1222:16: error: generic thunk code fails for method ‘_DT12_D6undead6stream6Stream6writefMFYC6undead6stream12OutputStream’ which uses ‘...’
 1222 |   OutputStream writef(...) {
      |                ^
/<<PKGBUILDDIR>>/src/undead/stream.d:1207:10: error: generic thunk code fails for method ‘_DT12_D6undead6stream6Stream6printfMFAxaYk’ which uses ‘...’
 1207 |   size_t printf(const(char)[] format, ...) {
      |          ^
/<<PKGBUILDDIR>>/src/undead/stream.d:1069:7: error: generic thunk code fails for method ‘_DT8_D6undead6stream6Stream5readfMFYi’ which uses ‘...’
 1069 |   int readf(...) {
      |       ^
[3/29] gdc -Ilibundead.so.1.0.7.p -I. -I.. -I../src -Wall -Wdeprecated -g -O2 -ffile-prefix-map=/<<PKGBUILDDIR>>=. -fstack-protector-strong -frelease -fPIC -MD -MQ libundead.so.1.0.7.p/src_undead_bitarray.d.o -MF libundead.so.1.0.7.p/src_undead_bitarray.d.o.deps -o libundead.so.1.0.7.p/src_undead_bitarray.d.o -c ../src/undead/bitarray.d
[4/29] gdc -Ilibundead.so.1.0.7.p -I. -I.. -I../src -Wall -Wdeprecated -g -O2 -ffile-prefix-map=/<<PKGBUILDDIR>>=. -fstack-protector-strong -frelease -fPIC -MD -MQ libundead.so.1.0.7.p/src_undead_dateparse.d.o -MF libundead.so.1.0.7.p/src_undead_dateparse.d.o.deps -o libundead.so.1.0.7.p/src_undead_dateparse.d.o -c ../src/undead/dateparse.d
[5/29] gdc -Ilibundead.so.1.0.7.p -I. -I.. -I../src -Wall -Wdeprecated -g -O2 -ffile-prefix-map=/<<PKGBUILDDIR>>=. -fstack-protector-strong -frelease -fPIC -MD -MQ libundead.so.1.0.7.p/src_undead_date.d.o -MF libundead.so.1.0.7.p/src_undead_date.d.o.deps -o libundead.so.1.0.7.p/src_undead_date.d.o -c ../src/undead/date.d
ninja: build stopped: subcommand failed.
dh_auto_build: error: cd obj-arm-linux-gnueabihf && LC_ALL=C.UTF-8 ninja -j4 -v returned exit code 1
make: *** [debian/rules:9: build-arch] Error 25