Raspbian Package Auto-Building

Buildd status for libmaus2 (bookworm-staging)

Debian PTSTrackerChangelogBugspackages.d.obuildd.d.o

Package(s): Suite:
Compact mode Co-maintainers

ArchitectureVersionStatusForBuilddStateMiscLogs
Buildd exposure stats armhf  2.0.803+dfsg-1Build-Attempted28d 19h 55mbm-wb-01uncompiledmisc:extraold | all (2)

Tail of log for libmaus2 on armhf:

/usr/bin/ld: /usr/include/c++/10/bits/atomic_base.h:426: undefined reference to `__atomic_load_8'
/usr/bin/ld: test/testThreadPoolBgzfDecompress-testThreadPoolBgzfDecompress.o: in function `std::__atomic_base<unsigned long long>::operator++()':
/usr/include/c++/10/bits/atomic_base.h:326: undefined reference to `__atomic_fetch_add_8'
/usr/bin/ld: ./.libs/libmaus2.so: undefined reference to `__atomic_fetch_or_8'
/usr/bin/ld: ./.libs/libmaus2.so: undefined reference to `__atomic_compare_exchange_8'
/usr/bin/ld: ./.libs/libmaus2.so: undefined reference to `__atomic_fetch_and_8'
collect2: error: ld returned 1 exit status
make[3]: *** [Makefile:6960: testThreadPoolBgzfDecompress] Error 1
make[3]: Leaving directory '/<<BUILDDIR>>/libmaus2-2.0.803+dfsg/src'
make[2]: *** [Makefile:681: all-recursive] Error 1
make[2]: Leaving directory '/<<BUILDDIR>>/libmaus2-2.0.803+dfsg'
make[1]: *** [Makefile:565: all] Error 2
make[1]: Leaving directory '/<<BUILDDIR>>/libmaus2-2.0.803+dfsg'
dh_auto_build: error: make -j4 returned exit code 2
make: *** [debian/rules:16: binary-arch] Error 25