Raspbian Package Auto-Building

Buildd status for libgrokj2k (bullseye-staging)

Debian PTSTrackerChangelogBugspackages.d.obuildd.d.o

Package(s): Suite:
Compact mode Co-maintainers

ArchitectureVersionStatusForBuilddStateMiscLogs
Buildd exposure stats armhf  7.6.6-3Build-Attempted1d 1h 47mmb-lxc-01uncompiledmisc:extraold | all (2)

Tail of log for libgrokj2k on armhf:

make[3]: Leaving directory '/<<PKGBUILDDIR>>/obj-arm-linux-gnueabihf'
make[2]: *** [CMakeFiles/Makefile2:342: src/bin/jp2/CMakeFiles/grk_compress.dir/all] Error 2
[100%] Linking CXX executable ../../../bin/grk_dump
cd /<<PKGBUILDDIR>>/obj-arm-linux-gnueabihf/src/bin/jp2 && /usr/bin/cmake -E cmake_link_script CMakeFiles/grk_dump.dir/link.txt --verbose=1
/usr/bin/c++ -g -O2 -ffile-prefix-map=/<<PKGBUILDDIR>>=. -fstack-protector-strong -Wformat -Werror=format-security -fvisibility=hidden -Wdate-time -D_FORTIFY_SOURCE=2 -Wl,-z,relro -Wl,-z,now CMakeFiles/grk_dump.dir/grk_dump.cpp.o CMakeFiles/grk_dump.dir/__/common/convert.cpp.o CMakeFiles/grk_dump.dir/__/image_format/ImageFormat.cpp.o CMakeFiles/grk_dump.dir/__/image_format/FileStreamIO.cpp.o CMakeFiles/grk_dump.dir/__/image_format/PNMFormat.cpp.o CMakeFiles/grk_dump.dir/__/image_format/PGXFormat.cpp.o CMakeFiles/grk_dump.dir/__/image_format/BMPFormat.cpp.o CMakeFiles/grk_dump.dir/__/image_format/RAWFormat.cpp.o CMakeFiles/grk_dump.dir/__/common/color.cpp.o CMakeFiles/grk_dump.dir/__/common/common.cpp.o CMakeFiles/grk_dump.dir/__/common/exif.cpp.o CMakeFiles/grk_dump.dir/__/common/spdlog/spdlog.cpp.o CMakeFiles/grk_dump.dir/__/common/spdlog/color_sinks.cpp.o CMakeFiles/grk_dump.dir/__/common/spdlog/stdout_sinks.cpp.o CMakeFiles/grk_dump.dir/__/common/spdlog/fmt.cpp.o CMakeFiles/grk_dump.dir/__/common/spdlog/async.cpp.o CMakeFiles/grk_dump.dir/__/common/spdlog/file_sinks.cpp.o CMakeFiles/grk_dump.dir/__/image_format/TIFFFormat.cpp.o CMakeFiles/grk_dump.dir/__/image_format/PNGFormat.cpp.o CMakeFiles/grk_dump.dir/__/image_format/JPEGFormat.cpp.o CMakeFiles/grk_dump.dir/__/image_format/iccjpeg.c.o -o ../../../bin/grk_dump  ../../../bin/libgrokj2k.so.7.6.6 /usr/lib/arm-linux-gnueabihf/libpng.so /usr/lib/arm-linux-gnueabihf/libz.so /usr/lib/arm-linux-gnueabihf/libtiff.so /usr/lib/arm-linux-gnueabihf/liblcms2.so /usr/lib/arm-linux-gnueabihf/libjpeg.so -ldl /usr/lib/arm-linux-gnueabihf/libz.so /usr/lib/arm-linux-gnueabihf/libperl.so.5.32 -lcrypt -lpthread /usr/lib/arm-linux-gnueabihf/libtiff.so /usr/lib/arm-linux-gnueabihf/liblcms2.so /usr/lib/arm-linux-gnueabihf/libjpeg.so -ldl /usr/lib/arm-linux-gnueabihf/libperl.so.5.32 -lcrypt 
/usr/bin/ld: ../../../bin/libgrokj2k.so.7.6.6: undefined reference to `__atomic_fetch_add_8'
collect2: error: ld returned 1 exit status
make[3]: *** [src/bin/jp2/CMakeFiles/grk_dump.dir/build.make:418: bin/grk_dump] Error 1
make[3]: Leaving directory '/<<PKGBUILDDIR>>/obj-arm-linux-gnueabihf'
make[2]: *** [CMakeFiles/Makefile2:315: src/bin/jp2/CMakeFiles/grk_dump.dir/all] Error 2
make[2]: Leaving directory '/<<PKGBUILDDIR>>/obj-arm-linux-gnueabihf'
make[1]: *** [Makefile:174: all] Error 2
make[1]: Leaving directory '/<<PKGBUILDDIR>>/obj-arm-linux-gnueabihf'
dh_auto_build: error: cd obj-arm-linux-gnueabihf && make -j4 "INSTALL=install --strip-program=true" VERBOSE=1 returned exit code 2
make: *** [debian/rules:14: binary-arch] Error 25