Raspbian Package Auto-Building

Buildd status for libdnf (bullseye-staging)

Debian PTSTrackerChangelogBugspackages.d.obuildd.d.o

Package(s): Suite:
Compact mode Co-maintainers

ArchitectureVersionStatusForBuilddStateMiscLogs
Buildd exposure stats armhf  0.55.2-6Build-Attempted2d 1h 3mmb-lxc-02uncompiledmisc:extraold | all (2)

Tail of log for libdnf on armhf:

4/4 Test #1: test_cpp .........................   Passed    3.13 sec

75% tests passed, 1 tests failed out of 4

Total Test time (real) =   3.14 sec

The following tests FAILED:
	  3 - test_libdnf_main (Child aborted)
Errors while running CTest
make[2]: *** [Makefile:152: test] Error 8
make[2]: Leaving directory '/<<PKGBUILDDIR>>/build'
dh_auto_test: error: cd build && make -j4 test ARGS=-V ARGS\+=-j4 returned exit code 2
make[1]: *** [debian/rules:48: override_dh_auto_test] Error 25
make[1]: Leaving directory '/<<PKGBUILDDIR>>'
make: *** [debian/rules:11: build-arch] Error 2