Raspbian Package Auto-Building

Buildd status for libaio (bookworm-staging)

Debian PTSTrackerChangelogBugspackages.d.obuildd.d.o

Package(s): Suite:
Compact mode Co-maintainers

ArchitectureVersionStatusForBuilddStateMiscLogs
Buildd exposure stats armhf  0.3.112-13Build-Attempted66d 8h 39mmb-lxc-02out-of-datelibs:sourceold | all (4)

Tail of log for libaio on armhf:

Starting cases/21.p
test cases/21.t completed PASSED.
Completed cases/21.p with 0.
Starting cases/22.p
test cases/22.t completed PASSED.
Completed cases/22.p with 0.
Pass: 15  Fail: 3  Skip: 0
Test run complete at Thu Dec 2 17:43:30 UTC 2021
make[3]: *** [Makefile:56: partcheck] Error 3
make[3]: Leaving directory '/<<PKGBUILDDIR>>/harness'
make[2]: *** [Makefile:29: partcheck] Error 2
make[2]: Leaving directory '/<<PKGBUILDDIR>>'
make[1]: *** [debian/rules:41: override_dh_auto_test] Error 2
make[1]: Leaving directory '/<<PKGBUILDDIR>>'
make: *** [debian/rules:35: binary-arch] Error 2