Raspbian Package Auto-Building

Buildd status for kvmtool (bookworm-staging)

Debian PTSTrackerChangelogBugspackages.d.obuildd.d.o

Package(s): Suite:
Compact mode Co-maintainers

ArchitectureVersionStatusForBuilddStateMiscLogs
Buildd exposure stats armhf  0.20170904-1.1Build-Attempted30d 13h 5mbm-wb-01uncompiledmisc:sourceold | all (3)

Tail of log for kvmtool on armhf:

/usr/include/arm-linux-gnueabihf/bits/string_fortified.h:34:10: error: writing 1 byte into a region of size 0 [-Werror=stringop-overflow=]
   34 |   return __builtin___memcpy_chk (__dest, __src, __len, __bos0 (__dest));
      |          ^~~~~~~~~~~~~~~~~~~~~~~~~~~~~~~~~~~~~~~~~~~~~~~~~~~~~~~~~~~~~~
In file included from net/uip/csum.c:1:
net/uip/csum.c: In function 'uip_csum_tcp':
include/kvm/uip.h:147:6: note: at offset 0 to object 'sport' with size 2 declared here
  147 |  u16 sport;
      |      ^~~~~
gcc -c -Wp,-MD,util/.init.o.d -march=armv7-a -DCONFIG_GUEST_INIT -Wdate-time -D_FORTIFY_SOURCE=2 -DCONFIG_ARM -D_FILE_OFFSET_BITS=64 -D_GNU_SOURCE -DKVMTOOLS_VERSION='""' -DBUILD_ARCH='"arm"' -Iinclude -Iarm/include -Iarm/aarch32/include -O2 -fno-strict-aliasing -g -Wall -Wformat=2 -Winit-self -Wmissing-declarations -Wmissing-prototypes -Wnested-externs -Wno-system-headers -Wold-style-definition -Wredundant-decls -Wsign-compare -Wstrict-prototypes -Wundef -Wvolatile-register-var -Wwrite-strings -Wno-format-nonliteral -Werror -DCONFIG_HAS_ZLIB -DCONFIG_HAS_AIO -DCONFIG_HAS_LIBFDT util/init.c -o util/init.o
cc1: all warnings being treated as errors
make[1]: *** [Makefile:435: net/uip/csum.o] Error 1
make[1]: *** Waiting for unfinished jobs....
make[1]: Leaving directory '/<<PKGBUILDDIR>>'
dh_auto_build: error: make -j4 returned exit code 2
make: *** [debian/rules:3: build-arch] Error 25