Raspbian Package Auto-Building

Buildd status for kleborate (bullseye-staging)

Debian PTSTrackerChangelogBugspackages.d.obuildd.d.o

Package(s): Suite:
Compact mode Co-maintainers

ArchitectureVersionStatusForBuilddStateMiscLogs
Buildd exposure stats armhf  2.0.1-1Build-Attempted1d 1h 57mbm-wb-03uncompiledmisc:extraold | all (4)

Tail of log for kleborate on armhf:

======================================================================
FAIL: test_salmonella (test.test_species.TestSpecies)
----------------------------------------------------------------------
Traceback (most recent call last):
  File "/<<PKGBUILDDIR>>/.pybuild/cpython3_3.9/build/test/test_species.py", line 113, in test_salmonella
    self.assertTrue('Salmonella' in species)
AssertionError: False is not true

----------------------------------------------------------------------
Ran 190 tests in 1143.081s

FAILED (failures=19)
E: pybuild pybuild:353: test: plugin distutils failed with: exit code=1: cd /<<PKGBUILDDIR>>/.pybuild/cpython3_3.9/build; python3.9 -m unittest discover -v 
dh_auto_test: error: pybuild --test -i python{version} -p 3.9 returned exit code 13
make: *** [debian/rules:6: binary-arch] Error 25