Raspbian Package Auto-Building

Buildd status for kleborate (bookworm-staging)

Debian PTSTrackerChangelogBugspackages.d.obuildd.d.o

Package(s): Suite:
Compact mode Co-maintainers

ArchitectureVersionStatusForBuilddStateMiscLogs
Buildd exposure stats armhf  2.1.0-2Build-Attempted24d 5h 53mmb-lxc-02uncompiledmisc:extraold | all (1)

Tail of log for kleborate on armhf:

- unknown
+ Yersinia (unknown species)


----------------------------------------------------------------------
Ran 219 tests in 638.445s

FAILED (failures=20)
{'Sul_acquired': 'sul2^', 'Tet_acquired': '-', 'Bla_acquired': '-', 'Bla_inhR_acquired': '-', 'Bla_ESBL_acquired': '-', 'Bla_ESBL_inhR_acquired': '-', 'Bla_Carb_acquired': '-', 'Bla_chr': '-', 'SHV_mutations': '-', 'Omp_mutations': 'OmpK35-0%;OmpK36-0%', 'Col_mutations': 'MgrB-0%;PmrB-0%', 'Flq_mutations': '-', 'truncated_resistance_hits': '-', 'spurious_resistance_hits': '-'}
{'Sul_acquired': '-', 'Tet_acquired': '-', 'Bla_acquired': '-', 'Bla_inhR_acquired': '-', 'Bla_ESBL_acquired': '-', 'Bla_ESBL_inhR_acquired': '-', 'Bla_Carb_acquired': '-', 'Bla_chr': 'OKP-B-6^', 'SHV_mutations': '-', 'Omp_mutations': 'OmpK35-0%;OmpK36-0%', 'Col_mutations': 'MgrB-0%;PmrB-0%', 'Flq_mutations': '-', 'truncated_resistance_hits': '-', 'spurious_resistance_hits': '-'}
{'Sul_acquired': '-', 'Tet_acquired': '-', 'Bla_acquired': '-', 'Bla_inhR_acquired': '-', 'Bla_ESBL_acquired': '-', 'Bla_ESBL_inhR_acquired': '-', 'Bla_Carb_acquired': '-', 'Bla_chr': 'OKP-B-6^', 'SHV_mutations': '-', 'Omp_mutations': 'OmpK35-0%;OmpK36-0%', 'Col_mutations': 'MgrB-0%;PmrB-0%', 'Flq_mutations': '-', 'truncated_resistance_hits': '-', 'spurious_resistance_hits': '-'}
{'Sul_acquired': '-', 'Tet_acquired': '-', 'Bla_acquired': '-', 'Bla_inhR_acquired': '-', 'Bla_ESBL_acquired': '-', 'Bla_ESBL_inhR_acquired': '-', 'Bla_Carb_acquired': '-', 'Bla_chr': 'OKP-B-6^', 'SHV_mutations': '-', 'Omp_mutations': 'OmpK35-0%;OmpK36-0%', 'Col_mutations': 'MgrB-0%;PmrB-0%', 'Flq_mutations': '-', 'truncated_resistance_hits': '-', 'spurious_resistance_hits': '-'}
E: pybuild pybuild:353: test: plugin distutils failed with: exit code=1: cd /<<PKGBUILDDIR>>/.pybuild/cpython3_3.9/build; python3.9 -m unittest discover -v 
dh_auto_test: error: pybuild --test -i python{version} -p 3.9 returned exit code 13
make: *** [debian/rules:6: binary-arch] Error 25