Raspbian Package Auto-Building

Buildd status for kcontacts (bookworm-staging)

Debian PTSTrackerChangelogBugspackages.d.obuildd.d.o

Package(s): Suite:
Compact mode Co-maintainers

ArchitectureVersionStatusForBuilddStateMiscLogs
Buildd exposure stats armhf  5:5.88.0-1Build-Attempted63d 2h 25mmb-lxc-01out-of-datemisc:optionalold | all (2)

Tail of log for kcontacts on armhf:

31/31 Test #31: kcontacts-picturetest ..............   Passed    0.72 sec

97% tests passed, 1 tests failed out of 31

Total Test time (real) =  11.26 sec

The following tests FAILED:
	  6 - kcontacts-addresstest (Failed)
Errors while running CTest
make[2]: *** [Makefile:74: test] Error 8
make[2]: Leaving directory '/<<PKGBUILDDIR>>/obj-arm-linux-gnueabihf'
dh_auto_test: error: cd obj-arm-linux-gnueabihf && make -j1 test ARGS\+=--verbose ARGS\+=-j1 returned exit code 2
make[1]: *** [debian/rules:13: override_dh_auto_test] Error 25
make[1]: Leaving directory '/<<PKGBUILDDIR>>'
make: *** [debian/rules:7: binary-arch] Error 2