Raspbian Package Auto-Building

Buildd status for jscoverage (wheezy-staging)

Debian PTSTrackerChangelogBugspackages.d.obuildd.d.o

Package(s): Suite:
Compact mode Co-maintainers

ArchitectureVersionStatusForBuilddStateMiscLogs
Buildd exposure stats armhf  0.3.1-1Build-Attempted1401d 11h 48mbm-wb-01uncompileddevel:sourceold | all (5)

Tail of log for jscoverage on armhf:

ar cru .libs/libjs.a  src/jsapi.o src/jsarena.o src/jsarray.o src/jsatom.o src/jsbool.o src/jscntxt.o src/jsdate.o src/jsdbgapi.o src/jsdhash.o src/jsdtoa.o src/jsemit.o src/jsexn.o src/jsfile.o src/jsfun.o src/jsgc.o src/jshash.o src/jsinterp.o src/jslock.o src/jslog2.o src/jslong.o src/jsmath.o src/jsnum.o src/jsobj.o src/jsopcode.o src/jsparse.o src/jsprf.o src/jsregexp.o src/jsscan.o src/jsscope.o src/jsscript.o src/jsstr.o src/jsutil.o src/jsxdrapi.o src/jsxml.o src/prmjtime.o src/jsdso.o src/fdlibm/e_acos.o src/fdlibm/e_asin.o src/fdlibm/e_atan2.o src/fdlibm/e_exp.o src/fdlibm/e_fmod.o src/fdlibm/e_log.o src/fdlibm/e_pow.o src/fdlibm/e_rem_pio2.o src/fdlibm/s_scalbn.o src/fdlibm/e_sqrt.o src/fdlibm/k_cos.o src/fdlibm/k_sin.o src/fdlibm/k_rem_pio2.o src/fdlibm/k_tan.o src/fdlibm/s_atan.o src/fdlibm/s_ceil.o src/fdlibm/s_copysign.o src/fdlibm/s_cos.o src/fdlibm/s_fabs.o src/fdlibm/s_finite.o src/fdlibm/s_floor.o src/fdlibm/s_isnan.o src/fdlibm/s_lib_version.o src/fdlibm/s_sin.o src/fdlibm/s_tan.o src/fdlibm/w_acos.o src/fdlibm/w_asin.o src/fdlibm/w_atan2.o src/fdlibm/w_exp.o src/fdlibm/w_fmod.o src/fdlibm/w_log.o src/fdlibm/w_pow.o src/fdlibm/w_sqrt.o
ranlib .libs/libjs.a
creating libjs.la
(cd .libs && rm -f libjs.la && ln -s ../libjs.la libjs.la)
gcc -D_FORTIFY_SOURCE=2 -DOSSP -DXP_UNIX -DEXPORT_JS_API -DJS_HAS_FILE_OBJECT -DHAVE_CONFIG_H -Isrc  -O2 -fstack-protector --param=ssp-buffer-size=4 -Wformat -Werror=format-security -Wall -DNDEBUG -pipe  -o src/js.o -c src/js.c
src/js.c: In function 'GetLine':
src/js.c:163:9: error: format not a string literal and no format arguments [-Werror=format-security]
cc1: some warnings being treated as errors
make[3]: *** [src/js.o] Error 1
make[3]: Leaving directory `/<<PKGBUILDDIR>>/js'
make[2]: *** [all-recursive] Error 1
make[2]: Leaving directory `/<<PKGBUILDDIR>>'
make[1]: *** [all] Error 2
make[1]: Leaving directory `/<<PKGBUILDDIR>>'
make: *** [debian/stamp-makefile-build] Error 2