Raspbian Package Auto-Building

Buildd status for ivar (bullseye-staging)

Debian PTSTrackerChangelogBugspackages.d.obuildd.d.o

Package(s): Suite:
Compact mode Co-maintainers

ArchitectureVersionStatusForBuilddStateMiscLogs
Buildd exposure stats armhf  1.3+dfsg-1Build-Attempted9d 23h 54mmb-lxc-02uncompiledmisc:extraold | all (4)

Tail of log for ivar on armhf:

See tests/test-suite.log
Please report to gkarthik@scripps.edu
============================================================================
make[5]: *** [Makefile:904: test-suite.log] Error 1
make[5]: Leaving directory '/<<BUILDDIR>>/ivar-1.3+dfsg/tests'
make[4]: *** [Makefile:1012: check-TESTS] Error 2
make[4]: Leaving directory '/<<BUILDDIR>>/ivar-1.3+dfsg/tests'
make[3]: *** [Makefile:1205: check-am] Error 2
make[3]: Leaving directory '/<<BUILDDIR>>/ivar-1.3+dfsg/tests'
make[2]: *** [Makefile:362: check-recursive] Error 1
make[2]: Leaving directory '/<<BUILDDIR>>/ivar-1.3+dfsg'
dh_auto_test: error: make -j1 check VERBOSE=1 returned exit code 2
make[1]: *** [debian/rules:12: override_dh_auto_test] Error 25
make[1]: Leaving directory '/<<BUILDDIR>>/ivar-1.3+dfsg'
make: *** [debian/rules:9: binary-arch] Error 2