Raspbian Package Auto-Building

Buildd status for ivar (bookworm-staging)

Debian PTSTrackerChangelogBugspackages.d.obuildd.d.o

Package(s): Suite:
Compact mode Co-maintainers

ArchitectureVersionStatusForBuilddStateMiscLogs
Buildd exposure stats armhf  1.3.1+dfsg-4Build-Attempted24d 5h 30mtest2019uncompiledmisc:extraold | all (1)

Tail of log for ivar on armhf:

See tests/test-suite.log
Please report to gkarthik@scripps.edu
============================================================================
make[5]: *** [Makefile:913: test-suite.log] Error 1
make[5]: Leaving directory '/<<PKGBUILDDIR>>/tests'
make[4]: *** [Makefile:1021: check-TESTS] Error 2
make[4]: Leaving directory '/<<PKGBUILDDIR>>/tests'
make[3]: *** [Makefile:1213: check-am] Error 2
make[3]: Leaving directory '/<<PKGBUILDDIR>>/tests'
make[2]: *** [Makefile:371: check-recursive] Error 1
make[2]: Leaving directory '/<<PKGBUILDDIR>>'
dh_auto_test: error: make -j1 check VERBOSE=1 returned exit code 2
make[1]: *** [debian/rules:16: override_dh_auto_test] Error 25
make[1]: Leaving directory '/<<PKGBUILDDIR>>'
make: *** [debian/rules:12: binary-arch] Error 2