Raspbian Package Auto-Building

Buildd status for ismrmrd (buster-staging)

Debian PTSTrackerChangelogBugspackages.d.obuildd.d.o

Package(s): Suite:
Compact mode Co-maintainers

Buildd exposure stats armhf  1.4.0-1Maybe-Failed1542d 10h 37mtest2019uncompiledmisc:optionalold | all (13)

Tail of log for ismrmrd on armhf:

/<<PKGBUILDDIR>>/tests/test_acquisitions.cpp(7): Leaving test suite "AcquisitionsTest"; testing time: 23849us
Test is aborted
Leaving test module "ISMRMRD Unit Tests"; testing time: 24075us

*** 1 failure is detected in the test module "ISMRMRD Unit Tests"
make[4]: *** [tests/CMakeFiles/check.dir/build.make:60: tests/CMakeFiles/check] Error 201
make[4]: Leaving directory '/<<PKGBUILDDIR>>/obj-arm-linux-gnueabihf'
make[3]: *** [CMakeFiles/Makefile2:485: tests/CMakeFiles/check.dir/all] Error 2
make[3]: Leaving directory '/<<PKGBUILDDIR>>/obj-arm-linux-gnueabihf'
make[2]: *** [CMakeFiles/Makefile2:492: tests/CMakeFiles/check.dir/rule] Error 2
make[2]: Leaving directory '/<<PKGBUILDDIR>>/obj-arm-linux-gnueabihf'
make[1]: *** [Makefile:306: check] Error 2
make[1]: Leaving directory '/<<PKGBUILDDIR>>/obj-arm-linux-gnueabihf'
dh_auto_test: cd obj-arm-linux-gnueabihf && make -j4 check ARGS\+=-j4 returned exit code 2
make: *** [debian/rules:14: build-arch] Error 2