Raspbian Package Auto-Building

Buildd status for ismrmrd (bookworm-staging)

Debian PTSTrackerChangelogBugspackages.d.obuildd.d.o

Package(s): Suite:
Compact mode Co-maintainers

Buildd exposure stats armhf 8h 54mmb-lxc-01uncompiledmisc:optionalold | all (3)

Tail of log for ismrmrd on armhf:

./tests/test_acquisitions.cpp(7): Leaving test suite "AcquisitionsTest"
Test is aborted
Leaving test module "ISMRMRD Unit Tests"

*** 1 failure is detected in the test module "ISMRMRD Unit Tests"
make[4]: *** [tests/CMakeFiles/check.dir/build.make:79: tests/CMakeFiles/check] Error 201
make[4]: Leaving directory '/<<PKGBUILDDIR>>/obj-arm-linux-gnueabihf'
make[3]: *** [CMakeFiles/Makefile2:435: tests/CMakeFiles/check.dir/all] Error 2
make[3]: Leaving directory '/<<PKGBUILDDIR>>/obj-arm-linux-gnueabihf'
make[2]: *** [CMakeFiles/Makefile2:442: tests/CMakeFiles/check.dir/rule] Error 2
make[2]: Leaving directory '/<<PKGBUILDDIR>>/obj-arm-linux-gnueabihf'
make[1]: *** [Makefile:325: check] Error 2
make[1]: Leaving directory '/<<PKGBUILDDIR>>/obj-arm-linux-gnueabihf'
dh_auto_test: error: cd obj-arm-linux-gnueabihf && make -j4 check ARGS\+=--verbose ARGS\+=-j4 returned exit code 2
make: *** [debian/rules:14: binary-arch] Error 25