Raspbian Package Auto-Building

Buildd status for iem-plugin-suite (bullseye-staging)

Debian PTSTrackerChangelogBugspackages.d.obuildd.d.o

Package(s): Suite:
Compact mode Co-maintainers

ArchitectureVersionStatusForBuilddStateMiscLogs
Buildd exposure stats armhf  1.11.1-1Build-Attempted11h 30mtest2019uncompiledmisc:extraold | all (9)

Tail of log for iem-plugin-suite on armhf:

                 from ../../JuceLibraryCode/../JuceLibraryCode/JuceHeader.h:17,
                 from ../../../resources/Standalone/StandaloneApp.cpp:53:
/usr/share/juce/modules/juce_core/memory/juce_Atomic.h: In instantiation of ‘juce::Atomic<Type>::~Atomic() [with Type = bool]’:
../../JuceLibraryCode/../Source/../../resources/OSC/OSCUtilities.h:33:5:   required from here
/usr/share/juce/modules/juce_core/memory/juce_Atomic.h:58:43: error: static assertion failed: This class can only be used for lock-free types
   58 |         static_assert (std::atomic<Type>::is_always_lock_free,
      |                                           ^~~~~~~~~~~~~~~~~~~
make[3]: *** [Makefile:179: build/intermediate/Release/StandaloneApp_2a979640.o] Error 1
make[3]: Leaving directory '/<<PKGBUILDDIR>>/RoomEncoder/Builds/LinuxMakefile'
make[2]: *** [Makefile:125: RoomEncoder-LinuxMakefile-build] Error 2
make[2]: Leaving directory '/<<PKGBUILDDIR>>'
dh_auto_build: error: make -j1 "INSTALL=install --strip-program=true" returned exit code 2
make[1]: *** [debian/rules:42: override_dh_auto_build] Error 25
make[1]: Leaving directory '/<<PKGBUILDDIR>>'
make: *** [debian/rules:39: binary-arch] Error 2