Raspbian Package Auto-Building

Buildd status for icinga2 (bookworm-staging)

Debian PTSTrackerChangelogBugspackages.d.obuildd.d.o

Package(s): Suite:
Compact mode Co-maintainers

ArchitectureVersionStatusForBuilddStateMiscLogs
Buildd exposure stats armhf  2.13.1-1Build-Attempted30d 19h 42mmb-lxc-02uncompiledmisc:optionalold | all (3)

Tail of log for icinga2 on armhf:

                 from /<<PKGBUILDDIR>>/obj-arm-linux-gnueabihf/lib/base/configobject-ti.hpp:4,
                 from /<<PKGBUILDDIR>>/lib/base/configobject.hpp:7,
                 from /<<PKGBUILDDIR>>/lib/icinga/apiactions.hpp:7,
                 from /<<PKGBUILDDIR>>/lib/icinga/apiactions.cpp:3,
                 from /<<PKGBUILDDIR>>/obj-arm-linux-gnueabihf/lib/icinga/icinga_unity.cpp:1:
/usr/include/c++/10/bits/stl_vector.h:1198:21: note: parameter passing for argument of type '__gnu_cxx::__normal_iterator<icinga::Value*, std::vector<icinga::Value> >' changed in GCC 7.1
 1198 |    _M_realloc_insert(end(), __x);
      |    ~~~~~~~~~~~~~~~~~^~~~~~~~~~~~
make[3]: Leaving directory '/<<PKGBUILDDIR>>/obj-arm-linux-gnueabihf'
[ 54%] Built target icinga
make[2]: Leaving directory '/<<PKGBUILDDIR>>/obj-arm-linux-gnueabihf'
make[1]: *** [Makefile:185: all] Error 2
make[1]: Leaving directory '/<<PKGBUILDDIR>>/obj-arm-linux-gnueabihf'
dh_auto_build: error: cd obj-arm-linux-gnueabihf && make -j4 "INSTALL=install --strip-program=true" VERBOSE=1 returned exit code 2
make: *** [debian/rules:17: build-arch] Error 25