Raspbian Package Auto-Building

Buildd status for hyperspy (bullseye-staging)

Debian PTSTrackerChangelogBugspackages.d.obuildd.d.o

Package(s): Suite:
Compact mode Co-maintainers

ArchitectureVersionStatusForBuilddStateMiscLogs
Buildd exposure stats armhf  1.6.1-1Build-Attempted2d 10mtest2019uncompiledmisc:sourceold | all (3)

Tail of log for hyperspy on armhf:

SKIPPED [1] hyperspy/tests/signal/test_signal_operators.py:107: Inplace not supported by LazySignals
SKIPPED [1] hyperspy/tests/signal/test_signal_operators.py:118: Inplace not supported by LazySignals
XFAIL hyperspy/tests/drawing/test_utils.py::test_create_figure
  reason: agg backend does not support on_close event.
XFAIL hyperspy/tests/io/test_hdf5.py::TestLoadingNewSavedMetadata::test_binary_string
  dill is not guaranteed to load across Python versions
XPASS hyperspy/tests/samfire/test_samfire.py::test_multiprocessed Sometimes the number of failed pixels > 3 when using multiprocessing. Unknown reason
FAILED hyperspy/tests/misc/test_date_time_tools.py::test_serial_date_to_ISO_format
FAILED hyperspy/tests/misc/test_date_time_tools.py::test_ISO_format_to_serial_date
FAILED hyperspy/tests/misc/test_hist_tools.py::TestHistogramBinMethodsBadDataset::test_lazy_fd_logger_warning
FAILED hyperspy/tests/misc/test_hist_tools.py::TestHistogramBinMethodsBadDataset::test_lazy_deprecation_warnings[freedman]
= 4 failed, 3719 passed, 75 skipped, 2 xfailed, 1 xpassed, 74 warnings in 1461.26s (0:24:21) =
E: pybuild pybuild:353: test: plugin distutils failed with: exit code=1: cd /<<PKGBUILDDIR>>/.pybuild/cpython3_3.9_hyperspy/build; python3.9 -m pytest 
dh_auto_test: error: pybuild --test --test-pytest -i python{version} -p 3.9 returned exit code 13
make: *** [debian/rules:9: build-arch] Error 25