Raspbian Package Auto-Building

Buildd status for gtkterm (wheezy-staging)

Debian PTSTrackerChangelogBugspackages.d.obuildd.d.o

Package(s): Suite:
Compact mode Co-maintainers

ArchitectureVersionStatusForBuilddStateMiscLogs
Buildd exposure stats armhf  0.99.5-1Build-Attempted1401d 11h 21mbm-wb-01uncompiledcomm:sourceold | all (5)

Tail of log for gtkterm on armhf:

make[3]: Entering directory `/<<PKGBUILDDIR>>/m4'
make[3]: Nothing to be done for `all'.
make[3]: Leaving directory `/<<PKGBUILDDIR>>/m4'
Making all in src
make[3]: Entering directory `/<<PKGBUILDDIR>>/src'
gcc -DHAVE_CONFIG_H -I. -I. -I..   -D_FORTIFY_SOURCE=2 -pthread -I/usr/include/gtk-2.0 -I/usr/lib/arm-linux-gnueabihf/gtk-2.0/include -I/usr/include/atk-1.0 -I/usr/include/cairo -I/usr/include/gdk-pixbuf-2.0 -I/usr/include/pango-1.0 -I/usr/include/gio-unix-2.0/ -I/usr/include/glib-2.0 -I/usr/lib/arm-linux-gnueabihf/glib-2.0/include -I/usr/include/pixman-1 -I/usr/include/freetype2 -I/usr/include/libpng12   -Wall -DLOCALEDIR=\""/usr/share/locale"\" -g -O2 -fstack-protector --param=ssp-buffer-size=4 -Wformat -Werror=format-security -Wall -c `test -f 'config.c' || echo './'`config.c
config.c:38:21: fatal error: vte/vte.h: No such file or directory
compilation terminated.
make[3]: *** [config.o] Error 1
make[3]: Leaving directory `/<<PKGBUILDDIR>>/src'
make[2]: *** [all-recursive] Error 1
make[2]: Leaving directory `/<<PKGBUILDDIR>>'
make[1]: *** [all] Error 2
make[1]: Leaving directory `/<<PKGBUILDDIR>>'
make: *** [debian/stamp-makefile-build] Error 2