Raspbian Package Auto-Building

Buildd status for gammapy (bullseye-staging)

Debian PTSTrackerChangelogBugspackages.d.obuildd.d.o

Package(s): Suite:
Compact mode Co-maintainers

ArchitectureVersionStatusForBuilddStateMiscLogs
Buildd exposure stats armhf  0.17-2Build-Attempted8d 5h 14mbm-wb-03uncompiledmisc:extraold | all (6)

Tail of log for gammapy on armhf:

FAILED gammapy/maps/tests/test_base.py::test_map_copy[0.1-10.0-hpx-skydir2-axes2-]
FAILED gammapy/maps/tests/test_base.py::test_map_copy[0.1-10.0-hpx-skydir3-axes3-s^2]
FAILED gammapy/maps/tests/test_base.py::test_map_get_image_by_coord[0.1-10.0-hpx-skydir2-axes2-]
FAILED gammapy/maps/tests/test_base.py::test_map_get_image_by_coord[0.1-10.0-hpx-skydir3-axes3-s^2]
FAILED gammapy/maps/tests/test_base.py::test_map_get_image_by_pix[0.1-10.0-hpx-skydir2-axes2-]
FAILED gammapy/maps/tests/test_base.py::test_map_get_image_by_pix[0.1-10.0-hpx-skydir3-axes3-s^2]
FAILED gammapy/maps/tests/test_base.py::test_map_slice_by_idx[0.1-10.0-hpx-skydir2-axes2-]
FAILED gammapy/maps/tests/test_base.py::test_map_slice_by_idx[0.1-10.0-hpx-skydir3-axes3-s^2]
FAILED gammapy/maps/tests/test_base.py::test_map_meta_read_write[hpx] - numpy...
FAILED gammapy/maps/tests/test_hpxmap.py::test_plot - ValueError: negative di...
FAILED gammapy/maps/tests/test_hpxmap.py::test_plot_poly - ValueError: negati...
= 13 failed, 1043 passed, 447 skipped, 3 xfailed, 2 xpassed in 1096.63s (0:18:16) =
E: pybuild pybuild:353: test: plugin distutils failed with: exit code=1: cd /<<PKGBUILDDIR>>/.pybuild/cpython3_3.9_gammapy/build; python3.9 -m pytest 
dh_auto_test: error: pybuild --test --test-pytest -i python{version} -p 3.9 returned exit code 13
make: *** [debian/rules:9: build-arch] Error 25