Raspbian Package Auto-Building

Buildd status for gammapy (bookworm-staging)

Debian PTSTrackerChangelogBugspackages.d.obuildd.d.o

Package(s): Suite:
Compact mode Co-maintainers

ArchitectureVersionStatusForBuilddStateMiscLogs
Buildd exposure stats armhf  0.18.2-1Build-Attempted30d 15h 1mmb-lxc-01uncompiledmisc:extraold | all (3)

Tail of log for gammapy on armhf:

FAILED gammapy/maps/tests/test_base.py::test_map_copy[0.1-10.0-hpx-skydir3-axes3-s^2]
FAILED gammapy/maps/tests/test_base.py::test_map_from_geom - numpy.core._exce...
FAILED gammapy/maps/tests/test_base.py::test_map_get_image_by_coord[0.1-10.0-hpx-skydir2-axes2-]
FAILED gammapy/maps/tests/test_base.py::test_map_get_image_by_coord[0.1-10.0-hpx-skydir3-axes3-s^2]
FAILED gammapy/maps/tests/test_base.py::test_map_get_image_by_pix[0.1-10.0-hpx-skydir2-axes2-]
FAILED gammapy/maps/tests/test_base.py::test_map_get_image_by_pix[0.1-10.0-hpx-skydir3-axes3-s^2]
FAILED gammapy/maps/tests/test_base.py::test_map_slice_by_idx[0.1-10.0-hpx-skydir2-axes2-]
FAILED gammapy/maps/tests/test_base.py::test_map_slice_by_idx[0.1-10.0-hpx-skydir3-axes3-s^2]
FAILED gammapy/maps/tests/test_base.py::test_interp_to_geom - ValueError: neg...
FAILED gammapy/maps/tests/test_hpxmap.py::test_plot - ValueError: negative di...
FAILED gammapy/maps/tests/test_hpxmap.py::test_plot_poly - ValueError: negati...
= 14 failed, 1153 passed, 479 skipped, 2 xfailed, 3 xpassed in 470.99s (0:07:50) =
E: pybuild pybuild:353: test: plugin distutils failed with: exit code=1: cd /<<PKGBUILDDIR>>/.pybuild/cpython3_3.9_gammapy/build; python3.9 -m pytest 
dh_auto_test: error: pybuild --test --test-pytest -i python{version} -p 3.9 returned exit code 13
make: *** [debian/rules:9: binary-arch] Error 25