Raspbian Package Auto-Building

Buildd status for selected packages (bullseye-staging)

Bugs

Package(s): Suite:
Compact mode Co-maintainers

Package armhf
Buildd exposure stats
✘ fstl  Build-Attempted
✘ swt4-gtk  Build-Attempted
✔ gpacInstalled
✔ numcodecsInstalled
✔ python-crc32cInstalled
✔ appstream-generatorBuild-Attempted
✔ haskell-protobufBuild-Attempted
✔ icinga2Build-Attempted
✔ libundeadBuild-Attempted
✔ quorumBuild-Attempted
✔ rocksdbBuild-Attempted
✔ gfccoreBuild-Attempted
✔ acoveaBuild-Attempted
✔ ocamlgslBuild-Attempted
✔ badgerBuild-Attempted
✔ cclsBuild-Attempted
✔ criuBuild-Attempted
✔ debimanBuild-Attempted
✔ dengBuild-Attempted
Package armhf
Buildd exposure stats
✔ gjh-asl-jsonBuild-Attempted
✔ glooBuild-Attempted
✔ haskell-ghc-lib-parser-exBuild-Attempted
✔ haskell-pretty-simpleBuild-Attempted
✔ ivarBuild-Attempted
✔ libbiodBuild-Attempted
✔ libretro-mupen64plusBuild-Attempted
✔ listallerBuild-Attempted
✔ octave-tiseanBuild-Attempted
✔ perftestBuild-Attempted
✔ postgresql-numeralBuild-Attempted
✔ kodiBuild-Attempted

Tail of log for fstl on armhf:

      |                                        ^
In file included from /usr/include/arm-linux-gnueabihf/qt5/QtGui/QMouseEvent:1,
                 from /<<PKGBUILDDIR>>/src/canvas.cpp:1:
/usr/include/arm-linux-gnueabihf/qt5/QtGui/qevent.h:219:16: note: declared here
  219 |     inline int delta() const  { return qt4D; }
      |                ^~~~~
make[3]: *** [CMakeFiles/fstl.dir/build.make:141: CMakeFiles/fstl.dir/src/canvas.cpp.o] Error 1
make[3]: *** Waiting for unfinished jobs....
make[3]: Leaving directory '/<<PKGBUILDDIR>>/obj-arm-linux-gnueabihf'
make[2]: *** [CMakeFiles/Makefile2:99: CMakeFiles/fstl.dir/all] Error 2
make[2]: Leaving directory '/<<PKGBUILDDIR>>/obj-arm-linux-gnueabihf'
make[1]: *** [Makefile:174: all] Error 2
make[1]: Leaving directory '/<<PKGBUILDDIR>>/obj-arm-linux-gnueabihf'
dh_auto_build: error: cd obj-arm-linux-gnueabihf && make -j4 "INSTALL=install --strip-program=true" VERBOSE=1 returned exit code 2
make: *** [debian/rules:9: binary-arch] Error 25

Tail of log for swt4-gtk on armhf:

    [javac]  *     Christoph L??ubrich - Bug 513185
    [javac]                   ^
    [javac] /<<PKGBUILDDIR>>/bundles/org.eclipse.swt/temp.folder/@dot.src/org/eclipse/swt/layout/FillLayout.java:13: error: unmappable character (0xA4) for encoding US-ASCII
    [javac]  *     Christoph L??ubrich - Bug 513185
    [javac]                    ^
    [javac] 2 errors

BUILD FAILED
/<<PKGBUILDDIR>>/bundles/org.eclipse.swt/buildFragment.xml:88: The following error occurred while executing this line:
/<<PKGBUILDDIR>>/bundles/org.eclipse.swt/buildFragment.xml:61: Compile failed; see the compiler error output for details.

Total time: 11 seconds
make[1]: *** [debian/rules:30: override_dh_auto_build] Error 1
make[1]: Leaving directory '/<<PKGBUILDDIR>>'
make: *** [debian/rules:27: binary-arch] Error 2

Tail of log for appstream-generator on armhf:

FAILED: src/asgen/appstream-generator.p/datastore.d.o 
gdc -Isrc/asgen/appstream-generator.p -Isrc/asgen -I../src/asgen -Isrc -I../src -Igirepo -I../girepo -I/usr/include/d/glibd-2 -I/usr/include/libmount -I/usr/include/blkid -I/usr/include/glib-2.0 -I/usr/lib/arm-linux-gnueabihf/glib-2.0/include -I/usr/include/appstream -I/usr/include/appstream-compose -I/usr/include/gdk-pixbuf-2.0 -I/usr/include/arm-linux-gnueabihf -Wall -Wdeprecated -g -O2 -ffile-prefix-map=/<<PKGBUILDDIR>>=. -fstack-protector-strong -frelease -pthread -pthread -pthread -J../src/asgen/../../data -MD -MQ src/asgen/appstream-generator.p/datastore.d.o -MF src/asgen/appstream-generator.p/datastore.d.o.deps -o src/asgen/appstream-generator.p/datastore.d.o -c ../src/asgen/datastore.d
../src/asgen/datastore.d:698:38: error: undefined identifier ‘JSONType’
  698 |             if (existingJson.type == JSONType.array) {
      |                                      ^
[54/144] gdc -Isrc/asgen/appstream-generator.p -Isrc/asgen -I../src/asgen -Isrc -I../src -Igirepo -I../girepo -I/usr/include/d/glibd-2 -I/usr/include/libmount -I/usr/include/blkid -I/usr/include/glib-2.0 -I/usr/lib/arm-linux-gnueabihf/glib-2.0/include -I/usr/include/appstream -I/usr/include/appstream-compose -I/usr/include/gdk-pixbuf-2.0 -I/usr/include/arm-linux-gnueabihf -Wall -Wdeprecated -g -O2 -ffile-prefix-map=/<<PKGBUILDDIR>>=. -fstack-protector-strong -frelease -pthread -pthread -pthread -J../src/asgen/../../data -MD -MQ src/asgen/appstream-generator.p/downloader.d.o -MF src/asgen/appstream-generator.p/downloader.d.o.deps -o src/asgen/appstream-generator.p/downloader.d.o -c ../src/asgen/downloader.d
FAILED: src/asgen/appstream-generator.p/downloader.d.o 
gdc -Isrc/asgen/appstream-generator.p -Isrc/asgen -I../src/asgen -Isrc -I../src -Igirepo -I../girepo -I/usr/include/d/glibd-2 -I/usr/include/libmount -I/usr/include/blkid -I/usr/include/glib-2.0 -I/usr/lib/arm-linux-gnueabihf/glib-2.0/include -I/usr/include/appstream -I/usr/include/appstream-compose -I/usr/include/gdk-pixbuf-2.0 -I/usr/include/arm-linux-gnueabihf -Wall -Wdeprecated -g -O2 -ffile-prefix-map=/<<PKGBUILDDIR>>=. -fstack-protector-strong -frelease -pthread -pthread -pthread -J../src/asgen/../../data -MD -MQ src/asgen/appstream-generator.p/downloader.d.o -MF src/asgen/appstream-generator.p/downloader.d.o.deps -o src/asgen/appstream-generator.p/downloader.d.o -c ../src/asgen/downloader.d
../src/asgen/downloader.d:151:47: error: no property 'message' for type 'object.Exception'
  151 |                 throw new DownloadException (e.message.to!string);
      |                                               ^
[55/144] gdc -Isrc/asgen/appstream-generator.p -Isrc/asgen -I../src/asgen -Isrc -I../src -Igirepo -I../girepo -I/usr/include/d/glibd-2 -I/usr/include/libmount -I/usr/include/blkid -I/usr/include/glib-2.0 -I/usr/lib/arm-linux-gnueabihf/glib-2.0/include -I/usr/include/appstream -I/usr/include/appstream-compose -I/usr/include/gdk-pixbuf-2.0 -I/usr/include/arm-linux-gnueabihf -Wall -Wdeprecated -g -O2 -ffile-prefix-map=/<<PKGBUILDDIR>>=. -fstack-protector-strong -frelease -pthread -pthread -pthread -J../src/asgen/../../data -MD -MQ src/asgen/appstream-generator.p/.._app.d.o -MF src/asgen/appstream-generator.p/.._app.d.o.deps -o src/asgen/appstream-generator.p/.._app.d.o -c ../src/app.d
ninja: build stopped: subcommand failed.
dh_auto_build: error: cd obj-arm-linux-gnueabihf && LC_ALL=C.UTF-8 ninja -j4 -v returned exit code 1
make: *** [debian/rules:18: binary-arch] Error 25

Tail of log for haskell-protobuf on armhf:

    sint64:                                      OK
      +++ OK, passed 100 tests (100% prop_wire :: Signed Int64).
    fixed32:                                     OK
      +++ OK, passed 100 tests (100% prop_wire :: Fixed Word32).
    fixed64:                                     OK
      +++ OK, passed 100 tests (100% prop_wire :: Fixed Word64).
    sfixed32:                                    OK
      +++ OK, passed 100 tests (100% prop_wire :: Fixed Int32).
    sfixed64:                                    OK
      +++ OK, passed 100 tests (100% prop_wire :: Fixed Int64).
    float:                                       protobuf-test: too many pending signals
Test suite protobuf-test: FAIL
Test suite logged to: dist-ghc/test/protobuf-0.2.1.3-protobuf-test.log
0 of 1 test suites (0 of 1 test cases) passed.
make: *** [/usr/share/cdbs/1/class/hlibrary.mk:154: check-ghc-stamp] Error 1

Tail of log for icinga2 on armhf:

      |     ^
/<<PKGBUILDDIR>>/lib/icinga/timeperiod.cpp:147:5: note: parameter passing for argument of type 'std::initializer_list<std::pair<const icinga::String, icinga::Value> >' changed in GCC 7.1
  147 |    }));
      |     ^
/<<PKGBUILDDIR>>/lib/icinga/timeperiod.cpp: In member function 'void icinga::TimePeriod::AddSegment(double, double)':
/<<PKGBUILDDIR>>/lib/icinga/timeperiod.cpp:87:3: note: parameter passing for argument of type 'std::initializer_list<std::pair<const icinga::String, icinga::Value> >' changed in GCC 7.1
   87 |  });
      |   ^
make[3]: Leaving directory '/<<PKGBUILDDIR>>/obj-arm-linux-gnueabihf'
[ 56%] Built target icinga
make[2]: Leaving directory '/<<PKGBUILDDIR>>/obj-arm-linux-gnueabihf'
make[1]: *** [Makefile:185: all] Error 2
make[1]: Leaving directory '/<<PKGBUILDDIR>>/obj-arm-linux-gnueabihf'
dh_auto_build: error: cd obj-arm-linux-gnueabihf && make -j4 "INSTALL=install --strip-program=true" VERBOSE=1 returned exit code 2
make: *** [debian/rules:18: build-arch] Error 25

Tail of log for libundead on armhf:

/<<PKGBUILDDIR>>/src/undead/stream.d:1222:16: error: generic thunk code fails for method ‘_DT12_D6undead6stream6Stream6writefMFYC6undead6stream12OutputStream’ which uses ‘...’
 1222 |   OutputStream writef(...) {
      |                ^
/<<PKGBUILDDIR>>/src/undead/stream.d:1207:10: error: generic thunk code fails for method ‘_DT12_D6undead6stream6Stream6printfMFAxaYk’ which uses ‘...’
 1207 |   size_t printf(const(char)[] format, ...) {
      |          ^
/<<PKGBUILDDIR>>/src/undead/stream.d:1069:7: error: generic thunk code fails for method ‘_DT8_D6undead6stream6Stream5readfMFYi’ which uses ‘...’
 1069 |   int readf(...) {
      |       ^
[3/29] gdc -Ilibundead.so.1.0.7.p -I. -I.. -I../src -Wall -Wdeprecated -g -O2 -ffile-prefix-map=/<<PKGBUILDDIR>>=. -fstack-protector-strong -frelease -fPIC -MD -MQ libundead.so.1.0.7.p/src_undead_bitarray.d.o -MF libundead.so.1.0.7.p/src_undead_bitarray.d.o.deps -o libundead.so.1.0.7.p/src_undead_bitarray.d.o -c ../src/undead/bitarray.d
[4/29] gdc -Ilibundead.so.1.0.7.p -I. -I.. -I../src -Wall -Wdeprecated -g -O2 -ffile-prefix-map=/<<PKGBUILDDIR>>=. -fstack-protector-strong -frelease -fPIC -MD -MQ libundead.so.1.0.7.p/src_undead_dateparse.d.o -MF libundead.so.1.0.7.p/src_undead_dateparse.d.o.deps -o libundead.so.1.0.7.p/src_undead_dateparse.d.o -c ../src/undead/dateparse.d
[5/29] gdc -Ilibundead.so.1.0.7.p -I. -I.. -I../src -Wall -Wdeprecated -g -O2 -ffile-prefix-map=/<<PKGBUILDDIR>>=. -fstack-protector-strong -frelease -fPIC -MD -MQ libundead.so.1.0.7.p/src_undead_date.d.o -MF libundead.so.1.0.7.p/src_undead_date.d.o.deps -o libundead.so.1.0.7.p/src_undead_date.d.o -c ../src/undead/date.d
ninja: build stopped: subcommand failed.
dh_auto_build: error: cd obj-arm-linux-gnueabihf && LC_ALL=C.UTF-8 ninja -j4 -v returned exit code 1
make: *** [debian/rules:9: build-arch] Error 25

Tail of log for quorum on armhf:

/usr/include/c++/10/bits/stl_algo.h:3474:5: note: candidate: 'template<class _Tp, class _Compare> _Tp std::min(std::initializer_list<_Tp>, _Compare)'
 3474 |     min(initializer_list<_Tp> __l, _Compare __comp)
      |     ^~~
/usr/include/c++/10/bits/stl_algo.h:3474:5: note:   template argument deduction/substitution failed:
src/histo_mer_database.cc:19:55: note:   mismatched types 'std::initializer_list<_Tp>' and 'long long unsigned int'
   19 |     const uint64_t val = std::min(vals.first, hlen - 1);
      |                                                       ^
make[3]: *** [Makefile:973: src/histo_mer_database.o] Error 1
make[3]: Leaving directory '/<<PKGBUILDDIR>>'
make[2]: *** [Makefile:1445: check-am] Error 2
make[2]: Leaving directory '/<<PKGBUILDDIR>>'
make[1]: *** [Makefile:1448: check] Error 2
make[1]: Leaving directory '/<<PKGBUILDDIR>>'
dh_auto_test: error: make -j1 check VERBOSE=1 returned exit code 2
make: *** [debian/rules:12: binary-arch] Error 25

Tail of log for rocksdb on armhf:

/usr/include/c++/10/bits/vector.tcc: In member function 'void std::vector<_Tp, _Alloc>::_M_realloc_insert(std::vector<_Tp, _Alloc>::iterator, _Args&& ...) [with _Args = {rocksdb::DBOptions, rocksdb::ColumnFamilyOptions&}; _Tp = rocksdb::Options; _Alloc = std::allocator<rocksdb::Options>]':
/usr/include/c++/10/bits/vector.tcc:426:7: note: parameter passing for argument of type 'std::vector<rocksdb::Options>::iterator' changed in GCC 7.1
/usr/include/c++/10/bits/vector.tcc: In member function 'void std::vector<_Tp, _Alloc>::emplace_back(_Args&& ...) [with _Args = {rocksdb::DBOptions, rocksdb::ColumnFamilyOptions&}; _Tp = rocksdb::Options; _Alloc = std::allocator<rocksdb::Options>]':
/usr/include/c++/10/bits/vector.tcc:121:21: note: parameter passing for argument of type '__gnu_cxx::__normal_iterator<rocksdb::Options*, std::vector<rocksdb::Options> >' changed in GCC 7.1
  121 |    _M_realloc_insert(end(), std::forward<_Args>(__args)...);
      |    ~~~~~~~~~~~~~~~~~^~~~~~~~~~~~~~~~~~~~~~~~~~~~~~~~~~~~~~~
/usr/include/c++/10/bits/vector.tcc: In member function 'virtual void rocksdb::DBCompactionTestWithParam_LevelCompactionCFPathUse_Test::TestBody()':
/usr/include/c++/10/bits/vector.tcc:121:21: note: parameter passing for argument of type '__gnu_cxx::__normal_iterator<rocksdb::Options*, std::vector<rocksdb::Options> >' changed in GCC 7.1
  121 |    _M_realloc_insert(end(), std::forward<_Args>(__args)...);
      |    ~~~~~~~~~~~~~~~~~^~~~~~~~~~~~~~~~~~~~~~~~~~~~~~~~~~~~~~~
make[2]: Leaving directory '/<<PKGBUILDDIR>>'
dh_auto_build: error: make -j4 "INSTALL=install --strip-program=true" all returned exit code 2
make[1]: *** [debian/rules:19: override_dh_auto_build] Error 25
make[1]: Leaving directory '/<<PKGBUILDDIR>>'
make: *** [debian/rules:29: build-arch] Error 2

Tail of log for gfccore on armhf:

set -e;    
make[1]: Leaving directory '/<<PKGBUILDDIR>>'
if [ "reverse-patches" = "reverse-patches" ]; then rm -f debian/stamp-patched; fi
patches: 
if [ "reverse-patches" != "reverse-patches" ]; then touch debian/stamp-patched; fi
if [ "reverse-patches" != "reverse-patches" ] ; then \
	/usr/bin/make -f debian/rules update-config ; \
fi
for dir in debian/patches ; do \
    rm -f $dir/*.log ; \
done
set -e;    
dh_clean 
dh_clean: error: Compatibility levels before 5 are no longer supported (level 4 requested)
make: *** [/usr/share/cdbs/1/rules/debhelper.mk:211: clean] Error 25

Tail of log for acovea on armhf:

 fakeroot debian/rules clean
dh_testdir
dh_testroot
rm -f build-stamp 
# Add here commands to clean up after the build process.
/usr/bin/make distclean
make[1]: Entering directory '/<<PKGBUILDDIR>>'
make[1]: *** No rule to make target 'distclean'.  Stop.
make[1]: Leaving directory '/<<PKGBUILDDIR>>'
make: [debian/rules:49: clean] Error 2 (ignored)
cp -f /usr/share/misc/config.sub config.sub
cp -f /usr/share/misc/config.guess config.guess
dh_clean 
dh_clean: error: Compatibility levels before 5 are no longer supported (level 4 requested)
make: *** [debian/rules:52: clean] Error 25

Tail of log for ocamlgsl on armhf:

arm-linux-gnueabihf-gcc src/mlgsl_roots.o (exit 1)
(cd _build/default/src && /usr/bin/arm-linux-gnueabihf-gcc -O2 -fno-strict-aliasing -fwrapv -fPIC -D_FILE_OFFSET_BITS=64 -D_REENTRANT -O2 -fno-strict-aliasing -fwrapv -fPIC -fPIC -DPIC -Wno-unused-parameter -g -I /usr/lib/ocaml -o mlgsl_roots.o -c mlgsl_roots.c)
In file included from mlgsl_roots.c:11:
wrappers.h:13:2: error: #error "Architectures with double-word alignment for doubles are not supported"
   13 | #error "Architectures with double-word alignment for doubles are not supported"
      |  ^~~~~
arm-linux-gnueabihf-gcc src/mlgsl_cdf.o (exit 1)
(cd _build/default/src && /usr/bin/arm-linux-gnueabihf-gcc -O2 -fno-strict-aliasing -fwrapv -fPIC -D_FILE_OFFSET_BITS=64 -D_REENTRANT -O2 -fno-strict-aliasing -fwrapv -fPIC -fPIC -DPIC -Wno-unused-parameter -g -I /usr/lib/ocaml -o mlgsl_cdf.o -c mlgsl_cdf.c)
In file included from mlgsl_cdf.c:2:
wrappers.h:13:2: error: #error "Architectures with double-word alignment for doubles are not supported"
   13 | #error "Architectures with double-word alignment for doubles are not supported"
      |  ^~~~~
make[1]: *** [debian/rules:11: override_dh_auto_build] Error 1
make[1]: Leaving directory '/<<PKGBUILDDIR>>'
make: *** [debian/rules:8: binary-arch] Error 2

Tail of log for badger on armhf:

net/http/httptrace
net/http
runtime/trace
github.com/spf13/cobra
expvar
golang.org/x/net/trace
net/http/pprof
github.com/dgraph-io/badger/y
github.com/dgraph-io/badger/skl
github.com/dgraph-io/badger/table
github.com/dgraph-io/badger
# github.com/dgraph-io/badger
src/github.com/dgraph-io/badger/value.go:50:5: constant 4294967295 overflows int
dh_auto_build: error: cd obj-arm-linux-gnueabihf && go install -trimpath -v -p 4 github.com/dgraph-io/badger/badger github.com/dgraph-io/badger/badger/cmd github.com/dgraph-io/badger/integration/testgc github.com/dgraph-io/badger/options github.com/dgraph-io/badger/pb github.com/dgraph-io/badger/skl github.com/dgraph-io/badger/table github.com/dgraph-io/badger/trie github.com/dgraph-io/badger/y returned exit code 2
make: *** [debian/rules:7: binary-arch] Error 25

Tail of log for ccls on armhf:

      |  ~~~~~~~~~~~~~~~~~~~~~^~~~~~~~~~~~~~~~~~~~~~~~~
[100%] Linking CXX executable ccls
/usr/bin/cmake -E cmake_link_script CMakeFiles/ccls.dir/link.txt --verbose=1
/usr/bin/c++ -g -O2 -ffile-prefix-map=/<<PKGBUILDDIR>>=. -fstack-protector-strong -Wformat -Werror=format-security -Wdate-time -D_FORTIFY_SOURCE=2 -Wl,-z,relro -Wl,-z,now CMakeFiles/ccls.dir/third_party/siphash.cc.o CMakeFiles/ccls.dir/src/clang_tu.cc.o CMakeFiles/ccls.dir/src/config.cc.o CMakeFiles/ccls.dir/src/filesystem.cc.o CMakeFiles/ccls.dir/src/fuzzy_match.cc.o CMakeFiles/ccls.dir/src/main.cc.o CMakeFiles/ccls.dir/src/include_complete.cc.o CMakeFiles/ccls.dir/src/indexer.cc.o CMakeFiles/ccls.dir/src/log.cc.o CMakeFiles/ccls.dir/src/lsp.cc.o CMakeFiles/ccls.dir/src/message_handler.cc.o CMakeFiles/ccls.dir/src/pipeline.cc.o CMakeFiles/ccls.dir/src/platform_posix.cc.o CMakeFiles/ccls.dir/src/platform_win.cc.o CMakeFiles/ccls.dir/src/position.cc.o CMakeFiles/ccls.dir/src/project.cc.o CMakeFiles/ccls.dir/src/query.cc.o CMakeFiles/ccls.dir/src/sema_manager.cc.o CMakeFiles/ccls.dir/src/serializer.cc.o CMakeFiles/ccls.dir/src/test.cc.o CMakeFiles/ccls.dir/src/utils.cc.o CMakeFiles/ccls.dir/src/working_files.cc.o CMakeFiles/ccls.dir/src/messages/ccls_call.cc.o CMakeFiles/ccls.dir/src/messages/ccls_info.cc.o CMakeFiles/ccls.dir/src/messages/ccls_inheritance.cc.o CMakeFiles/ccls.dir/src/messages/ccls_member.cc.o CMakeFiles/ccls.dir/src/messages/ccls_navigate.cc.o CMakeFiles/ccls.dir/src/messages/ccls_reload.cc.o CMakeFiles/ccls.dir/src/messages/ccls_vars.cc.o CMakeFiles/ccls.dir/src/messages/initialize.cc.o CMakeFiles/ccls.dir/src/messages/textDocument_code.cc.o CMakeFiles/ccls.dir/src/messages/textDocument_completion.cc.o CMakeFiles/ccls.dir/src/messages/textDocument_definition.cc.o CMakeFiles/ccls.dir/src/messages/textDocument_did.cc.o CMakeFiles/ccls.dir/src/messages/textDocument_foldingRange.cc.o CMakeFiles/ccls.dir/src/messages/textDocument_formatting.cc.o CMakeFiles/ccls.dir/src/messages/textDocument_document.cc.o CMakeFiles/ccls.dir/src/messages/textDocument_hover.cc.o CMakeFiles/ccls.dir/src/messages/textDocument_references.cc.o CMakeFiles/ccls.dir/src/messages/textDocument_rename.cc.o CMakeFiles/ccls.dir/src/messages/textDocument_signatureHelp.cc.o CMakeFiles/ccls.dir/src/messages/workspace.cc.o -o ccls  -Wl,-rpath,/usr/lib/llvm-11/lib: /usr/lib/llvm-11/lib/libclang-cpp.so.11 /usr/lib/llvm-11/lib/libLLVM-11.so.1 -pthread 
/usr/bin/ld: CMakeFiles/ccls.dir/src/pipeline.cc.o: undefined reference to symbol '__atomic_load_8@@LIBATOMIC_1.0'
/usr/bin/ld: /usr/lib/arm-linux-gnueabihf/libatomic.so.1: error adding symbols: DSO missing from command line
collect2: error: ld returned 1 exit status
make[3]: *** [CMakeFiles/ccls.dir/build.make:723: ccls] Error 1
make[3]: Leaving directory '/<<PKGBUILDDIR>>/obj-arm-linux-gnueabihf'
make[2]: *** [CMakeFiles/Makefile2:210: CMakeFiles/ccls.dir/all] Error 2
make[2]: Leaving directory '/<<PKGBUILDDIR>>/obj-arm-linux-gnueabihf'
make[1]: *** [Makefile:152: all] Error 2
make[1]: Leaving directory '/<<PKGBUILDDIR>>/obj-arm-linux-gnueabihf'
dh_auto_build: error: cd obj-arm-linux-gnueabihf && make -j4 "INSTALL=install --strip-program=true" VERBOSE=1 returned exit code 2
make: *** [debian/rules:15: binary-arch] Error 25

Tail of log for criu on armhf:

arch/arm/include/asm/atomic.h: At top level:
arch/arm/include/asm/atomic.h:60:2: error: #error ARM architecture version (CONFIG_ARMV*) not set or unsupported.
   60 | #error ARM architecture version (CONFIG_ARMV*) not set or unsupported.
      |  ^~~~~
arch/arm/include/asm/atomic.h: In function 'atomic_add_return':
arch/arm/include/asm/atomic.h:81:2: error: implicit declaration of function 'smp_mb' [-Werror=implicit-function-declaration]
   81 |  smp_mb();
      |  ^~~~~~
cc1: all warnings being treated as errors
make[2]: *** [scripts/Makefile.build:185: arch/arm/crtools.o] Error 1
make[2]: Leaving directory '/<<PKGBUILDDIR>>'
make[1]: *** [Makefile:208: arch/arm] Error 2
make[1]: Leaving directory '/<<PKGBUILDDIR>>'
dh_auto_build: error: make -j4 returned exit code 2
make: *** [debian/rules:6: build-arch] Error 25

Tail of log for debiman on armhf:

--- PASS: TestCronSection (0.00s)
    --- PASS: TestCronSection/cron (0.00s)
PASS
ok  	github.com/Debian/debiman/internal/redirect	0.018s
=== RUN   TestSitemap
--- PASS: TestSitemap (0.00s)
=== RUN   TestSitemapIndex
--- PASS: TestSitemapIndex (0.00s)
PASS
ok  	github.com/Debian/debiman/internal/sitemap	0.006s
?   	github.com/Debian/debiman/internal/tag	[no test files]
?   	github.com/Debian/debiman/internal/write	[no test files]
FAIL
dh_auto_test: error: cd obj-arm-linux-gnueabihf && go test -vet=off -v -p 4 github.com/Debian/debiman github.com/Debian/debiman/cmd/debiman github.com/Debian/debiman/cmd/debiman-auxserver github.com/Debian/debiman/cmd/debiman-idx2rwmap github.com/Debian/debiman/cmd/debiman-minisrv github.com/Debian/debiman/internal/auxserver github.com/Debian/debiman/internal/bundled github.com/Debian/debiman/internal/commontmpl github.com/Debian/debiman/internal/convert github.com/Debian/debiman/internal/manpage github.com/Debian/debiman/internal/proto github.com/Debian/debiman/internal/recode github.com/Debian/debiman/internal/redirect github.com/Debian/debiman/internal/sitemap github.com/Debian/debiman/internal/tag github.com/Debian/debiman/internal/write returned exit code 1
make: *** [debian/rules:4: binary-arch] Error 25

Tail of log for deng on armhf:

  175 |                                         pixel[1] = png_info->palette[rows[i][off]].green;
      |                                                            ^~
/<<BUILDDIR>>/deng-1.9.0-beta6.9+dfsg1/doomsday/engine/portable/src/gl_png.c:176:60: error: invalid use of incomplete typedef 'png_info' {aka 'struct png_info_def'}
  176 |                                         pixel[2] = png_info->palette[rows[i][off]].blue;
      |                                                            ^~
/<<BUILDDIR>>/deng-1.9.0-beta6.9+dfsg1/doomsday/engine/portable/src/gl_png.c:183:48: error: invalid use of incomplete typedef 'png_info' {aka 'struct png_info_def'}
  183 |                                     if(png_info->channels == 2) // Alpha data.
      |                                                ^~
make[3]: *** [CMakeFiles/doomsday.dir/build.make:745: CMakeFiles/doomsday.dir/engine/portable/src/gl_png.o] Error 1
make[3]: Leaving directory '/<<BUILDDIR>>/deng-1.9.0-beta6.9+dfsg1/doomsdaybuild'
make[2]: *** [CMakeFiles/Makefile2:228: CMakeFiles/doomsday.dir/all] Error 2
make[2]: Leaving directory '/<<BUILDDIR>>/deng-1.9.0-beta6.9+dfsg1/doomsdaybuild'
make[1]: *** [Makefile:171: all] Error 2
make[1]: Leaving directory '/<<BUILDDIR>>/deng-1.9.0-beta6.9+dfsg1/doomsdaybuild'
make: *** [debian/rules:25: build-stamp] Error 2

Tail of log for gjh-asl-json on armhf:

  280 | #define conval(x,r,ne)  (*((ASL*)asl)->p.Conval)((ASL*)asl,x,r,ne)
      |                                                                ^~
src/AmplInterface.cpp: In member function ‘void AmplInterface::eval_jac_c(const double*, double*) const’:
src/AmplInterface.cpp:920:37: error: invalid conversion from ‘int*’ to ‘fint*’ {aka ‘long int*’} [-fpermissive]
  920 |    jacval((double*)x, jac_c_values, &nerror);
      |                                     ^~~~~~~
      |                                     |
      |                                     int*
/usr/include/ampl-netlib-solvers/asl.h:281:64: note: in definition of macro ‘jacval’
  281 | #define jacval(x,j,ne)  (*((ASL*)asl)->p.Jacval)((ASL*)asl,x,j,ne)
      |                                                                ^~
make[1]: *** [Makefile:25: src/AmplInterface.o] Error 1
make[1]: Leaving directory '/<<BUILDDIR>>/gjh-asl-json-0.0+git20180428.eb8720e'
dh_auto_build: error: make -j4 "INSTALL=install --strip-program=true" returned exit code 2
make: *** [debian/rules:21: binary-arch] Error 25

Tail of log for gloo on armhf:

    arg [/usr/lib/gcc/arm-linux-gnueabihf/10/../../../arm-linux-gnueabihf/crtn.o] ==> ignore
  collapse library dir [/usr/lib/gcc/arm-linux-gnueabihf/10] ==> [/usr/lib/gcc/arm-linux-gnueabihf/10]
  collapse library dir [/usr/lib/gcc/arm-linux-gnueabihf/10/../../../arm-linux-gnueabihf] ==> [/usr/lib/arm-linux-gnueabihf]
  collapse library dir [/usr/lib/gcc/arm-linux-gnueabihf/10/../../..] ==> [/usr/lib]
  collapse library dir [/lib/arm-linux-gnueabihf] ==> [/lib/arm-linux-gnueabihf]
  collapse library dir [/usr/lib/arm-linux-gnueabihf] ==> [/usr/lib/arm-linux-gnueabihf]
  implicit libs: [gcc;gcc_s;c;gcc;gcc_s]
  implicit dirs: [/usr/lib/gcc/arm-linux-gnueabihf/10;/usr/lib/arm-linux-gnueabihf;/usr/lib;/lib/arm-linux-gnueabihf]
  implicit fwks: []


dh_auto_configure: error: cd obj-arm-linux-gnueabihf && cmake -DCMAKE_INSTALL_PREFIX=/usr -DCMAKE_BUILD_TYPE=None -DCMAKE_INSTALL_SYSCONFDIR=/etc -DCMAKE_INSTALL_LOCALSTATEDIR=/var -DCMAKE_EXPORT_NO_PACKAGE_REGISTRY=ON -DCMAKE_FIND_PACKAGE_NO_PACKAGE_REGISTRY=ON -DCMAKE_INSTALL_RUNSTATEDIR=/run -DCMAKE_SKIP_INSTALL_ALL_DEPENDENCY=ON "-GUnix Makefiles" -DCMAKE_VERBOSE_MAKEFILE=ON -DCMAKE_INSTALL_LIBDIR=lib/arm-linux-gnueabihf -DCMAKE_BUILD_TYPE=RelWithDebInfo -DUSE_REDIS=ON -DUSE_IBVERBS=ON -DUSE_MPI=OFF -DUSE_LIBUV=OFF -DUSE_CUDA=OFF -DUSE_NCCL=OFF -DBUILD_TEST=OFF -DBUILD_BENCHMARK=OFF -DBUILD_SHARED_LIBS=ON .. returned exit code 1
make[1]: *** [debian/rules:13: override_dh_auto_configure] Error 2
make[1]: Leaving directory '/<<PKGBUILDDIR>>'
make: *** [debian/rules:8: binary-arch] Error 2

Tail of log for haskell-ghc-lib-parser-ex on armhf:

ghc-lib-parser-ex-test:   -Mgrace=<n>
ghc-lib-parser-ex-test:             The amount of allocation after the program receives a
ghc-lib-parser-ex-test:             HeapOverflow exception before the exception is thrown again, if
ghc-lib-parser-ex-test:             the program is still exceeding the heap limit.
ghc-lib-parser-ex-test: 
ghc-lib-parser-ex-test: RTS options may also be specified using the GHCRTS environment variable.
ghc-lib-parser-ex-test: 
ghc-lib-parser-ex-test: Other RTS options may be available for programs compiled a different way.
ghc-lib-parser-ex-test: The GHC User's Guide has full details.
ghc-lib-parser-ex-test: 
Test suite ghc-lib-parser-ex-test: FAIL
Test suite logged to:
dist-ghc/test/ghc-lib-parser-ex-8.10.0.16-ghc-lib-parser-ex-test.log
0 of 1 test suites (0 of 1 test cases) passed.
make: *** [/usr/share/cdbs/1/class/hlibrary.mk:154: check-ghc-stamp] Error 1

Tail of log for haskell-pretty-simple on armhf:

[7 of 9] Compiling Text.Pretty.Simple.Internal ( src/Text/Pretty/Simple/Internal.hs, dist-ghc/build/Text/Pretty/Simple/Internal.p_o )
[8 of 9] Compiling Text.Pretty.Simple ( src/Text/Pretty/Simple.hs, dist-ghc/build/Text/Pretty/Simple.p_o )
[9 of 9] Compiling Debug.Pretty.Simple ( src/Debug/Pretty/Simple.hs, dist-ghc/build/Debug/Pretty/Simple.p_o )
touch build-ghc-stamp
. /usr/share/haskell-devscripts/Dh_Haskell.sh && \
check_recipe
Running debian/hlibrary.setup test --builddir=dist-ghc --show-details=direct
Running 1 test suites...
Test suite pretty-simple-doctest: RUNNING...
pretty-simple-doctest: fd:13: hGetLine: end of file
Test suite pretty-simple-doctest: FAIL
Test suite logged to:
dist-ghc/test/pretty-simple-3.2.3.0-pretty-simple-doctest.log
0 of 1 test suites (0 of 1 test cases) passed.
make: *** [/usr/share/cdbs/1/class/hlibrary.mk:154: check-ghc-stamp] Error 1

Tail of log for ivar on armhf:

See tests/test-suite.log
Please report to gkarthik@scripps.edu
============================================================================
make[5]: *** [Makefile:904: test-suite.log] Error 1
make[5]: Leaving directory '/<<BUILDDIR>>/ivar-1.3+dfsg/tests'
make[4]: *** [Makefile:1012: check-TESTS] Error 2
make[4]: Leaving directory '/<<BUILDDIR>>/ivar-1.3+dfsg/tests'
make[3]: *** [Makefile:1205: check-am] Error 2
make[3]: Leaving directory '/<<BUILDDIR>>/ivar-1.3+dfsg/tests'
make[2]: *** [Makefile:362: check-recursive] Error 1
make[2]: Leaving directory '/<<BUILDDIR>>/ivar-1.3+dfsg'
dh_auto_test: error: make -j1 check VERBOSE=1 returned exit code 2
make[1]: *** [debian/rules:12: override_dh_auto_test] Error 25
make[1]: Leaving directory '/<<BUILDDIR>>/ivar-1.3+dfsg'
make: *** [debian/rules:9: binary-arch] Error 2

Tail of log for libbiod on armhf:

gdc: error: unrecognized command-line option ‘-release’; did you mean ‘-frelease’?
gdc: error: unrecognized command-line option ‘-boundscheck=off’; did you mean ‘-fbounds-check=off’?
[3/199] gdc -Ilibbiod.so.0.2.3.p -I. -I.. -Wall -Wdeprecated -g -O2 -ffile-prefix-map=/<<BUILDDIR>>/libbiod-0.2.3+git20191120.b8eecef=. -fstack-protector-strong -frelease -fPIC -O3 -release -enable-inlining -boundscheck=off -MD -MQ libbiod.so.0.2.3.p/contrib_undead_internal_file.d.o -MF libbiod.so.0.2.3.p/contrib_undead_internal_file.d.o.deps -o libbiod.so.0.2.3.p/contrib_undead_internal_file.d.o -c ../contrib/undead/internal/file.d
FAILED: libbiod.so.0.2.3.p/contrib_undead_internal_file.d.o 
gdc -Ilibbiod.so.0.2.3.p -I. -I.. -Wall -Wdeprecated -g -O2 -ffile-prefix-map=/<<BUILDDIR>>/libbiod-0.2.3+git20191120.b8eecef=. -fstack-protector-strong -frelease -fPIC -O3 -release -enable-inlining -boundscheck=off -MD -MQ libbiod.so.0.2.3.p/contrib_undead_internal_file.d.o -MF libbiod.so.0.2.3.p/contrib_undead_internal_file.d.o.deps -o libbiod.so.0.2.3.p/contrib_undead_internal_file.d.o -c ../contrib/undead/internal/file.d
gdc: error: unrecognized command-line option ‘-release’; did you mean ‘-frelease’?
gdc: error: unrecognized command-line option ‘-boundscheck=off’; did you mean ‘-fbounds-check=off’?
[4/199] gdc -Ilibbiod.so.0.2.3.p -I. -I.. -Wall -Wdeprecated -g -O2 -ffile-prefix-map=/<<BUILDDIR>>/libbiod-0.2.3+git20191120.b8eecef=. -fstack-protector-strong -frelease -fPIC -O3 -release -enable-inlining -boundscheck=off -MD -MQ libbiod.so.0.2.3.p/contrib_undead_stream.d.o -MF libbiod.so.0.2.3.p/contrib_undead_stream.d.o.deps -o libbiod.so.0.2.3.p/contrib_undead_stream.d.o -c ../contrib/undead/stream.d
FAILED: libbiod.so.0.2.3.p/contrib_undead_stream.d.o 
gdc -Ilibbiod.so.0.2.3.p -I. -I.. -Wall -Wdeprecated -g -O2 -ffile-prefix-map=/<<BUILDDIR>>/libbiod-0.2.3+git20191120.b8eecef=. -fstack-protector-strong -frelease -fPIC -O3 -release -enable-inlining -boundscheck=off -MD -MQ libbiod.so.0.2.3.p/contrib_undead_stream.d.o -MF libbiod.so.0.2.3.p/contrib_undead_stream.d.o.deps -o libbiod.so.0.2.3.p/contrib_undead_stream.d.o -c ../contrib/undead/stream.d
gdc: error: unrecognized command-line option ‘-release’; did you mean ‘-frelease’?
gdc: error: unrecognized command-line option ‘-boundscheck=off’; did you mean ‘-fbounds-check=off’?
ninja: build stopped: subcommand failed.
dh_auto_build: error: cd obj-arm-linux-gnueabihf && LC_ALL=C.UTF-8 ninja -j4 -v returned exit code 1
make: *** [debian/rules:7: build-arch] Error 25

Tail of log for libretro-mupen64plus on armhf:

                 from ./libretro/opengl_state_machine.h:4,
                 from ./libretro/SDL_opengles2.h:29,
                 from gles2rice/src/osal_opengl.h:33,
                 from gles2rice/src/DeviceBuilder.cpp:21:
/usr/include/GLES2/gl2ext.h:3092:16: note: previous declaration as 'typedef double GLdouble'
 3092 | typedef double GLdouble;
      |                ^~~~~~~~
g++ -Wdate-time -D_FORTIFY_SOURCE=2 -g -ffile-prefix-map=/<<BUILDDIR>>/libretro-mupen64plus-2.0+git20160207+dfsg2=. -fstack-protector-strong -Wformat -Werror=format-security -std=gnu++98 -MMD -O2 -DNDEBUG -DHAVE_NEON -D__LIBRETRO__ -DINLINE="inline" -DM64P_PLUGIN_API -DM64P_CORE_PROTOTYPES -D_ENDUSER_RELEASE -DSDL_VIDEO_OPENGL_ES2=1 -DSINC_LOWER_QUALITY -DHAVE_COMBINE_EXT -I./mupen64plus-core/src -I./mupen64plus-core/src/api -I./mupen64plus-core/src/plugin/audio_libretro -I./glide2gl/src/Glitch64/inc -I./libretro-common/include -I./libretro -DARM -fPIC -DARM -DNO_ASM -DARM -D__arm__ -DARM_ASM -DNOSSE -marm -D__NEON_OPT -mfpu=neon -mfloat-abi=hard -DGLES -DHAVE_OPENGLES2 -DDISABLE_3POINT -DUSE_GLES -DNEW_DYNAREC=3 -DDYNAREC -c gles2rice/src/FrameBuffer.cpp -o gles2rice/src/FrameBuffer.o
make[2]: *** [Makefile:408: gles2rice/src/DeviceBuilder.o] Error 1
make[2]: *** Waiting for unfinished jobs....
make[2]: Leaving directory '/<<BUILDDIR>>/libretro-mupen64plus-2.0+git20160207+dfsg2'
dh_auto_build: error: make -j4 "platform=armv gles neon hardfloat" returned exit code 2
make[1]: *** [debian/rules:19: override_dh_auto_build] Error 25
make[1]: Leaving directory '/<<BUILDDIR>>/libretro-mupen64plus-2.0+git20160207+dfsg2'
make: *** [debian/rules:16: build-arch] Error 2

Tail of log for listaller on armhf:

  Command-line option `--thread` is deprecated and will be ignored

  Compilation failed: 7 error(s), 12 warning(s)



make[3]: *** [src/CMakeFiles/listaller-glib_precompile.dir/build.make:126: src/CMakeFiles/listaller-glib_precompile.dir/precompile.stamp] Error 1
make[3]: Leaving directory '/<<PKGBUILDDIR>>/obj-arm-linux-gnueabihf'
make[2]: *** [CMakeFiles/Makefile2:711: src/CMakeFiles/listaller-glib_precompile.dir/all] Error 2
make[2]: Leaving directory '/<<PKGBUILDDIR>>/obj-arm-linux-gnueabihf'
make[1]: *** [Makefile:163: all] Error 2
make[1]: Leaving directory '/<<PKGBUILDDIR>>/obj-arm-linux-gnueabihf'
dh_auto_build: error: cd obj-arm-linux-gnueabihf && make -j1 VERBOSE=1 returned exit code 2
make: *** [debian/rules:15: build-arch] Error 25

Tail of log for octave-tisean on armhf:

***** ###############################################################
***** fail("lazy([(1:10);(1:10)],7,-0.06)");
***** fail("lazy((1:10),0,0.04)");
***** fail("[a,b,c] = lazy((1:10),1,0.05)");
***** test
 "In is generated from Octave using 'in = 1 + 0.5 * rand(10,1);'";
 in = [1.47007925526322;1.168775342017635;1.10943000146922; 1.174293926353764;  1.075741574572656; 1.373465364407417; 1.089417388489702; 1.403669883669071;1.452726826806777;  1.016960990335037];
 "res was generated using 'lazy -m1 -v0.06 in.dat' from TISEAN 'lazy'";
 res = [1.47007930, 0.00000000; 1.17153454, -2.75921822E-03; 1.10942996, 0.00000000; 1.17153454, 2.75933743E-03; 1.07574153, 0.00000000; 1.37346542, 0.00000000; 1.08941734, 0.00000000; 1.40366983, 0.00000000; 1.45272684, 0.00000000; 1.01696098, 0.00000000];
 [al,bl] = lazy(in, 1, -0.06);
 assert([al,bl],res,1e-6);
4 tests, 4 passed, 0 known failure, 0 skipped
Summary: 162 tests, 152 passed, 0 known failures, 0 skipped
Some tests failed.  Giving up...
make: *** [debian/rules:5: binary-arch] Error 1

Tail of log for perftest on armhf:

                 from src/perftest_communication.h:45,
                 from src/perftest_communication.c:17:
src/get_clock.h:109:2: warning: #warning get_cycles not implemented for this architecture: attempt asm/timex.h [-Wcpp]
  109 | #warning get_cycles not implemented for this architecture: attempt asm/timex.h
      |  ^~~~~~~
src/get_clock.h:110:10: fatal error: asm/timex.h: No such file or directory
  110 | #include <asm/timex.h>
      |          ^~~~~~~~~~~~~
compilation terminated.
make[2]: *** [Makefile:859: src/perftest_communication.o] Error 1
make[2]: Leaving directory '/<<BUILDDIR>>/perftest-4.4+0.37'
make[1]: *** [Makefile:583: all] Error 2
make[1]: Leaving directory '/<<BUILDDIR>>/perftest-4.4+0.37'
dh_auto_build: error: make -j4 returned exit code 2
make: *** [debian/rules:7: binary-arch] Error 25

Tail of log for postgresql-numeral on armhf:

 
@@ -245,8 +245,8 @@
 (1 row)
 
 SELECT 'zweihundertzweiunddreißig'::zahl;
-           zahl            
----------------------------
+            zahl            
+----------------------------
  zweihundertzweiunddreißig
 (1 row)
 
### End 13 installcheck (FAILED with exit code 1) ###
dh_pgxs_test: error: pg_buildext installcheck . build-%v postgresql-%v-numeral returned exit code 1
make: *** [debian/rules:7: binary-arch] Error 25

Tail of log for kodi on armhf:

dh_clean \
	addons/skin.estuary/media/from-debian-logo.png \
	addons/webinterface.default/ \
	debian/dh-addon/*.1 \
	kodi_build_*/ \
	lib/gtest/ \
	media/Fonts/arial.ttf
make[1]: Leaving directory '/<<BUILDDIR>>/kodi-19.0+dfsg1'
 debian/rules binary-arch
dh binary-arch --buildsystem cmake --with python3
   dh_update_autotools_config -a -O--buildsystem=cmake
   dh_autoreconf -a -O--buildsystem=cmake
   debian/rules override_dh_auto_configure
make[1]: Entering directory '/<<BUILDDIR>>/kodi-19.0+dfsg1'
rsvg-convert -w 250 -h 82 -o addons/skin.estuary/media/from-debian-logo.png debian/from-debian-logo.svg