Raspbian Package Auto-Building

Buildd status for selected packages (bookworm-staging)

Bugs

Package(s): Suite:
Compact mode Co-maintainers

Package armhf
Buildd exposure stats
✘ fstl  Build-Attempted
✘ ruby-hamlit  Build-Attempted
✘ scamp  Build-Attempted
✘ nomad  Build-Attempted
✘ uvloop  Build-Attempted
✘ swt4-gtk  Build-Attempted
✘ tilix  Build-Attempted
✘ bird2  Build-Attempted
✘ fakechroot  Build-Attempted
✘ mfgtools  Build-Attempted
✔ chattyInstalled
✘ poedit  Build-Attempted
✘ openvswitch  Build-Attempted
✔ mkvtoolnixInstalled
✔ appstream-generatorBuild-Attempted
✔ ismrmrdBuild-Attempted
✔ libundeadBuild-Attempted
✔ haskell-protobufBuild-Attempted
✔ quorumBuild-Attempted
Package armhf
Buildd exposure stats
✔ python-skbioBuild-Attempted
✔ gfccoreBuild-Attempted
✔ libibcmBuild-Attempted
✔ spadesBuild-Attempted
✔ icinga2Build-Attempted
✔ tensorpipeBuild-Attempted
✔ acoveaBuild-Attempted
✔ mingw32-binutilsBuild-Attempted
✔ rocksdbBuild-Attempted
✔ pmakeBuild-Attempted
✔ apfBuild-Attempted
✔ ocamlgslBuild-Attempted
✔ asterisk-chan-capiBuild-Attempted
✔ autofs5Build-Attempted
✔ audacious-analog-vumeter-pluginBuild-Attempted
✔ gnome-control-centerInstalled
✔ bbhashBuild-Attempted
✔ bustoolsBuild-Attempted
✔ blastemBuild-Attempted
✔ badgerInstalled
Package armhf
Buildd exposure stats
✔ criuBuild-Attempted
✔ consul-migrateBuild-Attempted
✘ creduce  Build-Attempted
✔ davs2Build-Attempted
✔ debimanBuild-Attempted
✔ cclsBuild-Attempted
✔ deepin-movie-rebornBuild-Attempted
✔ dballeBuild-Attempted
✔ fpzipBuild-Attempted
✔ febootstrapBuild-Attempted
✔ fairy-stockfishBuild-Attempted
✔ cycloneddsBuild-Attempted
✔ garagemqBuild-Attempted
✔ gjh-asl-jsonBuild-Attempted
✔ golang-android-soongBuild-Attempted
✔ glooBuild-Attempted
✔ dengBuild-Attempted
✔ gammapyBuild-Attempted
✔ haskell-ghc-lib-parser-exBuild-Attempted
✔ haskell-pretty-simpleBuild-Attempted
Package armhf
Buildd exposure stats
✔ ghemicalBuild-Attempted
✔ ibamBuild-Attempted
✔ haskell-type-levelBuild-Attempted
✔ haskell-xml-html-qqBuild-Attempted
✔ ioappsBuild-Attempted
✔ icu-extBuild-Attempted
✔ ivarBuild-Attempted
✔ jbuilderBuild-Attempted
✔ kafs-clientBuild-Attempted
✔ jocamlBuild-Attempted
✔ kvmtoolBuild-Attempted
✔ libmath-int128-perlBuild-Attempted
✔ libbiodBuild-Attempted
✔ libgrokj2kBuild-Attempted
✔ libmlx5Build-Attempted
✔ leela-zeroBuild-Attempted
✔ libnunc-stansBuild-Attempted
✔ librandomxBuild-Attempted
✔ libtangoBuild-Attempted
✔ libretro-mupen64plusBuild-Attempted
Package armhf
Buildd exposure stats
✔ kleborateBuild-Attempted
✔ libxsmmBuild-Attempted
✔ massivethreadsBuild-Attempted
✔ mariadb-connector-odbcBuild-Attempted
✔ mesBuild-Attempted
✔ mojoshaderBuild-Attempted
✔ micropythonBuild-Attempted
✔ mrsBuild-Attempted
✔ listallerBuild-Attempted
✔ msrtoolBuild-Attempted
✔ neuronBuild-Attempted
✔ nixBuild-Attempted
✔ nsd3Build-Attempted
✔ node-srsBuild-Attempted
✔ odcBuild-Attempted
✔ open-axiomBuild-Attempted
✔ openmmBuild-Attempted
✔ pbseqlibBuild-Attempted
✔ oliveBuild-Attempted
✔ pacoBuild-Attempted
Package armhf
Buildd exposure stats
✔ percona-xtradb-cluster-galera-2.xBuild-Attempted
✔ perftestBuild-Attempted
✔ plink2Build-Attempted
✔ patatBuild-Attempted
✔ python-peachpyBuild-Attempted
✔ prboomBuild-Attempted
✔ projectmBuild-Attempted
✔ qwinffBuild-Attempted
✔ qtjsbackend-opensource-srcBuild-Attempted
✔ rpm2htmlBuild-Attempted
✔ r-bioc-rsubreadBuild-Attempted
✔ ruby-cborBuild-Attempted
✔ rust-generatorBuild-Attempted
✔ rust-mach-o-sysBuild-Attempted
✔ rust-kvm-ioctlsBuild-Attempted
✔ ruby2.1Build-Attempted
✔ rust-mysqlclient-sysBuild-Attempted
✔ rust-pq-sysBuild-Attempted
✔ rust-servo-freetype-sysBuild-Attempted
✔ scanbuttondBuild-Attempted
Package armhf
Buildd exposure stats
✔ rust-ucd-generateBuild-Attempted
✔ rust-libnotcurses-sysBuild-Attempted
✔ slang-slirpBuild-Attempted
✔ r-cran-s2Installed
✔ tarantoolBuild-Attempted
✔ traildbBuild-Attempted
✔ tendermintBuild-Attempted
✔ tinyarrayBuild-Attempted
✔ tiledarrayBuild-Attempted
✔ xavs2Build-Attempted
✔ wmmailBuild-Attempted
✔ xnnpackBuild-Attempted
✔ xf86-video-msmBuild-Attempted
✔ virt-v2vBuild-Attempted
✔ sfcgalBuild-Attempted
✔ haskell-ormoluBuild-Attempted
✔ bornagainInstalled
✔ qtmirBuild-Attempted
✔ libmaus2Build-Attempted
✔ paraviewBuild-Attempted
Package armhf
Buildd exposure stats
✔ gatb-coreBuild-Attempted
✔ sagemathBuild-Attempted
✔ pyfftwBuild-Attempted
✘ kdiff3  Build-Attempted
✔ virtuoso-opensourceBuild-Attempted
✔ prometheus-libvirt-exporterBuild-Attempted
✔ nncpBuild-Attempted
✔ agdaBuild-Attempted
✔ nextpnrBuild-Attempted
✔ openmsBuild-Attempted
✔ iem-plugin-suiteBuild-Attempted
✔ rheolefBuild-Attempted
✔ kateInstalled
✔ mlpackBuild-Attempted
✔ siconosBuild-Attempted
✔ kmymoneyInstalled
✔ kodiBuild-Attempted
✔ openstructureBuild-Attempted
✘ chromium  Build-Attempted
✘ r-cran-fastcluster  Build-Attempted
Package armhf
Buildd exposure stats
✔ mercurialInstalled
✘ libguestfs  Build-Attempted

Tail of log for fstl on armhf:

      |                                        ^
In file included from /usr/include/arm-linux-gnueabihf/qt5/QtGui/QMouseEvent:1,
                 from /<<PKGBUILDDIR>>/src/canvas.cpp:1:
/usr/include/arm-linux-gnueabihf/qt5/QtGui/qevent.h:219:16: note: declared here
  219 |     inline int delta() const  { return qt4D; }
      |                ^~~~~
make[3]: *** [CMakeFiles/fstl.dir/build.make:141: CMakeFiles/fstl.dir/src/canvas.cpp.o] Error 1
make[3]: *** Waiting for unfinished jobs....
make[3]: Leaving directory '/<<PKGBUILDDIR>>/obj-arm-linux-gnueabihf'
make[2]: *** [CMakeFiles/Makefile2:99: CMakeFiles/fstl.dir/all] Error 2
make[2]: Leaving directory '/<<PKGBUILDDIR>>/obj-arm-linux-gnueabihf'
make[1]: *** [Makefile:174: all] Error 2
make[1]: Leaving directory '/<<PKGBUILDDIR>>/obj-arm-linux-gnueabihf'
dh_auto_build: error: cd obj-arm-linux-gnueabihf && make -j4 "INSTALL=install --strip-program=true" VERBOSE=1 returned exit code 2
make: *** [debian/rules:9: binary-arch] Error 25

Tail of log for ruby-hamlit on armhf:

Hamlit::AttributeParser::.parse#test_0001_anonymous = 0.00 s = .
Hamlit::AttributeParser::.parse#test_0002_anonymous = 0.00 s = .
Hamlit::Filters::#compile#test_0001_renders scss filter = 0.03 s = .
Hamlit::Filters::#compile#test_0002_parses string interpolation = 0.03 s = .

Finished in 14.516583s, 23.9037 runs/s, 24.3170 assertions/s.
347 runs, 353 assertions, 1 failures, 0 errors, 0 skips
rake aborted!
Command failed with status (1): [ruby -w -I"test" -rtest_helper /usr/share/rubygems-integration/all/gems/rake-13.0.3/lib/rake/rake_test_loader.rb "test/hamlit/attribute_parser_test.rb" "test/hamlit/cli_test.rb" "test/hamlit/dynamic_merger_test.rb" "test/hamlit/engine/comment_test.rb" "test/hamlit/engine/doctype_test.rb" "test/hamlit/engine/indent_test.rb" "test/hamlit/engine/multiline_test.rb" "test/hamlit/engine/new_attribute_test.rb" "test/hamlit/engine/old_attribute_test.rb" "test/hamlit/engine/script_test.rb" "test/hamlit/engine/silent_script_test.rb" "test/hamlit/engine/tag_test.rb" "test/hamlit/engine/text_test.rb" "test/hamlit/engine/whitespace_test.rb" "test/hamlit/error_test.rb" "test/hamlit/filters/cdata_test.rb" "test/hamlit/filters/coffee_test.rb" "test/hamlit/filters/css_test.rb" "test/hamlit/filters/erb_test.rb" "test/hamlit/filters/javascript_test.rb" "test/hamlit/filters/markdown_test.rb" "test/hamlit/filters/plain_test.rb" "test/hamlit/filters/ruby_test.rb" "test/hamlit/filters/sass_test.rb" "test/hamlit/filters/scss_test.rb" "test/hamlit/helpers_test.rb" "test/hamlit/line_number_test.rb" "test/hamlit/optimization_test.rb" "test/hamlit/rails_template_test.rb" "test/hamlit/ruby_expression_test.rb" "test/hamlit/string_splitter_test.rb" "test/hamlit/template_test.rb" -v]
/usr/share/rubygems-integration/all/gems/rake-13.0.3/exe/rake:27:in `<top (required)>'
Tasks: TOP => default
(See full trace by running task with --trace)
ERROR: Test "ruby2.7" failed. Exiting.
dh_auto_install: error: dh_ruby --install /<<PKGBUILDDIR>>/debian/ruby-hamlit returned exit code 1
make: *** [debian/rules:6: binary-arch] Error 25

Tail of log for scamp on armhf:

# ERROR: 0
============================================================================
See tests/test-suite.log
Please report to astromatic@astromatic.net
============================================================================
make[4]: *** [Makefile:783: test-suite.log] Error 1
make[4]: Leaving directory '/<<PKGBUILDDIR>>/tests'
make[3]: *** [Makefile:891: check-TESTS] Error 2
make[3]: Leaving directory '/<<PKGBUILDDIR>>/tests'
make[2]: *** [Makefile:992: check-am] Error 2
make[2]: Leaving directory '/<<PKGBUILDDIR>>/tests'
make[1]: *** [Makefile:537: check-recursive] Error 1
make[1]: Leaving directory '/<<PKGBUILDDIR>>'
dh_auto_test: error: make -j4 check VERBOSE=1 returned exit code 2
make: *** [debian/rules:7: binary-arch] Error 25

Tail of log for nomad on armhf:

github.com/hashicorp/nomad/lib/circbufwriter
github.com/hashicorp/nomad/plugins/csi/fake
github.com/hashicorp/nomad/plugins/csi/testing
github.com/hashicorp/nomad/plugins/device/cmd/example
github.com/hashicorp/nomad/plugins/drivers/testutils
github.com/hashicorp/nomad/plugins/shared/cmd/launcher/command
github.com/hashicorp/nomad/plugins/device/cmd/example/cmd
github.com/hashicorp/nomad/plugins/shared/cmd/launcher
github.com/hashicorp/nomad/devices/gpu/nvidia/nvml
github.com/hashicorp/nomad/devices/gpu/nvidia
github.com/hashicorp/nomad/devices/gpu/nvidia/cmd
dh_auto_build: error: cd _build && go install -trimpath -v -p 4 -a -tags "release ui nonvidia" github.com/hashicorp/nomad github.com/hashicorp/nomad/acl github.com/hashicorp/nomad/api github.com/hashicorp/nomad/api/contexts github.com/hashicorp/nomad/api/internal/testutil github.com/hashicorp/nomad/api/internal/testutil/discover github.com/hashicorp/nomad/api/internal/testutil/freeport github.com/hashicorp/nomad/client github.com/hashicorp/nomad/client/allocdir github.com/hashicorp/nomad/client/allocdir/input github.com/hashicorp/nomad/client/allochealth github.com/hashicorp/nomad/client/allocrunner github.com/hashicorp/nomad/client/allocrunner/interfaces github.com/hashicorp/nomad/client/allocrunner/state github.com/hashicorp/nomad/client/allocrunner/taskrunner github.com/hashicorp/nomad/client/allocrunner/taskrunner/getter github.com/hashicorp/nomad/client/allocrunner/taskrunner/interfaces github.com/hashicorp/nomad/client/allocrunner/taskrunner/restarts github.com/hashicorp/nomad/client/allocrunner/taskrunner/state github.com/hashicorp/nomad/client/allocrunner/taskrunner/template github.com/hashicorp/nomad/client/allocwatcher github.com/hashicorp/nomad/client/config github.com/hashicorp/nomad/client/consul github.com/hashicorp/nomad/client/devicemanager github.com/hashicorp/nomad/client/devicemanager/state github.com/hashicorp/nomad/client/dynamicplugins github.com/hashicorp/nomad/client/fingerprint github.com/hashicorp/nomad/client/interfaces github.com/hashicorp/nomad/client/lib/fifo github.com/hashicorp/nomad/client/lib/nsutil github.com/hashicorp/nomad/client/lib/streamframer github.com/hashicorp/nomad/client/logmon github.com/hashicorp/nomad/client/logmon/logging github.com/hashicorp/nomad/client/logmon/proto github.com/hashicorp/nomad/client/pluginmanager github.com/hashicorp/nomad/client/pluginmanager/csimanager github.com/hashicorp/nomad/client/pluginmanager/drivermanager github.com/hashicorp/nomad/client/pluginmanager/drivermanager/state github.com/hashicorp/nomad/client/servers github.com/hashicorp/nomad/client/state github.com/hashicorp/nomad/client/stats github.com/hashicorp/nomad/client/structs github.com/hashicorp/nomad/client/taskenv github.com/hashicorp/nomad/client/testutil github.com/hashicorp/nomad/client/vaultclient github.com/hashicorp/nomad/command github.com/hashicorp/nomad/command/agent github.com/hashicorp/nomad/command/agent/consul github.com/hashicorp/nomad/command/agent/event github.com/hashicorp/nomad/command/agent/host github.com/hashicorp/nomad/command/agent/monitor github.com/hashicorp/nomad/command/agent/pprof github.com/hashicorp/nomad/command/raft_tools github.com/hashicorp/nomad/devices/gpu/nvidia github.com/hashicorp/nomad/devices/gpu/nvidia/cmd github.com/hashicorp/nomad/devices/gpu/nvidia/nvml github.com/hashicorp/nomad/drivers/docker github.com/hashicorp/nomad/drivers/docker/cmd github.com/hashicorp/nomad/drivers/docker/docklog github.com/hashicorp/nomad/drivers/docker/docklog/proto github.com/hashicorp/nomad/drivers/docker/util github.com/hashicorp/nomad/drivers/exec github.com/hashicorp/nomad/drivers/java github.com/hashicorp/nomad/drivers/mock github.com/hashicorp/nomad/drivers/qemu github.com/hashicorp/nomad/drivers/rawexec github.com/hashicorp/nomad/drivers/shared/eventer github.com/hashicorp/nomad/drivers/shared/executor github.com/hashicorp/nomad/drivers/shared/executor/proto github.com/hashicorp/nomad/drivers/shared/resolvconf github.com/hashicorp/nomad/helper github.com/hashicorp/nomad/helper/args github.com/hashicorp/nomad/helper/boltdd github.com/hashicorp/nomad/helper/codec github.com/hashicorp/nomad/helper/constraints/semver github.com/hashicorp/nomad/helper/discover github.com/hashicorp/nomad/helper/escapingio github.com/hashicorp/nomad/helper/fields github.com/hashicorp/nomad/helper/flag-helpers github.com/hashicorp/nomad/helper/flatmap github.com/hashicorp/nomad/helper/freeport github.com/hashicorp/nomad/helper/gated-writer github.com/hashicorp/nomad/helper/grpc-middleware/logging github.com/hashicorp/nomad/helper/logging github.com/hashicorp/nomad/helper/mount github.com/hashicorp/nomad/helper/noxssrw github.com/hashicorp/nomad/helper/pluginutils/catalog github.com/hashicorp/nomad/helper/pluginutils/grpcutils github.com/hashicorp/nomad/helper/pluginutils/hclspecutils github.com/hashicorp/nomad/helper/pluginutils/hclutils github.com/hashicorp/nomad/helper/pluginutils/loader github.com/hashicorp/nomad/helper/pluginutils/singleton github.com/hashicorp/nomad/helper/pool github.com/hashicorp/nomad/helper/raftutil github.com/hashicorp/nomad/helper/snapshot github.com/hashicorp/nomad/helper/stats github.com/hashicorp/nomad/helper/testlog github.com/hashicorp/nomad/helper/testtask github.com/hashicorp/nomad/helper/tlsutil github.com/hashicorp/nomad/helper/useragent github.com/hashicorp/nomad/helper/uuid github.com/hashicorp/nomad/helper/winsvc github.com/hashicorp/nomad/jobspec github.com/hashicorp/nomad/lib/circbufwriter github.com/hashicorp/nomad/lib/delayheap github.com/hashicorp/nomad/lib/kheap github.com/hashicorp/nomad/nomad github.com/hashicorp/nomad/nomad/deploymentwatcher github.com/hashicorp/nomad/nomad/drainer github.com/hashicorp/nomad/nomad/mock github.com/hashicorp/nomad/nomad/state github.com/hashicorp/nomad/nomad/structs github.com/hashicorp/nomad/nomad/structs/config github.com/hashicorp/nomad/nomad/types github.com/hashicorp/nomad/nomad/volumewatcher github.com/hashicorp/nomad/plugins github.com/hashicorp/nomad/plugins/base github.com/hashicorp/nomad/plugins/base/proto github.com/hashicorp/nomad/plugins/base/structs github.com/hashicorp/nomad/plugins/csi github.com/hashicorp/nomad/plugins/csi/fake github.com/hashicorp/nomad/plugins/csi/testing github.com/hashicorp/nomad/plugins/device github.com/hashicorp/nomad/plugins/device/cmd/example github.com/hashicorp/nomad/plugins/device/cmd/example/cmd github.com/hashicorp/nomad/plugins/device/proto github.com/hashicorp/nomad/plugins/drivers github.com/hashicorp/nomad/plugins/drivers/proto github.com/hashicorp/nomad/plugins/drivers/testutils github.com/hashicorp/nomad/plugins/drivers/utils github.com/hashicorp/nomad/plugins/shared/cmd/launcher github.com/hashicorp/nomad/plugins/shared/cmd/launcher/command github.com/hashicorp/nomad/plugins/shared/hclspec github.com/hashicorp/nomad/plugins/shared/structs github.com/hashicorp/nomad/plugins/shared/structs/proto github.com/hashicorp/nomad/scheduler github.com/hashicorp/nomad/testutil github.com/hashicorp/nomad/version returned exit code 2
make[1]: *** [debian/rules:52: override_dh_auto_build] Error 25
make[1]: Leaving directory '/<<BUILDDIR>>/nomad-0.12.10+dfsg1'
make: *** [debian/rules:29: build-arch] Error 2

Tail of log for uvloop on armhf:

.pybuild/cpython3_3.9_uvloop/build/tests/test_process.py: 32 warnings
.pybuild/cpython3_3.9_uvloop/build/tests/test_signals.py: 14 warnings
  /usr/lib/python3.9/asyncio/subprocess.py:196: DeprecationWarning: The loop argument is deprecated since Python 3.8, and scheduled for removal in Python 3.10.
    stdin, stdout, stderr = await tasks.gather(stdin, stdout, stderr,

-- Docs: https://docs.pytest.org/en/stable/warnings.html
=========================== short test summary info ============================
FAILED tests/test_unix.py::Test_UV_UnixSSL::test_create_unix_connection_ssl_1
FAILED tests/test_unix.py::Test_UV_UnixSSL::test_create_unix_server_ssl_1 - a...
FAILED tests/test_unix.py::Test_AIO_UnixSSL::test_create_unix_connection_ssl_1
FAILED tests/test_unix.py::Test_AIO_UnixSSL::test_create_unix_server_ssl_1 - ...
====== 4 failed, 329 passed, 5 skipped, 81 warnings in 243.81s (0:04:03) =======
E: pybuild pybuild:353: test: plugin distutils failed with: exit code=1: cd /<<BUILDDIR>>/uvloop-0.16.0+ds1/.pybuild/cpython3_3.9_uvloop/build; python3.9 -m pytest -s tests --ignore=tests/test_pipes.py --ignore=tests/test_sourcecode.py --ignore=tests/test_sockets.py --ignore=tests/test_tcp.py
dh_auto_test: error: pybuild --test --test-pytest -i python{version} -p 3.9 returned exit code 13
make: *** [debian/rules:14: build-arch] Error 25

Tail of log for swt4-gtk on armhf:

atk_structs.c:758:73: error: cast from pointer to integer of different size [-Werror=pointer-to-int-cast]
  758 |  (*env)->SetLongField(env, lpObject, AtkValueIfaceFc.get_minimum_value, (jlong)lpStruct->get_minimum_value);
      |                                                                         ^
atk_structs.c:759:73: error: cast from pointer to integer of different size [-Werror=pointer-to-int-cast]
  759 |  (*env)->SetLongField(env, lpObject, AtkValueIfaceFc.set_current_value, (jlong)lpStruct->set_current_value);
      |                                                                         ^
cc1: all warnings being treated as errors
make[2]: *** [make_linux.mak:218: atk.o] Error 1
cc1: all warnings being treated as errors
make[2]: *** [make_linux.mak:220: atk_structs.o] Error 1
make[2]: Leaving directory '/<<PKGBUILDDIR>>/bundles/org.eclipse.swt/Eclipse SWT PI/gtk/library'
dh_auto_build: error: make -j4 "INSTALL=install --strip-program=true" -C "bundles/org.eclipse.swt/Eclipse SWT PI/gtk/library" "-I../../../Eclipse SWT/common/library/" -f make_linux.mak make_atk make_awt make_cairo make_glx make_swt make_webkit make_swtpi returned exit code 2
make[1]: *** [debian/rules:38: override_dh_auto_build] Error 25
make[1]: Leaving directory '/<<PKGBUILDDIR>>'
make: *** [debian/rules:27: binary-arch] Error 2

Tail of log for tilix on armhf:


Summary of Failures:

2/2 tilix_test             FAIL            0.29s   exit status 1


Ok:                 1   
Expected Fail:      0   
Fail:               1   
Unexpected Pass:    0   
Skipped:            0   
Timeout:            0   
dh_auto_test: error: cd obj-arm-linux-gnueabihf && LC_ALL=C.UTF-8 MESON_TESTTHREADS=4 ninja test returned exit code 1
make: *** [debian/rules:11: build-arch] Error 25

Tail of log for bird2 on armhf:

obj/lib/hash_test 0.037452895s                                           [ OK ] 
obj/lib/printf_test 2>/dev/null && touch obj/lib/printf_test.ok
obj/lib/printf_test 0.004036764s                                         [ OK ] 
obj/nest/a-set_test 2>/dev/null && touch obj/nest/a-set_test.ok
obj/nest/a-set_test 0.013099646s                                         [ OK ] 
obj/nest/a-path_test 2>/dev/null && touch obj/nest/a-path_test.ok
obj/lib/bitmap_test: t_hmap_set_clear_fill: Timeout expired
obj/lib/bitmap_test: t_hmap_set_clear_fill 5.002747224s                  [FAIL] 
obj/lib/bitmap_test 6.464109481s                                         [FAIL] 
make[1]: *** [Makefile:180: obj/lib/bitmap_test.ok] Error 1
make[1]: *** Waiting for unfinished jobs....
obj/nest/a-path_test 0.611949291s                                        [ OK ] 
make[1]: Leaving directory '/<<PKGBUILDDIR>>'
dh_auto_test: error: make -j4 test VERBOSE=1 returned exit code 2
make: *** [debian/rules:21: build-arch] Error 25

Tail of log for fakechroot on armhf:

Test Summary Report
-------------------
t/fts.t                   (Wstat: 256 Tests: 40 Failed: 2)
  Failed tests:  39-40
  Non-zero exit status: 1
Files=35, Tests=856, 22 wallclock secs ( 0.46 usr  0.08 sys + 30.94 cusr 21.16 csys = 52.64 CPU)
Result: FAIL
make[3]: *** [Makefile:1326: prove] Error 1
make[3]: Leaving directory '/<<PKGBUILDDIR>>/test'
make[2]: *** [Makefile:1329: test] Error 2
make[2]: Leaving directory '/<<PKGBUILDDIR>>/test'
make[1]: *** [Makefile:866: test] Error 2
make[1]: Leaving directory '/<<PKGBUILDDIR>>'
dh_auto_test: error: make -j4 test VERBOSE=1 returned exit code 2
make: *** [debian/rules:11: build-arch] Error 25

Tail of log for mfgtools on armhf:

/usr/bin/ld: ../libuuu/libuuc_s.a(usbhotplug.cpp.o): in function `std::atomic<std::chrono::duration<long long, std::ratio<1ll, 1ll> > >::store(std::chrono::duration<long long, std::ratio<1ll, 1ll> >, std::memory_order)':
/usr/include/c++/10/atomic:254: undefined reference to `__atomic_store_8'
/usr/bin/ld: ../libuuu/libuuc_s.a(usbhotplug.cpp.o): in function `std::atomic<std::chrono::duration<long long, std::ratio<1ll, 1000ll> > >::store(std::chrono::duration<long long, std::ratio<1ll, 1000ll> >, std::memory_order)':
/usr/include/c++/10/atomic:254: undefined reference to `__atomic_store_8'
/usr/bin/ld: ../libuuu/libuuc_s.a(usbhotplug.cpp.o): in function `std::atomic<std::chrono::duration<long long, std::ratio<1ll, 1ll> > >::store(std::chrono::duration<long long, std::ratio<1ll, 1ll> >, std::memory_order)':
/usr/include/c++/10/atomic:254: undefined reference to `__atomic_store_8'
collect2: error: ld returned 1 exit status
make[3]: *** [uuu/CMakeFiles/uuu.dir/build.make:184: uuu/uuu] Error 1
make[3]: Leaving directory '/<<PKGBUILDDIR>>/obj-arm-linux-gnueabihf'
make[2]: *** [CMakeFiles/Makefile2:164: uuu/CMakeFiles/uuu.dir/all] Error 2
make[2]: Leaving directory '/<<PKGBUILDDIR>>/obj-arm-linux-gnueabihf'
make[1]: *** [Makefile:152: all] Error 2
make[1]: Leaving directory '/<<PKGBUILDDIR>>/obj-arm-linux-gnueabihf'
dh_auto_build: error: cd obj-arm-linux-gnueabihf && make -j4 "INSTALL=install --strip-program=true" VERBOSE=1 returned exit code 2
make: *** [debian/rules:11: binary-arch] Error 25

Tail of log for poedit on armhf:

/usr/include/c++/10/bits/stl_algobase.h:511:5: note: parameter passing for argument of type '__gnu_cxx::__normal_iterator<Suggestion*, std::vector<Suggestion> >' changed in GCC 7.1
  511 |     __copy_move_a(_II __first, _II __last, _OI __result)
      |     ^~~~~~~~~~~~~
/usr/include/c++/10/bits/stl_algobase.h:511:5: note: parameter passing for argument of type '__gnu_cxx::__normal_iterator<Suggestion*, std::vector<Suggestion> >' changed in GCC 7.1
/usr/include/c++/10/bits/stl_algobase.h:511:5: note: parameter passing for argument of type '__gnu_cxx::__normal_iterator<Suggestion*, std::vector<Suggestion> >' changed in GCC 7.1
g++ -std=gnu++14  -g -O2 -ffile-prefix-map=/<<PKGBUILDDIR>>=. -fstack-protector-strong -Wformat -Werror=format-security -pthread -I/usr/include -pthread -I/usr/include/libsecret-1 -I/usr/include/libmount -I/usr/include/blkid -I/usr/include/glib-2.0 -I/usr/lib/arm-linux-gnueabihf/glib-2.0/include -I/usr/lib/arm-linux-gnueabihf/wx/include/gtk3-unicode-3.0 -I/usr/include/wx-3.0 -D_FILE_OFFSET_BITS=64 -DWXUSINGDLL -D__WXGTK__ -pthread  -pthread -I/usr/include/gtkspell-3.0 -I/usr/include/enchant-2 -I/usr/include/gtk-3.0 -I/usr/include/at-spi2-atk/2.0 -I/usr/include/at-spi-2.0 -I/usr/include/dbus-1.0 -I/usr/lib/arm-linux-gnueabihf/dbus-1.0/include -I/usr/include/gtk-3.0 -I/usr/include/gio-unix-2.0 -I/usr/include/cairo -I/usr/include/pango-1.0 -I/usr/include/harfbuzz -I/usr/include/pango-1.0 -I/usr/include/fribidi -I/usr/include/harfbuzz -I/usr/include/atk-1.0 -I/usr/include/cairo -I/usr/include/pixman-1 -I/usr/include/uuid -I/usr/include/freetype2 -I/usr/include/libpng16 -I/usr/include/gdk-pixbuf-2.0 -I/usr/include/libpng16 -I/usr/include/arm-linux-gnueabihf -I/usr/include/libmount -I/usr/include/blkid -I/usr/include/glib-2.0 -I/usr/lib/arm-linux-gnueabihf/glib-2.0/include -I/usr/include/lucene++  -DHAVE_PUGIXML -g -Wall -O0 -DwxNO_UNSAFE_WXSTRING_CONV=1 "-DPOEDIT_PREFIX=\"/usr\""  -Wl,--as-needed -Wl,-z,relro -Wl,--as-needed -Wl,-z,relro -o poedit attentionbar.o cat_update.o cat_sorting.o catalog.o catalog_po.o catalog_xliff.o chooselang.o colorscheme.o commentdlg.o concurrency.o configuration.o custom_buttons.o customcontrols.o custom_notebook.o edapp.o edframe.o editing_area.o edlistctrl.o export_html.o extractors/extractor.o extractors/extractor_gettext.o extractors/extractor_legacy.o filemonitor.o fileviewer.o findframe.o gexecute.o hidpi.o icons.o language.o languagectrl.o wx/main_toolbar.o manager.o menus.o pluralforms/pl_evaluate.o prefsdlg.o pretranslate.o progressinfo.o propertiesdlg.o qa_checks.o recent_files.o sidebar.o spellchecking.o syntaxhighlighter.o text_control.o titleless_window.o tm/suggestions.o tm/transmem.o tm/tmx_io.o unicode_helpers.o utility.o welcomescreen.o http_client.o http_client_casablanca.o crowdin_client.o crowdin_gui.o keychain/keytar_posix.o wx_backports/wx_gtk_activityindicator.o wx_backports/wx_gtk_nativewin.o compiled_xrc.o -L/usr/lib/arm-linux-gnueabihf -pthread   -lwx_gtk3u_xrc-3.0 -lwx_baseu_xml-3.0 -lwx_gtk3u_webview-3.0 -lwx_gtk3u_adv-3.0 -lwx_gtk3u_core-3.0 -lwx_baseu_net-3.0 -lwx_baseu-3.0  -llucene++ -lcld2 -lpugixml -lcpprest -lboost_iostreams -lboost_thread -lpthread -lboost_system -lssl -lcrypto -lsecret-1 -lgio-2.0 -lgobject-2.0 -lglib-2.0 -L/usr/lib/arm-linux-gnueabihf -lboost_thread -lpthread -lboost_regex -lboost_system -licui18n -licuuc -licudata -lgtkspell3-3 -lenchant-2 -lgtk-3 -lgdk-3 -lpangocairo-1.0 -lpango-1.0 -lharfbuzz -latk-1.0 -lcairo-gobject -lcairo -lgdk_pixbuf-2.0 -lgio-2.0 -lgobject-2.0 -lglib-2.0
/usr/bin/ld: progressinfo.o: undefined reference to symbol '__atomic_load_8@@LIBATOMIC_1.0'
/usr/bin/ld: /usr/lib/arm-linux-gnueabihf/libatomic.so.1: error adding symbols: DSO missing from command line
collect2: error: ld returned 1 exit status
make[2]: *** [Makefile:658: poedit] Error 1
make[2]: Leaving directory '/<<PKGBUILDDIR>>/src'
make[1]: *** [Makefile:484: all-recursive] Error 1
make[1]: Leaving directory '/<<PKGBUILDDIR>>'
dh_auto_build: error: make -j4 returned exit code 2
make: *** [debian/rules:16: binary-arch] Error 25

Tail of log for openvswitch on armhf:

| #define HAVE_STRUCT_TCF_T_FIRSTUSE 1
| #define HAVE_TCA_VLAN_PUSH_VLAN_PRIORITY 1
| #define HAVE_TCA_MPLS_TTL 1
| #define HAVE_TCA_TUNNEL_KEY_ENC_TTL 1
| #define HAVE_TCA_PEDIT_KEY_EX_HDR_TYPE_UDP 1
| #define HAVE_TCA_SKBEDIT_FLAGS 1
| #define HAVE_SCTP_CONNTRACK_HEARTBEATS 1
| #define HAVE_VIRTIO_TYPES 1
| #define HAVE_PRAGMA_MESSAGE 1
| 
| configure: exit 0

make[1]: *** [debian/rules:169: override_dh_auto_test] Error 1
make[1]: Leaving directory '/<<BUILDDIR>>/openvswitch-2.15.0+ds1'
make: *** [debian/rules:9: build-arch] Error 2

Tail of log for appstream-generator on armhf:

      |                                                                                     ^
[59/150] gdc -Isrc/asgen/appstream-generator.p -Isrc/asgen -I../src/asgen -Isrc -I../src -Igirepo -I../girepo -I/usr/include/d/glibd-2 -I/usr/include/libmount -I/usr/include/blkid -I/usr/include/glib-2.0 -I/usr/lib/arm-linux-gnueabihf/glib-2.0/include -I/usr/include/appstream -I/usr/include/appstream-compose -I/usr/include/gdk-pixbuf-2.0 -I/usr/include/libpng16 -I/usr/include/arm-linux-gnueabihf -Wall -Wdeprecated -g -O2 -ffile-prefix-map=/<<PKGBUILDDIR>>=. -fstack-protector-strong -frelease -pthread -pthread -pthread -J../src/asgen/../../data -Jsrc/asgen/../../data -MD -MQ src/asgen/appstream-generator.p/datainjectpkg.d.o -MF src/asgen/appstream-generator.p/datainjectpkg.d.o.deps -o src/asgen/appstream-generator.p/datainjectpkg.d.o -c ../src/asgen/datainjectpkg.d
FAILED: src/asgen/appstream-generator.p/datainjectpkg.d.o 
gdc -Isrc/asgen/appstream-generator.p -Isrc/asgen -I../src/asgen -Isrc -I../src -Igirepo -I../girepo -I/usr/include/d/glibd-2 -I/usr/include/libmount -I/usr/include/blkid -I/usr/include/glib-2.0 -I/usr/lib/arm-linux-gnueabihf/glib-2.0/include -I/usr/include/appstream -I/usr/include/appstream-compose -I/usr/include/gdk-pixbuf-2.0 -I/usr/include/libpng16 -I/usr/include/arm-linux-gnueabihf -Wall -Wdeprecated -g -O2 -ffile-prefix-map=/<<PKGBUILDDIR>>=. -fstack-protector-strong -frelease -pthread -pthread -pthread -J../src/asgen/../../data -Jsrc/asgen/../../data -MD -MQ src/asgen/appstream-generator.p/datainjectpkg.d.o -MF src/asgen/appstream-generator.p/datainjectpkg.d.o.deps -o src/asgen/appstream-generator.p/datainjectpkg.d.o -c ../src/asgen/datainjectpkg.d
../src/asgen/datainjectpkg.d:93:23: error: template std.range.primitives.empty cannot deduce function from argument types !()(string[string]), candidates are:
   93 |         if (!_contents.empty)
      |                       ^
/usr/lib/gcc/arm-linux-gnueabihf/10/include/d/std/range/primitives.d:2012:16: note: std.range.primitives.empty(T)(in T[] a)
 2012 | @property bool empty(T)(in T[] a) @safe pure nothrow @nogc
      |                ^
[60/150] gdc -Isrc/asgen/appstream-generator.p -Isrc/asgen -I../src/asgen -Isrc -I../src -Igirepo -I../girepo -I/usr/include/d/glibd-2 -I/usr/include/libmount -I/usr/include/blkid -I/usr/include/glib-2.0 -I/usr/lib/arm-linux-gnueabihf/glib-2.0/include -I/usr/include/appstream -I/usr/include/appstream-compose -I/usr/include/gdk-pixbuf-2.0 -I/usr/include/libpng16 -I/usr/include/arm-linux-gnueabihf -Wall -Wdeprecated -g -O2 -ffile-prefix-map=/<<PKGBUILDDIR>>=. -fstack-protector-strong -frelease -pthread -pthread -pthread -J../src/asgen/../../data -Jsrc/asgen/../../data -MD -MQ src/asgen/appstream-generator.p/.._app.d.o -MF src/asgen/appstream-generator.p/.._app.d.o.deps -o src/asgen/appstream-generator.p/.._app.d.o -c ../src/app.d
[61/150] gdc -Isrc/asgen/appstream-generator.p -Isrc/asgen -I../src/asgen -Isrc -I../src -Igirepo -I../girepo -I/usr/include/d/glibd-2 -I/usr/include/libmount -I/usr/include/blkid -I/usr/include/glib-2.0 -I/usr/lib/arm-linux-gnueabihf/glib-2.0/include -I/usr/include/appstream -I/usr/include/appstream-compose -I/usr/include/gdk-pixbuf-2.0 -I/usr/include/libpng16 -I/usr/include/arm-linux-gnueabihf -Wall -Wdeprecated -g -O2 -ffile-prefix-map=/<<PKGBUILDDIR>>=. -fstack-protector-strong -frelease -pthread -pthread -pthread -J../src/asgen/../../data -Jsrc/asgen/../../data -MD -MQ src/asgen/appstream-generator.p/contentsstore.d.o -MF src/asgen/appstream-generator.p/contentsstore.d.o.deps -o src/asgen/appstream-generator.p/contentsstore.d.o -c ../src/asgen/contentsstore.d
ninja: build stopped: subcommand failed.
dh_auto_build: error: cd obj-arm-linux-gnueabihf && LC_ALL=C.UTF-8 ninja -j4 -v returned exit code 1
make: *** [debian/rules:18: binary-arch] Error 25

Tail of log for ismrmrd on armhf:

./tests/test_acquisitions.cpp(7): Leaving test suite "AcquisitionsTest"
Test is aborted
Leaving test module "ISMRMRD Unit Tests"

*** 1 failure is detected in the test module "ISMRMRD Unit Tests"
make[4]: *** [tests/CMakeFiles/check.dir/build.make:79: tests/CMakeFiles/check] Error 201
make[4]: Leaving directory '/<<PKGBUILDDIR>>/obj-arm-linux-gnueabihf'
make[3]: *** [CMakeFiles/Makefile2:435: tests/CMakeFiles/check.dir/all] Error 2
make[3]: Leaving directory '/<<PKGBUILDDIR>>/obj-arm-linux-gnueabihf'
make[2]: *** [CMakeFiles/Makefile2:442: tests/CMakeFiles/check.dir/rule] Error 2
make[2]: Leaving directory '/<<PKGBUILDDIR>>/obj-arm-linux-gnueabihf'
make[1]: *** [Makefile:325: check] Error 2
make[1]: Leaving directory '/<<PKGBUILDDIR>>/obj-arm-linux-gnueabihf'
dh_auto_test: error: cd obj-arm-linux-gnueabihf && make -j4 check ARGS\+=--verbose ARGS\+=-j4 returned exit code 2
make: *** [debian/rules:14: binary-arch] Error 25

Tail of log for libundead on armhf:

/<<PKGBUILDDIR>>/src/undead/stream.d:1222:16: error: generic thunk code fails for method ‘_DT12_D6undead6stream6Stream6writefMFYC6undead6stream12OutputStream’ which uses ‘...’
 1222 |   OutputStream writef(...) {
      |                ^
/<<PKGBUILDDIR>>/src/undead/stream.d:1207:10: error: generic thunk code fails for method ‘_DT12_D6undead6stream6Stream6printfMFAxaYk’ which uses ‘...’
 1207 |   size_t printf(const(char)[] format, ...) {
      |          ^
/<<PKGBUILDDIR>>/src/undead/stream.d:1069:7: error: generic thunk code fails for method ‘_DT8_D6undead6stream6Stream5readfMFYi’ which uses ‘...’
 1069 |   int readf(...) {
      |       ^
[3/29] gdc -Ilibundead.so.1.0.7.p -I. -I.. -I../src -Wall -Wdeprecated -g -O2 -ffile-prefix-map=/<<PKGBUILDDIR>>=. -fstack-protector-strong -frelease -fPIC -MD -MQ libundead.so.1.0.7.p/src_undead_bitarray.d.o -MF libundead.so.1.0.7.p/src_undead_bitarray.d.o.deps -o libundead.so.1.0.7.p/src_undead_bitarray.d.o -c ../src/undead/bitarray.d
[4/29] gdc -Ilibundead.so.1.0.7.p -I. -I.. -I../src -Wall -Wdeprecated -g -O2 -ffile-prefix-map=/<<PKGBUILDDIR>>=. -fstack-protector-strong -frelease -fPIC -MD -MQ libundead.so.1.0.7.p/src_undead_dateparse.d.o -MF libundead.so.1.0.7.p/src_undead_dateparse.d.o.deps -o libundead.so.1.0.7.p/src_undead_dateparse.d.o -c ../src/undead/dateparse.d
[5/29] gdc -Ilibundead.so.1.0.7.p -I. -I.. -I../src -Wall -Wdeprecated -g -O2 -ffile-prefix-map=/<<PKGBUILDDIR>>=. -fstack-protector-strong -frelease -fPIC -MD -MQ libundead.so.1.0.7.p/src_undead_date.d.o -MF libundead.so.1.0.7.p/src_undead_date.d.o.deps -o libundead.so.1.0.7.p/src_undead_date.d.o -c ../src/undead/date.d
ninja: build stopped: subcommand failed.
dh_auto_build: error: cd obj-arm-linux-gnueabihf && LC_ALL=C.UTF-8 ninja -j4 -v returned exit code 1
make: *** [debian/rules:9: build-arch] Error 25

Tail of log for haskell-protobuf on armhf:

    fixed32:                                     OK
      +++ OK, passed 100 tests (100% prop_wire :: Fixed Word32).
    fixed64:                                     OK (0.01s)
      +++ OK, passed 100 tests (100% prop_wire :: Fixed Word64).
    sfixed32:                                    OK
      +++ OK, passed 100 tests (100% prop_wire :: Fixed Int32).
    sfixed64:                                    OK (0.01s)
      +++ OK, passed 100 tests (100% prop_wire :: Fixed Int64).
    float:                                       OK (0.01s)
      +++ OK, passed 100 tests (100% prop_wire :: Float).
    double:                                      protobuf-test: SignalException 7
Test suite protobuf-test: FAIL
Test suite logged to: dist-ghc/test/protobuf-0.2.1.3-protobuf-test.log
0 of 1 test suites (0 of 1 test cases) passed.
make: *** [/usr/share/cdbs/1/class/hlibrary.mk:154: check-ghc-stamp] Error 1

Tail of log for quorum on armhf:

/usr/include/c++/10/bits/stl_algo.h:3479:5: note: candidate: 'template<class _Tp, class _Compare> _Tp std::min(std::initializer_list<_Tp>, _Compare)'
 3479 |     min(initializer_list<_Tp> __l, _Compare __comp)
      |     ^~~
/usr/include/c++/10/bits/stl_algo.h:3479:5: note:   template argument deduction/substitution failed:
src/histo_mer_database.cc:19:55: note:   mismatched types 'std::initializer_list<_Tp>' and 'long long unsigned int'
   19 |     const uint64_t val = std::min(vals.first, hlen - 1);
      |                                                       ^
make[3]: *** [Makefile:972: src/histo_mer_database.o] Error 1
make[3]: Leaving directory '/<<PKGBUILDDIR>>'
make[2]: *** [Makefile:1443: check-am] Error 2
make[2]: Leaving directory '/<<PKGBUILDDIR>>'
make[1]: *** [Makefile:1446: check] Error 2
make[1]: Leaving directory '/<<PKGBUILDDIR>>'
dh_auto_test: error: make -j1 check VERBOSE=1 returned exit code 2
make: *** [debian/rules:12: binary-arch] Error 25

Tail of log for python-skbio on armhf:

FAILED skbio/stats/distance/tests/test_mantel.py::PairwiseMantelTests::test_many_filepaths_as_input
FAILED skbio/stats/distance/tests/test_mantel.py::PairwiseMantelTests::test_minimal_compatible_input
FAILED skbio/stats/distance/tests/test_mantel.py::PairwiseMantelTests::test_minimal_compatible_input_with_labels
FAILED skbio/stats/distance/tests/test_mantel.py::PairwiseMantelTests::test_na_p_value
FAILED skbio/stats/distance/tests/test_mantel.py::PairwiseMantelTests::test_reordered_distance_matrices
FAILED skbio/stats/distance/tests/test_mantel.py::PairwiseMantelTests::test_strict
FAILED skbio/stats/tests/test_subsample.py::SubsampleCountsTests::test_subsample_counts_nonrandom
FAILED skbio/stats/tests/test_subsample.py::SubsampleCountsTests::test_subsample_counts_without_replacement
FAILED skbio/stats/tests/test_subsample.py::ISubsampleTests::test_isubsample_simple
FAILED skbio/stats/tests/test_subsample.py::ISubsampleTests::test_per_sample_sequences_complex
FAILED skbio/stats/tests/test_subsample.py::ISubsampleTests::test_per_sample_sequences_min_seqs
=== 87 failed, 2231 passed, 30 skipped, 17085 warnings in 243.15s (0:04:03) ====
E: pybuild pybuild:353: test: plugin distutils failed with: exit code=1: cd /<<PKGBUILDDIR>>/.pybuild/cpython3_3.9_skbio/build; python3.9 -m pytest 
dh_auto_test: error: pybuild --test --test-pytest -i python{version} -p 3.9 returned exit code 13
make: *** [debian/rules:13: binary-arch] Error 25

Tail of log for gfccore on armhf:

set -e;    
make[1]: Leaving directory '/<<PKGBUILDDIR>>'
if [ "reverse-patches" = "reverse-patches" ]; then rm -f debian/stamp-patched; fi
patches: 
if [ "reverse-patches" != "reverse-patches" ]; then touch debian/stamp-patched; fi
if [ "reverse-patches" != "reverse-patches" ] ; then \
	/usr/bin/make -f debian/rules update-config ; \
fi
for dir in debian/patches ; do \
    rm -f $dir/*.log ; \
done
set -e;    
dh_clean 
dh_clean: error: Compatibility levels before 5 are no longer supported (level 4 requested)
make: *** [/usr/share/cdbs/1/rules/debhelper.mk:211: clean] Error 25

Tail of log for libibcm on armhf:

#define HAVE_INTTYPES_H 1
#define HAVE_STDINT_H 1
#define HAVE_STRINGS_H 1
#define HAVE_SYS_STAT_H 1
#define HAVE_SYS_TYPES_H 1
#define HAVE_UNISTD_H 1
#define STDC_HEADERS 1
#define HAVE_DLFCN_H 1
#define LT_OBJDIR ".libs/"
#define SIZEOF_LONG 4
#define HAVE_LIBIBVERBS 1

configure: exit 1
dh_auto_configure: error: ./configure --build=arm-linux-gnueabihf --prefix=/usr --includedir=\${prefix}/include --mandir=\${prefix}/share/man --infodir=\${prefix}/share/info --sysconfdir=/etc --localstatedir=/var --disable-option-checking --disable-silent-rules --libdir=\${prefix}/lib/arm-linux-gnueabihf --libexecdir=\${prefix}/lib/arm-linux-gnueabihf --disable-maintainer-mode --disable-dependency-tracking returned exit code 1
make: *** [debian/rules:7: build-arch] Error 25

Tail of log for spades on armhf:

-- Looking for stdint.h - found
-- Looking for stddef.h
-- Looking for stddef.h - found
-- Check size of void*
-- Check size of void* - done
CMake Error at /<<BUILDDIR>>/spades-3.13.1+dfsg/assembler/ext/src/jemalloc/CMakeLists.txt:79 (message):
  Unsupported pointer size


-- Configuring incomplete, errors occurred!
See also "/<<BUILDDIR>>/spades-3.13.1+dfsg/assembler/build_spades/CMakeFiles/CMakeOutput.log".
See also "/<<BUILDDIR>>/spades-3.13.1+dfsg/assembler/build_spades/CMakeFiles/CMakeError.log".
make[1]: *** [debian/rules:42: override_dh_auto_build] Error 1
make[1]: Leaving directory '/<<BUILDDIR>>/spades-3.13.1+dfsg'
make: *** [debian/rules:24: build-arch] Error 2

Tail of log for icinga2 on armhf:

                 from /<<PKGBUILDDIR>>/obj-arm-linux-gnueabihf/lib/base/configobject-ti.hpp:4,
                 from /<<PKGBUILDDIR>>/lib/base/configobject.hpp:7,
                 from /<<PKGBUILDDIR>>/lib/icinga/apiactions.hpp:7,
                 from /<<PKGBUILDDIR>>/lib/icinga/apiactions.cpp:3,
                 from /<<PKGBUILDDIR>>/obj-arm-linux-gnueabihf/lib/icinga/icinga_unity.cpp:1:
/usr/include/c++/10/bits/stl_vector.h:1198:21: note: parameter passing for argument of type '__gnu_cxx::__normal_iterator<icinga::Value*, std::vector<icinga::Value> >' changed in GCC 7.1
 1198 |    _M_realloc_insert(end(), __x);
      |    ~~~~~~~~~~~~~~~~~^~~~~~~~~~~~
make[3]: Leaving directory '/<<PKGBUILDDIR>>/obj-arm-linux-gnueabihf'
[ 54%] Built target icinga
make[2]: Leaving directory '/<<PKGBUILDDIR>>/obj-arm-linux-gnueabihf'
make[1]: *** [Makefile:185: all] Error 2
make[1]: Leaving directory '/<<PKGBUILDDIR>>/obj-arm-linux-gnueabihf'
dh_auto_build: error: cd obj-arm-linux-gnueabihf && make -j4 "INSTALL=install --strip-program=true" VERBOSE=1 returned exit code 2
make: *** [debian/rules:17: build-arch] Error 25

Tail of log for tensorpipe on armhf:

/usr/bin/ld: CMakeFiles/tensorpipe_test.dir/util/ringbuffer/ringbuffer_test.cc.o: in function `std::__atomic_base<unsigned long long>::fetch_add(unsigned long long, std::memory_order)':
/usr/include/c++/10/bits/atomic_base.h:548: undefined reference to `__atomic_fetch_add_8'
/usr/bin/ld: CMakeFiles/tensorpipe_test.dir/util/ringbuffer/ringbuffer_test.cc.o: in function `std::__atomic_base<unsigned long long>::load(std::memory_order) const':
/usr/include/c++/10/bits/atomic_base.h:426: undefined reference to `__atomic_load_8'
/usr/bin/ld: /usr/include/c++/10/bits/atomic_base.h:426: undefined reference to `__atomic_load_8'
/usr/bin/ld: ../libtensorpipe.so.0: undefined reference to `__atomic_fetch_sub_8'
collect2: error: ld returned 1 exit status
make[3]: *** [tensorpipe/test/CMakeFiles/tensorpipe_test.dir/build.make:488: tensorpipe/test/tensorpipe_test] Error 1
make[3]: Leaving directory '/<<PKGBUILDDIR>>/obj-arm-linux-gnueabihf'
make[2]: *** [CMakeFiles/Makefile2:227: tensorpipe/test/CMakeFiles/tensorpipe_test.dir/all] Error 2
make[2]: Leaving directory '/<<PKGBUILDDIR>>/obj-arm-linux-gnueabihf'
make[1]: *** [Makefile:152: all] Error 2
make[1]: Leaving directory '/<<PKGBUILDDIR>>/obj-arm-linux-gnueabihf'
dh_auto_build: error: cd obj-arm-linux-gnueabihf && make -j4 "INSTALL=install --strip-program=true" VERBOSE=1 returned exit code 2
make: *** [debian/rules:9: binary-arch] Error 25

Tail of log for acovea on armhf:

 fakeroot debian/rules clean
dh_testdir
dh_testroot
rm -f build-stamp 
# Add here commands to clean up after the build process.
/usr/bin/make distclean
make[1]: Entering directory '/<<PKGBUILDDIR>>'
make[1]: *** No rule to make target 'distclean'.  Stop.
make[1]: Leaving directory '/<<PKGBUILDDIR>>'
make: [debian/rules:49: clean] Error 2 (ignored)
cp -f /usr/share/misc/config.sub config.sub
cp -f /usr/share/misc/config.guess config.guess
dh_clean 
dh_clean: error: Compatibility levels before 5 are no longer supported (level 4 requested)
make: *** [debian/rules:52: clean] Error 25

Tail of log for mingw32-binutils on armhf:

dpkg-buildpackage
-----------------

dpkg-buildpackage: info: source package mingw32-binutils
dpkg-buildpackage: info: source version 2.20-0.2
dpkg-buildpackage: info: source distribution unstable
 dpkg-source --before-build .
dpkg-buildpackage: info: host architecture armhf
 fakeroot debian/rules clean
dh_testdir
dh_testroot
rm -rf /<<PKGBUILDDIR>>/build_dir *-stamp
dh_clean
dh_clean: error: Compatibility levels before 5 are no longer supported (level 4 requested)
make: *** [debian/rules:123: clean] Error 25

Tail of log for rocksdb on armhf:

/usr/include/c++/10/bits/vector.tcc: In member function 'void std::vector<_Tp, _Alloc>::_M_realloc_insert(std::vector<_Tp, _Alloc>::iterator, _Args&& ...) [with _Args = {rocksdb::DBOptions, rocksdb::ColumnFamilyOptions&}; _Tp = rocksdb::Options; _Alloc = std::allocator<rocksdb::Options>]':
/usr/include/c++/10/bits/vector.tcc:426:7: note: parameter passing for argument of type 'std::vector<rocksdb::Options>::iterator' changed in GCC 7.1
/usr/include/c++/10/bits/vector.tcc: In member function 'void std::vector<_Tp, _Alloc>::emplace_back(_Args&& ...) [with _Args = {rocksdb::DBOptions, rocksdb::ColumnFamilyOptions&}; _Tp = rocksdb::Options; _Alloc = std::allocator<rocksdb::Options>]':
/usr/include/c++/10/bits/vector.tcc:121:21: note: parameter passing for argument of type '__gnu_cxx::__normal_iterator<rocksdb::Options*, std::vector<rocksdb::Options> >' changed in GCC 7.1
  121 |    _M_realloc_insert(end(), std::forward<_Args>(__args)...);
      |    ~~~~~~~~~~~~~~~~~^~~~~~~~~~~~~~~~~~~~~~~~~~~~~~~~~~~~~~~
/usr/include/c++/10/bits/vector.tcc: In member function 'virtual void rocksdb::DBCompactionTestWithParam_LevelCompactionCFPathUse_Test::TestBody()':
/usr/include/c++/10/bits/vector.tcc:121:21: note: parameter passing for argument of type '__gnu_cxx::__normal_iterator<rocksdb::Options*, std::vector<rocksdb::Options> >' changed in GCC 7.1
  121 |    _M_realloc_insert(end(), std::forward<_Args>(__args)...);
      |    ~~~~~~~~~~~~~~~~~^~~~~~~~~~~~~~~~~~~~~~~~~~~~~~~~~~~~~~~
make[2]: Leaving directory '/<<PKGBUILDDIR>>'
dh_auto_build: error: make -j4 "INSTALL=install --strip-program=true" all returned exit code 2
make[1]: *** [debian/rules:19: override_dh_auto_build] Error 25
make[1]: Leaving directory '/<<PKGBUILDDIR>>'
make: *** [debian/rules:29: build-arch] Error 2

Tail of log for pmake on armhf:

/usr/bin/ld: make_malloc.o:./make.h:454: multiple definition of `debug_file'; arch.o:./make.h:454: first defined here
/usr/bin/ld: parse.o:./make.h:454: multiple definition of `debug_file'; arch.o:./make.h:454: first defined here
/usr/bin/ld: str.o:./make.h:454: multiple definition of `debug_file'; arch.o:./make.h:454: first defined here
/usr/bin/ld: suff.o:./make.h:454: multiple definition of `debug_file'; arch.o:./make.h:454: first defined here
/usr/bin/ld: targ.o:./make.h:454: multiple definition of `debug_file'; arch.o:./make.h:454: first defined here
/usr/bin/ld: trace.o:./make.h:454: multiple definition of `debug_file'; arch.o:./make.h:454: first defined here
/usr/bin/ld: var.o:./make.h:454: multiple definition of `debug_file'; arch.o:./make.h:454: first defined here
/usr/bin/ld: util.o:./make.h:454: multiple definition of `debug_file'; arch.o:./make.h:454: first defined here
/usr/bin/ld: meta.o:./make.h:454: multiple definition of `debug_file'; arch.o:./make.h:454: first defined here
collect2: error: ld returned 1 exit status
make[2]: *** [Makefile.boot:43: bmake] Error 1
make[2]: Leaving directory '/<<PKGBUILDDIR>>'
make[1]: *** [debian/rules:30: override_dh_auto_build] Error 2
make[1]: Leaving directory '/<<PKGBUILDDIR>>'
make: *** [debian/rules:24: build-arch] Error 2

Tail of log for apf on armhf:

checking for suffix of executables... 
checking for suffix of object files... o
checking whether we are using the GNU C compiler... yes
checking whether arm-linux-gnueabihf-gcc accepts -g... yes
checking for arm-linux-gnueabihf-gcc option to accept ISO C89... none needed
checking for style of include used by make... GNU
checking dependency style of arm-linux-gnueabihf-gcc... gcc3
checking how to run the C preprocessor... arm-linux-gnueabihf-gcc -E
checking for grep that handles long lines and -e... /bin/grep
checking for egrep... /bin/grep -E
checking whether arm-linux-gnueabihf-gcc needs -traditional... no
checking for openssl... no
checking for SSL_library_init in -lssl... no
configure: error: "lib ssl not found!"
make: *** [debian/rules:29: config.status] Error 1

Tail of log for ocamlgsl on armhf:

In file included from mlgsl_matrix.h:9,
                 from mlgsl_matrix_double.h:11,
                 from mlgsl_wavelet.c:13:
wrappers.h:13:2: error: #error "Architectures with double-word alignment for doubles are not supported"
   13 | #error "Architectures with double-word alignment for doubles are not supported"
      |  ^~~~~
arm-linux-gnueabihf-gcc src/mlgsl_cdf.o (exit 1)
(cd _build/default/src && /usr/bin/arm-linux-gnueabihf-gcc -O2 -fno-strict-aliasing -fwrapv -fPIC -D_FILE_OFFSET_BITS=64 -D_REENTRANT -O2 -fno-strict-aliasing -fwrapv -fPIC -fPIC -DPIC -Wno-unused-parameter -g -I /usr/lib/ocaml -o mlgsl_cdf.o -c mlgsl_cdf.c)
In file included from mlgsl_cdf.c:2:
wrappers.h:13:2: error: #error "Architectures with double-word alignment for doubles are not supported"
   13 | #error "Architectures with double-word alignment for doubles are not supported"
      |  ^~~~~
make[1]: *** [debian/rules:11: override_dh_auto_build] Error 1
make[1]: Leaving directory '/<<PKGBUILDDIR>>'
make: *** [debian/rules:8: binary-arch] Error 2

Tail of log for asterisk-chan-capi on armhf:

 9096 |   if (cid_name == 0 && i->owner->cid.cid_name && *i->owner->cid.cid_name) {
      |                                ^~
chan_capi.c:9096:59: error: invalid use of undefined type 'struct ast_channel'
 9096 |   if (cid_name == 0 && i->owner->cid.cid_name && *i->owner->cid.cid_name) {
      |                                                           ^~
In file included from /usr/include/asterisk/asterisk.h:23,
                 from chan_capi.h:20,
                 from chan_capi.c:32:
chan_capi.c:9097:34: error: invalid use of undefined type 'struct ast_channel'
 9097 |   cid_name = ast_strdupa(i->owner->cid.cid_name);
      |                                  ^~
make[1]: *** [Makefile:198: chan_capi.o] Error 1
make[1]: Leaving directory '/<<PKGBUILDDIR>>'
dh_auto_build: error: make -j1 returned exit code 2
make: *** [debian/rules:3: build-arch] Error 25

Tail of log for autofs5 on armhf:

/usr/bin/ld: ../lib/autofs.a(master.o): in function `master_submount_list_empty':
master.c:(.text+0x1950): undefined reference to `dump_core'
/usr/bin/ld: master.c:(.text+0x1970): undefined reference to `dump_core'
/usr/bin/ld: ../lib/autofs.a(master.o):master.c:(.text+0x1bdc): more undefined references to `dump_core' follow
/usr/bin/ld: ../lib/autofs.a(master.o): in function `master_mount_mounts':
master.c:(.text+0x2264): undefined reference to `pthread_create'
/usr/bin/ld: master.c:(.text+0x23dc): undefined reference to `dump_core'
/usr/bin/ld: ../lib/autofs.a(master.o): in function `master_done':
master.c:(.text+0x2544): undefined reference to `pthread_join'
collect2: error: ld returned 1 exit status
make[2]: *** [Makefile:28: automount] Error 1
make[2]: Leaving directory '/<<PKGBUILDDIR>>/daemon'
make[1]: *** [Makefile:14: daemon] Error 2
make[1]: Leaving directory '/<<PKGBUILDDIR>>'
make: *** [debian/rules:23: build.stamp] Error 2

Tail of log for audacious-analog-vumeter-plugin on armhf:

make[3]: Entering directory '/<<PKGBUILDDIR>>/src'
/bin/bash ../libtool --tag=CC   --mode=compile gcc -DHAVE_CONFIG_H -I. -I..    -Wall -ggdb  -g -O2 -DSKINDIR=\"/usr/share/audacious\" -g -O2 -c -o plugin_main.lo plugin_main.c
libtool: compile:  gcc -DHAVE_CONFIG_H -I. -I.. -Wall -ggdb -g -O2 -DSKINDIR=\"/usr/share/audacious\" -g -O2 -c plugin_main.c  -fPIC -DPIC -o .libs/plugin_main.o
plugin_main.c:1:10: fatal error: gtk/gtk.h: No such file or directory
    1 | #include <gtk/gtk.h>
      |          ^~~~~~~~~~~
compilation terminated.
make[3]: *** [Makefile:321: plugin_main.lo] Error 1
make[3]: Leaving directory '/<<PKGBUILDDIR>>/src'
make[2]: *** [Makefile:365: all-recursive] Error 1
make[2]: Leaving directory '/<<PKGBUILDDIR>>'
make[1]: *** [Makefile:254: all] Error 2
make[1]: Leaving directory '/<<PKGBUILDDIR>>'
dh_auto_build: error: make -j1 returned exit code 2
make: *** [debian/rules:8: build-arch] Error 25

Tail of log for bbhash on armhf:

BooPHF.h:817:35: error: expected ‘)’ before ‘word’
  817 |   return (uint64_t)(((__uint128_t)word * (__uint128_t)p) >> 64);
      |                     ~             ^~~~
      |                                   )
BooPHF.h:817:64: error: expected ‘)’ before ‘;’ token
  817 |   return (uint64_t)(((__uint128_t)word * (__uint128_t)p) >> 64);
      |                    ~                                           ^
      |                                                                )
make[1]: *** [makefile:25: example_custom_hash] Error 1
make[1]: *** Waiting for unfinished jobs....
make[1]: *** [makefile:22: example] Error 1
make[1]: *** [makefile:29: Bootest] Error 1
make[1]: Leaving directory '/<<PKGBUILDDIR>>'
dh_auto_build: error: make -j4 "INSTALL=install --strip-program=true" returned exit code 2
make: *** [debian/rules:21: binary-arch] Error 25

Tail of log for bustools on armhf:

   73 | inline size_t rndup(size_t v) {
      |               ^~~~~
make[4]: *** [src/CMakeFiles/bustools_core.dir/build.make:98: src/CMakeFiles/bustools_core.dir/Common.cpp.o] Error 1
make[4]: *** Waiting for unfinished jobs....
make[4]: *** [src/CMakeFiles/bustools_core.dir/build.make:111: src/CMakeFiles/bustools_core.dir/bustools_capture.cpp.o] Error 1
make[4]: *** [src/CMakeFiles/bustools_core.dir/build.make:124: src/CMakeFiles/bustools_core.dir/bustools_correct.cpp.o] Error 1
make[4]: Leaving directory '/<<PKGBUILDDIR>>/obj-arm-linux-gnueabihf'
make[3]: *** [CMakeFiles/Makefile2:145: src/CMakeFiles/bustools_core.dir/all] Error 2
make[3]: Leaving directory '/<<PKGBUILDDIR>>/obj-arm-linux-gnueabihf'
make[2]: *** [Makefile:152: all] Error 2
make[2]: Leaving directory '/<<PKGBUILDDIR>>/obj-arm-linux-gnueabihf'
dh_auto_build: error: cd obj-arm-linux-gnueabihf && make -j4 "INSTALL=install --strip-program=true" VERBOSE=1 returned exit code 2
make[1]: *** [debian/rules:17: override_dh_auto_build] Error 25
make[1]: Leaving directory '/<<PKGBUILDDIR>>'
make: *** [debian/rules:9: binary-arch] Error 2

Tail of log for blastem on armhf:

      |                                                                     ~~~~~~~~~^~~
z80_to_x86.c: In function 'zremove_breakpoint':
z80_to_x86.c:3875:22: warning: assignment to 'code_ptr' {aka 'unsigned int *'} from incompatible pointer type 'uint8_t *' {aka 'unsigned char *'} [-Wincompatible-pointer-types]
 3875 |   opts->gen.code.cur = native;
      |                      ^
z80_to_x86.c:3876:23: warning: assignment to 'code_ptr' {aka 'unsigned int *'} from incompatible pointer type 'uint8_t *' {aka 'unsigned char *'} [-Wincompatible-pointer-types]
 3876 |   opts->gen.code.last = native + 128;
      |                       ^
make[2]: *** [Makefile:358: z80_to_x86.o] Error 1
make[2]: *** Waiting for unfinished jobs....
make[2]: Leaving directory '/<<PKGBUILDDIR>>'
dh_auto_build: error: make -j4 "INSTALL=install --strip-program=true" HOST_ZLIB=1 CONFIG_PATH=/etc/blastem CPU=arm DATA_PATH=/usr/share/games/blastem returned exit code 2
make[1]: *** [debian/rules:11: override_dh_auto_build] Error 25
make[1]: Leaving directory '/<<PKGBUILDDIR>>'
make: *** [debian/rules:8: binary-arch] Error 2

Tail of log for criu on armhf:

arch/arm/include/asm/atomic.h: At top level:
arch/arm/include/asm/atomic.h:60:2: error: #error ARM architecture version (CONFIG_ARMV*) not set or unsupported.
   60 | #error ARM architecture version (CONFIG_ARMV*) not set or unsupported.
      |  ^~~~~
arch/arm/include/asm/atomic.h: In function 'atomic_add_return':
arch/arm/include/asm/atomic.h:81:2: error: implicit declaration of function 'smp_mb' [-Werror=implicit-function-declaration]
   81 |  smp_mb();
      |  ^~~~~~
cc1: all warnings being treated as errors
make[2]: *** [scripts/Makefile.build:185: arch/arm/crtools.o] Error 1
make[2]: Leaving directory '/<<PKGBUILDDIR>>'
make[1]: *** [Makefile:208: arch/arm] Error 2
make[1]: Leaving directory '/<<PKGBUILDDIR>>'
dh_auto_build: error: make -j4 returned exit code 2
make: *** [debian/rules:6: build-arch] Error 25

Tail of log for consul-migrate on armhf:

--- FAIL: TestMigrator_data (0.00s)
=== RUN   TestMigrator_new
--- PASS: TestMigrator_new (0.00s)
=== RUN   TestMigrator_migrate
    migrator_test.go:130: err: Failed to connect MDB: MDB_INVALID: File is not an LMDB file %!s(MISSING)
--- FAIL: TestMigrator_migrate (0.00s)
=== RUN   TestMigrator_migrate_fails
--- PASS: TestMigrator_migrate_fails (0.43s)
=== RUN   TestMigrator_migrate_noop
--- PASS: TestMigrator_migrate_noop (0.00s)
FAIL
FAIL	github.com/hashicorp/consul-migrate/migrator	0.447s
FAIL
dh_auto_test: error: cd obj-arm-linux-gnueabihf && go test -vet=off -v -p 1 github.com/hashicorp/consul-migrate github.com/hashicorp/consul-migrate/migrator returned exit code 1
make: *** [debian/rules:7: build-arch] Error 25

Tail of log for creduce on armhf:

/usr/lib/llvm-9/include/clang/Frontend/CompilerInvocation.h:154:15: note:   candidate expects 4 arguments, 3 provided
TransformationManager.cpp:140:32: error: 'Language' has not been declared
  140 |                                Language::OpenCL, T, PPOpts);
      |                                ^~~~~~~~
make[4]: *** [Makefile:2043: clang_delta-TransformationManager.o] Error 1
make[4]: *** Waiting for unfinished jobs....
make[4]: Leaving directory '/<<BUILDDIR>>/creduce-2.10.0+20201029/clang_delta'
make[3]: *** [Makefile:448: all-recursive] Error 1
make[3]: Leaving directory '/<<BUILDDIR>>/creduce-2.10.0+20201029'
make[2]: *** [Makefile:380: all] Error 2
make[2]: Leaving directory '/<<BUILDDIR>>/creduce-2.10.0+20201029'
dh_auto_build: error: make -j4 returned exit code 2
make[1]: *** [debian/rules:29: override_dh_auto_build] Error 25
make[1]: Leaving directory '/<<BUILDDIR>>/creduce-2.10.0+20201029'
make: *** [debian/rules:23: build-arch] Error 2

Tail of log for davs2 on armhf:

g++: error: common/arm/blockcopy8.o: No such file or directory
g++: error: common/arm/cpu-a.o: No such file or directory
g++: error: common/arm/dct-a.o: No such file or directory
g++: error: common/arm/ipfilter8.o: No such file or directory
g++: error: common/arm/mc-a.o: No such file or directory
g++: error: common/arm/pixel-util.o: No such file or directory
g++: error: common/arm/sad-a.o: No such file or directory
g++: error: common/arm/ssd-a.o: No such file or directory
make[1]: *** [Makefile:186: libdavs2.so.16] Error 1
make[1]: *** Waiting for unfinished jobs....
ar: common/arm/blockcopy8.o: No such file or directory
make[1]: *** [Makefile:181: libdavs2.a] Error 1
make[1]: Leaving directory '/<<PKGBUILDDIR>>/build/linux'
dh_auto_build: error: cd build/linux && make -j4 returned exit code 2
make: *** [debian/rules:9: binary-arch] Error 25

Tail of log for debiman on armhf:

--- PASS: TestCronSection (0.00s)
    --- PASS: TestCronSection/cron (0.00s)
PASS
ok  	github.com/Debian/debiman/internal/redirect	0.099s
=== RUN   TestSitemap
--- PASS: TestSitemap (0.00s)
=== RUN   TestSitemapIndex
--- PASS: TestSitemapIndex (0.00s)
PASS
ok  	github.com/Debian/debiman/internal/sitemap	0.064s
?   	github.com/Debian/debiman/internal/tag	[no test files]
?   	github.com/Debian/debiman/internal/write	[no test files]
FAIL
dh_auto_test: error: cd obj-arm-linux-gnueabihf && go test -vet=off -v -p 4 github.com/Debian/debiman github.com/Debian/debiman/cmd/debiman github.com/Debian/debiman/cmd/debiman-auxserver github.com/Debian/debiman/cmd/debiman-idx2rwmap github.com/Debian/debiman/cmd/debiman-minisrv github.com/Debian/debiman/internal/auxserver github.com/Debian/debiman/internal/bundled github.com/Debian/debiman/internal/commontmpl github.com/Debian/debiman/internal/convert github.com/Debian/debiman/internal/manpage github.com/Debian/debiman/internal/proto github.com/Debian/debiman/internal/recode github.com/Debian/debiman/internal/redirect github.com/Debian/debiman/internal/sitemap github.com/Debian/debiman/internal/tag github.com/Debian/debiman/internal/write returned exit code 1
make: *** [debian/rules:4: binary-arch] Error 25

Tail of log for ccls on armhf:

      |  ~~~~~~~~~~~~~~~~~~~~~^~~~~~~~~~~~~~~~~~~~~~~~~
[100%] Linking CXX executable ccls
/usr/bin/cmake -E cmake_link_script CMakeFiles/ccls.dir/link.txt --verbose=1
/usr/bin/c++ -g -O2 -ffile-prefix-map=/<<PKGBUILDDIR>>=. -fstack-protector-strong -Wformat -Werror=format-security -Wdate-time -D_FORTIFY_SOURCE=2 -Wl,-z,relro -Wl,-z,now CMakeFiles/ccls.dir/third_party/siphash.cc.o CMakeFiles/ccls.dir/src/clang_tu.cc.o CMakeFiles/ccls.dir/src/config.cc.o CMakeFiles/ccls.dir/src/filesystem.cc.o CMakeFiles/ccls.dir/src/fuzzy_match.cc.o CMakeFiles/ccls.dir/src/main.cc.o CMakeFiles/ccls.dir/src/include_complete.cc.o CMakeFiles/ccls.dir/src/indexer.cc.o CMakeFiles/ccls.dir/src/log.cc.o CMakeFiles/ccls.dir/src/lsp.cc.o CMakeFiles/ccls.dir/src/message_handler.cc.o CMakeFiles/ccls.dir/src/pipeline.cc.o CMakeFiles/ccls.dir/src/platform_posix.cc.o CMakeFiles/ccls.dir/src/platform_win.cc.o CMakeFiles/ccls.dir/src/position.cc.o CMakeFiles/ccls.dir/src/project.cc.o CMakeFiles/ccls.dir/src/query.cc.o CMakeFiles/ccls.dir/src/sema_manager.cc.o CMakeFiles/ccls.dir/src/serializer.cc.o CMakeFiles/ccls.dir/src/test.cc.o CMakeFiles/ccls.dir/src/utils.cc.o CMakeFiles/ccls.dir/src/working_files.cc.o CMakeFiles/ccls.dir/src/messages/ccls_call.cc.o CMakeFiles/ccls.dir/src/messages/ccls_info.cc.o CMakeFiles/ccls.dir/src/messages/ccls_inheritance.cc.o CMakeFiles/ccls.dir/src/messages/ccls_member.cc.o CMakeFiles/ccls.dir/src/messages/ccls_navigate.cc.o CMakeFiles/ccls.dir/src/messages/ccls_reload.cc.o CMakeFiles/ccls.dir/src/messages/ccls_vars.cc.o CMakeFiles/ccls.dir/src/messages/initialize.cc.o CMakeFiles/ccls.dir/src/messages/textDocument_code.cc.o CMakeFiles/ccls.dir/src/messages/textDocument_completion.cc.o CMakeFiles/ccls.dir/src/messages/textDocument_definition.cc.o CMakeFiles/ccls.dir/src/messages/textDocument_did.cc.o CMakeFiles/ccls.dir/src/messages/textDocument_foldingRange.cc.o CMakeFiles/ccls.dir/src/messages/textDocument_formatting.cc.o CMakeFiles/ccls.dir/src/messages/textDocument_document.cc.o CMakeFiles/ccls.dir/src/messages/textDocument_hover.cc.o CMakeFiles/ccls.dir/src/messages/textDocument_references.cc.o CMakeFiles/ccls.dir/src/messages/textDocument_rename.cc.o CMakeFiles/ccls.dir/src/messages/textDocument_signatureHelp.cc.o CMakeFiles/ccls.dir/src/messages/workspace.cc.o -o ccls  -Wl,-rpath,/usr/lib/llvm-11/lib: /usr/lib/llvm-11/lib/libclang-cpp.so.11 /usr/lib/llvm-11/lib/libLLVM-11.so.1 -pthread 
/usr/bin/ld: CMakeFiles/ccls.dir/src/pipeline.cc.o: undefined reference to symbol '__atomic_load_8@@LIBATOMIC_1.0'
/usr/bin/ld: /usr/lib/arm-linux-gnueabihf/libatomic.so.1: error adding symbols: DSO missing from command line
collect2: error: ld returned 1 exit status
make[3]: *** [CMakeFiles/ccls.dir/build.make:723: ccls] Error 1
make[3]: Leaving directory '/<<PKGBUILDDIR>>/obj-arm-linux-gnueabihf'
make[2]: *** [CMakeFiles/Makefile2:210: CMakeFiles/ccls.dir/all] Error 2
make[2]: Leaving directory '/<<PKGBUILDDIR>>/obj-arm-linux-gnueabihf'
make[1]: *** [Makefile:152: all] Error 2
make[1]: Leaving directory '/<<PKGBUILDDIR>>/obj-arm-linux-gnueabihf'
dh_auto_build: error: cd obj-arm-linux-gnueabihf && make -j4 "INSTALL=install --strip-program=true" VERBOSE=1 returned exit code 2
make: *** [debian/rules:15: binary-arch] Error 25

Tail of log for deepin-movie-reborn on armhf:

/usr/lib/qt5/bin/moc -DQT_CONCURRENT_LIB -DQT_CORE_LIB -DQT_DBUS_LIB -DQT_GUI_LIB -DQT_NETWORK_LIB -DQT_NO_DEBUG -DQT_SQL_LIB -DQT_WIDGETS_LIB -DQT_X11EXTRAS_LIB -I/<<PKGBUILDDIR>>/obj-arm-linux-gnueabihf/src -I/<<PKGBUILDDIR>>/src -I/<<PKGBUILDDIR>>/obj-arm-linux-gnueabihf -I/<<PKGBUILDDIR>> -I/<<PKGBUILDDIR>>/src/ON -I/<<PKGBUILDDIR>>/src/widgets -I/<<PKGBUILDDIR>>/src/common -I/<<PKGBUILDDIR>>/src/libdmr -I/<<PKGBUILDDIR>>/src/backends/mpv -I/usr/include/arm-linux-gnueabihf/qt5 -I/usr/include/arm-linux-gnueabihf/qt5/QtWidgets -I/usr/include/arm-linux-gnueabihf/qt5/QtGui -I/usr/include/arm-linux-gnueabihf/qt5/QtCore -I/usr/lib/arm-linux-gnueabihf/qt5/mkspecs/linux-g++ -I/usr/include/arm-linux-gnueabihf/qt5/QtX11Extras -I/usr/include/arm-linux-gnueabihf/qt5/QtNetwork -I/usr/include/arm-linux-gnueabihf/qt5/QtConcurrent -I/usr/include/arm-linux-gnueabihf/qt5/QtDBus -I/usr/include/arm-linux-gnueabihf/qt5/QtSql -I/usr/include/libdtk-5.2.2/DWidget -I/usr/include/libdtk-5.2.2/DGui -I/usr/include/libdtk-5.2.2/DCore -I/usr/include/arm-linux-gnueabihf/qt5/MprisQt -I/usr/include/arm-linux-gnueabihf/qt5/DBusExtended -I/usr/include/arm-linux-gnueabihf -I/usr/include/c++/10 -I/usr/include/arm-linux-gnueabihf/c++/10 -I/usr/include/c++/10/backward -I/usr/lib/gcc/arm-linux-gnueabihf/10/include -I/usr/local/include -I/usr/include --include /<<PKGBUILDDIR>>/obj-arm-linux-gnueabihf/src/deepin-movie_autogen/moc_predefs.h --output-dep-file -o /<<PKGBUILDDIR>>/obj-arm-linux-gnueabihf/src/deepin-movie_autogen/include/playlist_widget.moc /<<PKGBUILDDIR>>/src/widgets/playlist_widget.cpp
AutoMoc: Reading dependencies from "SRC:/obj-arm-linux-gnueabihf/src/deepin-movie_autogen/include/playlist_widget.moc.d"
AutoMoc: Generating "SRC:/obj-arm-linux-gnueabihf/src/deepin-movie_autogen/include/toolbox_proxy.moc", because it doesn't exist, from "SRC:/src/widgets/toolbox_proxy.cpp"
/usr/lib/qt5/bin/moc -DQT_CONCURRENT_LIB -DQT_CORE_LIB -DQT_DBUS_LIB -DQT_GUI_LIB -DQT_NETWORK_LIB -DQT_NO_DEBUG -DQT_SQL_LIB -DQT_WIDGETS_LIB -DQT_X11EXTRAS_LIB -I/<<PKGBUILDDIR>>/obj-arm-linux-gnueabihf/src -I/<<PKGBUILDDIR>>/src -I/<<PKGBUILDDIR>>/obj-arm-linux-gnueabihf -I/<<PKGBUILDDIR>> -I/<<PKGBUILDDIR>>/src/ON -I/<<PKGBUILDDIR>>/src/widgets -I/<<PKGBUILDDIR>>/src/common -I/<<PKGBUILDDIR>>/src/libdmr -I/<<PKGBUILDDIR>>/src/backends/mpv -I/usr/include/arm-linux-gnueabihf/qt5 -I/usr/include/arm-linux-gnueabihf/qt5/QtWidgets -I/usr/include/arm-linux-gnueabihf/qt5/QtGui -I/usr/include/arm-linux-gnueabihf/qt5/QtCore -I/usr/lib/arm-linux-gnueabihf/qt5/mkspecs/linux-g++ -I/usr/include/arm-linux-gnueabihf/qt5/QtX11Extras -I/usr/include/arm-linux-gnueabihf/qt5/QtNetwork -I/usr/include/arm-linux-gnueabihf/qt5/QtConcurrent -I/usr/include/arm-linux-gnueabihf/qt5/QtDBus -I/usr/include/arm-linux-gnueabihf/qt5/QtSql -I/usr/include/libdtk-5.2.2/DWidget -I/usr/include/libdtk-5.2.2/DGui -I/usr/include/libdtk-5.2.2/DCore -I/usr/include/arm-linux-gnueabihf/qt5/MprisQt -I/usr/include/arm-linux-gnueabihf/qt5/DBusExtended -I/usr/include/arm-linux-gnueabihf -I/usr/include/c++/10 -I/usr/include/arm-linux-gnueabihf/c++/10 -I/usr/include/c++/10/backward -I/usr/lib/gcc/arm-linux-gnueabihf/10/include -I/usr/local/include -I/usr/include --include /<<PKGBUILDDIR>>/obj-arm-linux-gnueabihf/src/deepin-movie_autogen/moc_predefs.h --output-dep-file -o /<<PKGBUILDDIR>>/obj-arm-linux-gnueabihf/src/deepin-movie_autogen/include/toolbox_proxy.moc /<<PKGBUILDDIR>>/src/widgets/toolbox_proxy.cpp
AutoMoc: Reading dependencies from "SRC:/obj-arm-linux-gnueabihf/src/deepin-movie_autogen/include/toolbox_proxy.moc.d"
AutoMoc: Generating MOC compilation "SRC:/obj-arm-linux-gnueabihf/src/deepin-movie_autogen/mocs_compilation.cpp"
AutoGen: Writing the parse cache file "SRC:/obj-arm-linux-gnueabihf/src/CMakeFiles/deepin-movie_autogen.dir/ParseCache.txt"
AutoGen: Writing the settings file "SRC:/obj-arm-linux-gnueabihf/src/CMakeFiles/deepin-movie_autogen.dir/AutogenUsed.txt"
make[3]: Leaving directory '/<<PKGBUILDDIR>>/obj-arm-linux-gnueabihf'
[  2%] Built target deepin-movie_autogen
make[2]: Leaving directory '/<<PKGBUILDDIR>>/obj-arm-linux-gnueabihf'
make[1]: *** [Makefile:152: all] Error 2
make[1]: Leaving directory '/<<PKGBUILDDIR>>/obj-arm-linux-gnueabihf'
dh_auto_build: error: cd obj-arm-linux-gnueabihf && make -j4 "INSTALL=install --strip-program=true" VERBOSE=1 returned exit code 2
make: *** [debian/rules:14: binary-arch] Error 25

Tail of log for dballe on armhf:

OK
2021-09-23 08:50:36,651 INFO test-csv: /usr/bin/python3 /<<PKGBUILDDIR>>/python/test-csv.py: success
2021-09-23 08:50:36,653 INFO runtest: 13 tests requested, 11 succeeded, 2 failed, 0 did not run.
make[5]: *** [Makefile:1034: check-local] Error 1
make[5]: Leaving directory '/<<PKGBUILDDIR>>/python'
make[4]: *** [Makefile:847: check-am] Error 2
make[4]: Leaving directory '/<<PKGBUILDDIR>>/python'
make[3]: *** [Makefile:849: check] Error 2
make[3]: Leaving directory '/<<PKGBUILDDIR>>/python'
make[2]: *** [Makefile:592: check-recursive] Error 1
make[2]: Leaving directory '/<<PKGBUILDDIR>>'
make[1]: *** [Makefile:889: check] Error 2
make[1]: Leaving directory '/<<PKGBUILDDIR>>'
dh_auto_test: error: make -j4 check VERBOSE=1 returned exit code 2
make: *** [debian/rules:7: build-arch] Error 25

Tail of log for fpzip on armhf:

one or more tests failed


0% tests passed, 1 tests failed out of 1

Total Test time (real) =   0.01 sec

The following tests FAILED:
	  1 - compress-decompress-validate (Failed)
Errors while running CTest
make[1]: *** [Makefile:140: test] Error 8
make[1]: Leaving directory '/<<PKGBUILDDIR>>/obj-arm-linux-gnueabihf'
	rm -fr -- /tmp/dh-xdg-rundir-DQ1SsiQ0
dh_auto_test: error: cd obj-arm-linux-gnueabihf && make -j4 test ARGS\+=--verbose ARGS\+=-j4 returned exit code 2
make: *** [debian/rules:8: build-arch] Error 25

Tail of log for febootstrap on armhf:

File "febootstrap_utils.ml", line 85, characters 42-46:
85 |   really_input chan data 0 (String.length data);
                                               ^^^^
Error: This expression has type bytes but an expression was expected of type
         string
make[4]: *** [Makefile:1275: febootstrap_utils.cmx] Error 2
make[4]: Leaving directory '/<<PKGBUILDDIR>>/src'
make[3]: *** [Makefile:1058: all-recursive] Error 1
make[3]: Leaving directory '/<<PKGBUILDDIR>>'
make[2]: *** [Makefile:996: all] Error 2
make[2]: Leaving directory '/<<PKGBUILDDIR>>'
dh_auto_build: error: make -j1 returned exit code 2
make[1]: *** [debian/rules:8: override_dh_auto_build] Error 25
make[1]: Leaving directory '/<<PKGBUILDDIR>>'
make: *** [debian/rules:11: build-arch] Error 2

Tail of log for fairy-stockfish on armhf:

/usr/bin/ld: /usr/include/c++/10/bits/atomic_base.h:426: undefined reference to `__atomic_load_8'
/usr/bin/ld: /tmp/stockfish.hW5rvz.ltrans6.ltrans.o: in function `UCI::loop(int, char**)':
/usr/include/c++/10/bits/atomic_base.h:426: undefined reference to `__atomic_load_8'
/usr/bin/ld: /tmp/stockfish.hW5rvz.ltrans9.ltrans.o: in function `ThreadPool::start_thinking(Position&, std::unique_ptr<std::deque<StateInfo, std::allocator<StateInfo> >, std::default_delete<std::deque<StateInfo, std::allocator<StateInfo> > > >&, Search::LimitsType const&, bool) [clone .constprop.0]':
/usr/include/c++/10/bits/atomic_base.h:404: undefined reference to `__atomic_store_8'
/usr/bin/ld: /usr/include/c++/10/bits/atomic_base.h:404: undefined reference to `__atomic_store_8'
collect2: error: ld returned 1 exit status
make[3]: *** [Makefile:516: stockfish] Error 1
make[3]: Leaving directory '/<<PKGBUILDDIR>>/src'
make[2]: *** [Makefile:433: build] Error 2
make[2]: Leaving directory '/<<PKGBUILDDIR>>/src'
dh_auto_build: error: cd src && make -j4 build ARCH=general-32 returned exit code 2
make[1]: *** [debian/rules:105: override_dh_auto_build] Error 25
make[1]: Leaving directory '/<<PKGBUILDDIR>>'
make: *** [debian/rules:99: build-arch] Error 2

Tail of log for cyclonedds on armhf:

--- debian/libddsc0.symbols (libddsc0_0.7.0-8_armhf)
+++ dpkg-gensymbols5tlvXs	2021-09-23 09:03:36.240028359 +0000
@@ -768,7 +768,7 @@
  ddsrt_atomic_cas32@Base 0.7.0
  ddsrt_atomic_cas64@Base 0.7.0
  ddsrt_atomic_casptr@Base 0.7.0
- (arch=i386 armhf)ddsrt_atomic_casvoidp2@Base 0.7.0
+#MISSING: 0.7.0-8# (arch=i386 armhf)ddsrt_atomic_casvoidp2@Base 0.7.0
  ddsrt_atomic_casvoidp@Base 0.7.0
  ddsrt_atomic_dec32@Base 0.7.0
  ddsrt_atomic_dec32_nv@Base 0.7.0
dh_makeshlibs: error: failing due to earlier errors
make[1]: *** [debian/rules:58: override_dh_makeshlibs] Error 25
make[1]: Leaving directory '/<<PKGBUILDDIR>>'
make: *** [debian/rules:16: binary-arch] Error 2

Tail of log for garagemq on armhf:

github.com/magiconair/properties
github.com/spf13/afero
expvar
golang.org/x/net/trace
net/http/pprof
github.com/valinurovam/garagemq/protocol
github.com/dgraph-io/badger/y
github.com/spf13/viper
github.com/dgraph-io/badger/skl
github.com/dgraph-io/badger/table
github.com/dgraph-io/badger
# github.com/dgraph-io/badger
src/github.com/dgraph-io/badger/value.go:50:5: constant 4294967295 overflows int
dh_auto_build: error: cd obj-arm-linux-gnueabihf && go install -trimpath -v -p 4 github.com/valinurovam/garagemq github.com/valinurovam/garagemq/admin github.com/valinurovam/garagemq/amqp github.com/valinurovam/garagemq/auth github.com/valinurovam/garagemq/binding github.com/valinurovam/garagemq/config github.com/valinurovam/garagemq/consumer github.com/valinurovam/garagemq/exchange github.com/valinurovam/garagemq/interfaces github.com/valinurovam/garagemq/metrics github.com/valinurovam/garagemq/msgstorage github.com/valinurovam/garagemq/pool github.com/valinurovam/garagemq/protocol github.com/valinurovam/garagemq/qos github.com/valinurovam/garagemq/queue github.com/valinurovam/garagemq/safequeue github.com/valinurovam/garagemq/server github.com/valinurovam/garagemq/srvstorage github.com/valinurovam/garagemq/storage returned exit code 2
make: *** [debian/rules:4: build-arch] Error 25

Tail of log for gjh-asl-json on armhf:

  280 | #define conval(x,r,ne)  (*((ASL*)asl)->p.Conval)((ASL*)asl,x,r,ne)
      |                                                                ^~
src/AmplInterface.cpp: In member function ‘void AmplInterface::eval_jac_c(const double*, double*) const’:
src/AmplInterface.cpp:920:37: error: invalid conversion from ‘int*’ to ‘fint*’ {aka ‘long int*’} [-fpermissive]
  920 |    jacval((double*)x, jac_c_values, &nerror);
      |                                     ^~~~~~~
      |                                     |
      |                                     int*
/usr/include/ampl-netlib-solvers/asl.h:281:64: note: in definition of macro ‘jacval’
  281 | #define jacval(x,j,ne)  (*((ASL*)asl)->p.Jacval)((ASL*)asl,x,j,ne)
      |                                                                ^~
make[1]: *** [Makefile:25: src/AmplInterface.o] Error 1
make[1]: Leaving directory '/<<BUILDDIR>>/gjh-asl-json-0.0+git20180428.eb8720e'
dh_auto_build: error: make -j4 "INSTALL=install --strip-program=true" returned exit code 2
make: *** [debian/rules:21: binary-arch] Error 25

Tail of log for golang-android-soong on armhf:

android/soong/partner/bpfix
android/soong/phony
android/soong/rust/config
android/soong/scripts
android/soong/symbol_inject/cmd
android/soong/xml
android/soong/zip/cmd
android/soong/sh
android/soong/rust
android/soong/java
android/soong/sysprop
android/soong/apex
android/soong/sdk
dh_auto_build: error: cd _build && go install -trimpath -v -p 4 android/soong android/soong/android android/soong/android/soongconfig android/soong/androidmk/androidmk android/soong/androidmk/cmd android/soong/androidmk/parser android/soong/apex android/soong/bpf android/soong/bpfix/bpfix android/soong/bpfix/cmd android/soong/bpfix/cmd_lib android/soong/cc android/soong/cc/config android/soong/cmd/dep_fixer android/soong/cmd/diff_target_files android/soong/cmd/extract_apks android/soong/cmd/extract_apks/bundle_proto android/soong/cmd/extract_jar_packages android/soong/cmd/extract_linker android/soong/cmd/fileslist android/soong/cmd/host_bionic_inject android/soong/cmd/javac_wrapper android/soong/cmd/merge_zips android/soong/cmd/multiproduct_kati android/soong/cmd/path_interposer android/soong/cmd/pom2bp android/soong/cmd/pom2mk android/soong/cmd/sbox android/soong/cmd/soong_build android/soong/cmd/soong_env android/soong/cmd/soong_ui android/soong/cmd/zip2zip android/soong/cmd/zipsync android/soong/cuj android/soong/dexpreopt android/soong/dexpreopt/dexpreopt_gen android/soong/env android/soong/etc android/soong/finder android/soong/finder/cmd android/soong/finder/fs android/soong/genrule android/soong/jar android/soong/java android/soong/java/config android/soong/makedeps android/soong/partner/androidmk android/soong/partner/bpfix android/soong/partner/bpfix/extensions android/soong/phony android/soong/python android/soong/remoteexec android/soong/rust android/soong/rust/config android/soong/scripts android/soong/sdk android/soong/sh android/soong/shared android/soong/symbol_inject android/soong/symbol_inject/cmd android/soong/sysprop android/soong/third_party/zip android/soong/tradefed android/soong/ui/build android/soong/ui/build/paths android/soong/ui/logger android/soong/ui/metrics android/soong/ui/metrics/metrics_proto android/soong/ui/metrics/upload_proto android/soong/ui/status android/soong/ui/status/build_error_proto android/soong/ui/status/build_progress_proto android/soong/ui/status/ninja_frontend android/soong/ui/terminal android/soong/ui/tracer android/soong/xml android/soong/zip android/soong/zip/cmd returned exit code 2
make: *** [debian/rules:6: binary-arch] Error 25

Tail of log for gloo on armhf:

    arg [/usr/lib/gcc/arm-linux-gnueabihf/10/../../../arm-linux-gnueabihf/crtn.o] ==> ignore
  collapse library dir [/usr/lib/gcc/arm-linux-gnueabihf/10] ==> [/usr/lib/gcc/arm-linux-gnueabihf/10]
  collapse library dir [/usr/lib/gcc/arm-linux-gnueabihf/10/../../../arm-linux-gnueabihf] ==> [/usr/lib/arm-linux-gnueabihf]
  collapse library dir [/usr/lib/gcc/arm-linux-gnueabihf/10/../../..] ==> [/usr/lib]
  collapse library dir [/lib/arm-linux-gnueabihf] ==> [/lib/arm-linux-gnueabihf]
  collapse library dir [/usr/lib/arm-linux-gnueabihf] ==> [/usr/lib/arm-linux-gnueabihf]
  implicit libs: [gcc;gcc_s;c;gcc;gcc_s]
  implicit dirs: [/usr/lib/gcc/arm-linux-gnueabihf/10;/usr/lib/arm-linux-gnueabihf;/usr/lib;/lib/arm-linux-gnueabihf]
  implicit fwks: []


dh_auto_configure: error: cd obj-arm-linux-gnueabihf && cmake -DCMAKE_INSTALL_PREFIX=/usr -DCMAKE_BUILD_TYPE=None -DCMAKE_INSTALL_SYSCONFDIR=/etc -DCMAKE_INSTALL_LOCALSTATEDIR=/var -DCMAKE_EXPORT_NO_PACKAGE_REGISTRY=ON -DCMAKE_FIND_USE_PACKAGE_REGISTRY=OFF -DCMAKE_FIND_PACKAGE_NO_PACKAGE_REGISTRY=ON -DCMAKE_INSTALL_RUNSTATEDIR=/run -DCMAKE_SKIP_INSTALL_ALL_DEPENDENCY=ON "-GUnix Makefiles" -DCMAKE_VERBOSE_MAKEFILE=ON -DCMAKE_INSTALL_LIBDIR=lib/arm-linux-gnueabihf -DCMAKE_BUILD_TYPE=RelWithDebInfo -DUSE_REDIS=ON -DUSE_IBVERBS=ON -DUSE_MPI=OFF -DUSE_LIBUV=OFF -DUSE_CUDA=OFF -DUSE_NCCL=OFF -DBUILD_TEST=OFF -DBUILD_BENCHMARK=OFF -DBUILD_SHARED_LIBS=ON .. returned exit code 1
make[1]: *** [debian/rules:13: override_dh_auto_configure] Error 2
make[1]: Leaving directory '/<<PKGBUILDDIR>>'
make: *** [debian/rules:8: binary-arch] Error 2

Tail of log for deng on armhf:

  175 |                                         pixel[1] = png_info->palette[rows[i][off]].green;
      |                                                            ^~
/<<BUILDDIR>>/deng-1.9.0-beta6.9+dfsg1/doomsday/engine/portable/src/gl_png.c:176:60: error: invalid use of incomplete typedef 'png_info' {aka 'struct png_info_def'}
  176 |                                         pixel[2] = png_info->palette[rows[i][off]].blue;
      |                                                            ^~
/<<BUILDDIR>>/deng-1.9.0-beta6.9+dfsg1/doomsday/engine/portable/src/gl_png.c:183:48: error: invalid use of incomplete typedef 'png_info' {aka 'struct png_info_def'}
  183 |                                     if(png_info->channels == 2) // Alpha data.
      |                                                ^~
make[3]: *** [CMakeFiles/doomsday.dir/build.make:745: CMakeFiles/doomsday.dir/engine/portable/src/gl_png.o] Error 1
make[3]: Leaving directory '/<<BUILDDIR>>/deng-1.9.0-beta6.9+dfsg1/doomsdaybuild'
make[2]: *** [CMakeFiles/Makefile2:228: CMakeFiles/doomsday.dir/all] Error 2
make[2]: Leaving directory '/<<BUILDDIR>>/deng-1.9.0-beta6.9+dfsg1/doomsdaybuild'
make[1]: *** [Makefile:171: all] Error 2
make[1]: Leaving directory '/<<BUILDDIR>>/deng-1.9.0-beta6.9+dfsg1/doomsdaybuild'
make: *** [debian/rules:25: build-stamp] Error 2

Tail of log for gammapy on armhf:

FAILED gammapy/maps/tests/test_base.py::test_map_copy[0.1-10.0-hpx-skydir3-axes3-s^2]
FAILED gammapy/maps/tests/test_base.py::test_map_from_geom - numpy.core._exce...
FAILED gammapy/maps/tests/test_base.py::test_map_get_image_by_coord[0.1-10.0-hpx-skydir2-axes2-]
FAILED gammapy/maps/tests/test_base.py::test_map_get_image_by_coord[0.1-10.0-hpx-skydir3-axes3-s^2]
FAILED gammapy/maps/tests/test_base.py::test_map_get_image_by_pix[0.1-10.0-hpx-skydir2-axes2-]
FAILED gammapy/maps/tests/test_base.py::test_map_get_image_by_pix[0.1-10.0-hpx-skydir3-axes3-s^2]
FAILED gammapy/maps/tests/test_base.py::test_map_slice_by_idx[0.1-10.0-hpx-skydir2-axes2-]
FAILED gammapy/maps/tests/test_base.py::test_map_slice_by_idx[0.1-10.0-hpx-skydir3-axes3-s^2]
FAILED gammapy/maps/tests/test_base.py::test_interp_to_geom - ValueError: neg...
FAILED gammapy/maps/tests/test_hpxmap.py::test_plot - ValueError: negative di...
FAILED gammapy/maps/tests/test_hpxmap.py::test_plot_poly - ValueError: negati...
= 14 failed, 1153 passed, 479 skipped, 2 xfailed, 3 xpassed in 470.99s (0:07:50) =
E: pybuild pybuild:353: test: plugin distutils failed with: exit code=1: cd /<<PKGBUILDDIR>>/.pybuild/cpython3_3.9_gammapy/build; python3.9 -m pytest 
dh_auto_test: error: pybuild --test --test-pytest -i python{version} -p 3.9 returned exit code 13
make: *** [debian/rules:9: binary-arch] Error 25

Tail of log for haskell-ghc-lib-parser-ex on armhf:

ghc-lib-parser-ex-test:   -Mgrace=<n>
ghc-lib-parser-ex-test:             The amount of allocation after the program receives a
ghc-lib-parser-ex-test:             HeapOverflow exception before the exception is thrown again, if
ghc-lib-parser-ex-test:             the program is still exceeding the heap limit.
ghc-lib-parser-ex-test: 
ghc-lib-parser-ex-test: RTS options may also be specified using the GHCRTS environment variable.
ghc-lib-parser-ex-test: 
ghc-lib-parser-ex-test: Other RTS options may be available for programs compiled a different way.
ghc-lib-parser-ex-test: The GHC User's Guide has full details.
ghc-lib-parser-ex-test: 
Test suite ghc-lib-parser-ex-test: FAIL
Test suite logged to:
dist-ghc/test/ghc-lib-parser-ex-8.10.0.16-ghc-lib-parser-ex-test.log
0 of 1 test suites (0 of 1 test cases) passed.
make: *** [/usr/share/cdbs/1/class/hlibrary.mk:154: check-ghc-stamp] Error 1

Tail of log for haskell-pretty-simple on armhf:

[7 of 9] Compiling Text.Pretty.Simple.Internal ( src/Text/Pretty/Simple/Internal.hs, dist-ghc/build/Text/Pretty/Simple/Internal.p_o )
[8 of 9] Compiling Text.Pretty.Simple ( src/Text/Pretty/Simple.hs, dist-ghc/build/Text/Pretty/Simple.p_o )
[9 of 9] Compiling Debug.Pretty.Simple ( src/Debug/Pretty/Simple.hs, dist-ghc/build/Debug/Pretty/Simple.p_o )
touch build-ghc-stamp
. /usr/share/haskell-devscripts/Dh_Haskell.sh && \
check_recipe
Running debian/hlibrary.setup test --builddir=dist-ghc --show-details=direct
Running 1 test suites...
Test suite pretty-simple-doctest: RUNNING...
pretty-simple-doctest: fd:13: hGetLine: end of file
Test suite pretty-simple-doctest: FAIL
Test suite logged to:
dist-ghc/test/pretty-simple-3.2.3.0-pretty-simple-doctest.log
0 of 1 test suites (0 of 1 test cases) passed.
make: *** [/usr/share/cdbs/1/class/hlibrary.mk:154: check-ghc-stamp] Error 1

Tail of log for ghemical on armhf:

/usr/bin/ld: /usr/lib/gcc/arm-linux-gnueabihf/10/../../../arm-linux-gnueabihf/libghemical.so: undefined reference to `sc::KeyVal::exists(char const*)'
/usr/bin/ld: /usr/lib/gcc/arm-linux-gnueabihf/10/../../../arm-linux-gnueabihf/libghemical.so: undefined reference to `sc::Appearance::Appearance(sc::Ref<sc::KeyVal> const&)'
/usr/bin/ld: /usr/lib/gcc/arm-linux-gnueabihf/10/../../../arm-linux-gnueabihf/libghemical.so: undefined reference to `sc::PrefixKeyVal::PrefixKeyVal(sc::Ref<sc::KeyVal> const&, char const*)'
/usr/bin/ld: /usr/lib/gcc/arm-linux-gnueabihf/10/../../../arm-linux-gnueabihf/libghemical.so: undefined reference to `sc::RenderedBallMolecule::RenderedBallMolecule(sc::Ref<sc::KeyVal> const&)'
collect2: error: ld returned 1 exit status
make[4]: *** [Makefile:596: ghemical] Error 1
make[4]: Leaving directory '/<<PKGBUILDDIR>>/src'
make[3]: *** [Makefile:683: all-recursive] Error 1
make[3]: Leaving directory '/<<PKGBUILDDIR>>/src'
make[2]: *** [Makefile:496: all] Error 2
make[2]: Leaving directory '/<<PKGBUILDDIR>>/src'
make[1]: *** [Makefile:427: all-recursive] Error 1
make[1]: Leaving directory '/<<PKGBUILDDIR>>'
dh_auto_build: error: make -j4 returned exit code 2
make: *** [debian/rules:13: build-arch] Error 25

Tail of log for ibam on armhf:

make[1]: Entering directory '/<<PKGBUILDDIR>>'
make[1]: 'ibam-krell.so' is up to date.
make[1]: Leaving directory '/<<PKGBUILDDIR>>'
touch build-stamp
dh_testdir
dh_testroot
dh_clean
dh_clean: warning: Compatibility levels before 10 are deprecated (level 7 in use)
dh_installdirs
dh_installdirs: warning: Compatibility levels before 10 are deprecated (level 7 in use)
# Add here commands to install the package into debian/tmp.
install -m0755 ibam `pwd`/debian/ibam/usr/bin
install -m0644 ibam-krell.so `pwd`/debian/gkrellm-ibam/usr/lib/gkrellm2/plugins
install: cannot create regular file '/<<PKGBUILDDIR>>/debian/gkrellm-ibam/usr/lib/gkrellm2/plugins': No such file or directory
make: *** [debian/rules:58: install] Error 1

Tail of log for haskell-type-level on armhf:

    |
266 | instance (DivMod x y q r) => Div x y q
    |          ^^^^^^^^^^^^^^^^^^^^^^^^^^^^^

src/Data/TypeLevel/Num/Ops.hs:336:10: error:
    * Illegal instance declaration for `Div10 x q'
        The liberal coverage condition fails in class `Div10'
          for functional dependency: `q -> x'
        Reason: lhs type `q' does not determine rhs type `x'
        Un-determined variable: x
    * In the instance declaration for `Div10 x q'
    |
336 | instance DivMod10 x q r => Div10 x q
    |          ^^^^^^^^^^^^^^^^^^^^^^^^^^^
make: *** [/usr/share/cdbs/1/class/hlibrary.mk:147: build-ghc-stamp] Error 1

Tail of log for haskell-xml-html-qq on armhf:

xml-html-qq-test: 
xml-html-qq-test:   -Mgrace=<n>
xml-html-qq-test:             The amount of allocation after the program receives a
xml-html-qq-test:             HeapOverflow exception before the exception is thrown again, if
xml-html-qq-test:             the program is still exceeding the heap limit.
xml-html-qq-test: 
xml-html-qq-test: RTS options may also be specified using the GHCRTS environment variable.
xml-html-qq-test: 
xml-html-qq-test: Other RTS options may be available for programs compiled a different way.
xml-html-qq-test: The GHC User's Guide has full details.
xml-html-qq-test: 
Test suite xml-html-qq-test: FAIL
Test suite logged to: dist-ghc/test/xml-html-qq-0.1.0.1-xml-html-qq-test.log
0 of 2 test suites (0 of 2 test cases) passed.
make: *** [/usr/share/cdbs/1/class/hlibrary.mk:154: check-ghc-stamp] Error 1

Tail of log for ioapps on armhf:

dpkg-buildpackage
-----------------

dpkg-buildpackage: info: source package ioapps
dpkg-buildpackage: info: source version 1.4r2-3
dpkg-buildpackage: info: source distribution unstable
 dpkg-source --before-build .
dpkg-buildpackage: info: host architecture armhf
 fakeroot debian/rules clean
dh clean --with python2
dh: warning: Compatibility levels before 10 are deprecated (level 8 in use)
dh: error: unable to load addon python2: Can't locate Debian/Debhelper/Sequence/python2.pm in @INC (you may need to install the Debian::Debhelper::Sequence::python2 module) (@INC contains: /etc/perl /usr/local/lib/arm-linux-gnueabihf/perl/5.32.1 /usr/local/share/perl/5.32.1 /usr/lib/arm-linux-gnueabihf/perl5/5.32 /usr/share/perl5 /usr/lib/arm-linux-gnueabihf/perl-base /usr/lib/arm-linux-gnueabihf/perl/5.32 /usr/share/perl/5.32 /usr/local/lib/site_perl) at (eval 10) line 1.
BEGIN failed--compilation aborted at (eval 10) line 1.

make: *** [debian/rules:14: clean] Error 25

Tail of log for icu-ext on armhf:

-   0 |  
- 200 | you
-   0 |  
- 200 | like
-   0 |  
- 200 | O'Reilly
-   0 |  
- 200 | books
-   0 | ?
-(10 rows)
-
+ERROR:  encoding "SQL_ASCII" not supported by ICU
### End 13 installcheck (FAILED with exit code 1) ###
dh_pgxs_test: error: pg_buildext installcheck . . postgresql-%v-icu-ext returned exit code 1
make: *** [debian/rules:9: binary-arch] Error 25

Tail of log for ivar on armhf:

See tests/test-suite.log
Please report to gkarthik@scripps.edu
============================================================================
make[5]: *** [Makefile:913: test-suite.log] Error 1
make[5]: Leaving directory '/<<PKGBUILDDIR>>/tests'
make[4]: *** [Makefile:1021: check-TESTS] Error 2
make[4]: Leaving directory '/<<PKGBUILDDIR>>/tests'
make[3]: *** [Makefile:1213: check-am] Error 2
make[3]: Leaving directory '/<<PKGBUILDDIR>>/tests'
make[2]: *** [Makefile:371: check-recursive] Error 1
make[2]: Leaving directory '/<<PKGBUILDDIR>>'
dh_auto_test: error: make -j1 check VERBOSE=1 returned exit code 2
make[1]: *** [debian/rules:16: override_dh_auto_test] Error 25
make[1]: Leaving directory '/<<PKGBUILDDIR>>'
make: *** [debian/rules:12: binary-arch] Error 2

Tail of log for jbuilder on armhf:

   dh_autoreconf -a
   dh_ocamlinit -a
   debian/rules override_dh_auto_build
make[1]: Entering directory '/<<PKGBUILDDIR>>'
ocaml bootstrap.ml
/usr/bin/ocamllex.opt -q src/sexp_lexer.mll
/usr/bin/ocamllex.opt -q src/meta_lexer.mll
/usr/bin/ocamldep.opt -modules src/action.ml src/action_intf.ml src/alias.ml src/ansi_color.ml src/arg_spec.ml src/artifacts.ml src/bin.ml src/build.ml src/build_interpret.ml src/build_system.ml src/clflags.ml src/cm_kind.ml src/config.ml src/context.ml src/file_tree.ml src/findlib.ml src/future.ml src/gen_meta.ml src/gen_rules.ml src/glob_lexer.boot.ml src/import.ml src/install.ml src/io.ml src/jbuild.ml src/jbuild_load.ml vendor/boot/jbuilder_opam_file_format.ml vendor/boot/jbuilder_re.ml src/js_of_ocaml_rules.ml src/lib.ml src/lib_db.ml src/loc.ml src/log.ml src/main.ml src/merlin.ml src/meta.ml src/meta_lexer.ml src/ml_kind.ml src/mode.ml src/module.ml src/module_compilation.ml src/ocaml_flags.ml src/ocamldep.ml src/odoc.ml src/opam_file.ml src/ordered_set_lang.ml src/package.ml src/path.ml src/sexp.ml src/sexp_lexer.ml src/string_with_vars.ml src/super_context.ml src/top_closure.ml src/utils.ml src/utop.ml src/vfile_kind.ml src/watermarks.ml src/workspace.ml > boot-depends.txt
/usr/bin/ocamlopt.opt -w -40 -o boot.exe unix.cmxa boot.ml
File "src/import.ml", line 32, characters 2-20:
Error: Multiple definition of the type name t.
       Names must be unique in a given structure or signature.
make[1]: *** [debian/rules:15: override_dh_auto_build] Error 2
make[1]: Leaving directory '/<<PKGBUILDDIR>>'
make: *** [debian/rules:11: build-arch] Error 2

Tail of log for kafs-client on armhf:

make[2]: *** Waiting for unfinished jobs....
cc: error: unrecognized command-line option '-m32'; did you mean '-mbe32'?
cc: error: unrecognized command-line option '-m32'; did you mean '-mbe32'?
make[2]: *** [Makefile:34: lib_cellserv.os] Error 1
cc: error: unrecognized command-line option '-m32'; did you mean '-mbe32'?
cc: error: unrecognized command-line option '-m32'; did you mean '-mbe32'?
make[2]: *** [Makefile:34: lib_dns_lookup.os] Error 1
cc: error: unrecognized command-line option '-m32'; did you mean '-mbe32'?
cc: error: unrecognized command-line option '-m32'; did you mean '-mbe32'?
make[2]: *** [Makefile:34: lib_object.os] Error 1
make[2]: Leaving directory '/<<PKGBUILDDIR>>/src'
make[1]: *** [Makefile:43: all] Error 2
make[1]: Leaving directory '/<<PKGBUILDDIR>>'
dh_auto_build: error: make -j4 "INSTALL=install --strip-program=true" returned exit code 2
make: *** [debian/rules:8: binary-arch] Error 25

Tail of log for jocaml on armhf:

|---
| tools/ocamlmklib.ml | 5 +++++
| 1 file changed, 5 insertions(+)
|
|diff --git a/tools/ocamlmklib.ml b/tools/ocamlmklib.ml
|index d5bb84c..ab3ca2b 100644
|--- a/tools/ocamlmklib.ml
|+++ b/tools/ocamlmklib.ml
--------------------------
No file to patch.  Skipping patch.
1 out of 1 hunk ignored
Patch debian/patches/0001-Don-t-use-rpath.patch does not apply (enforce with -f)
make[1]: *** [debian/rules:22: override_dh_auto_configure] Error 1
make[1]: Leaving directory '/<<PKGBUILDDIR>>'
make: *** [debian/rules:85: build-arch] Error 2

Tail of log for kvmtool on armhf:

/usr/include/arm-linux-gnueabihf/bits/string_fortified.h:34:10: error: writing 1 byte into a region of size 0 [-Werror=stringop-overflow=]
   34 |   return __builtin___memcpy_chk (__dest, __src, __len, __bos0 (__dest));
      |          ^~~~~~~~~~~~~~~~~~~~~~~~~~~~~~~~~~~~~~~~~~~~~~~~~~~~~~~~~~~~~~
In file included from net/uip/csum.c:1:
net/uip/csum.c: In function 'uip_csum_tcp':
include/kvm/uip.h:147:6: note: at offset 0 to object 'sport' with size 2 declared here
  147 |  u16 sport;
      |      ^~~~~
gcc -c -Wp,-MD,util/.init.o.d -march=armv7-a -DCONFIG_GUEST_INIT -Wdate-time -D_FORTIFY_SOURCE=2 -DCONFIG_ARM -D_FILE_OFFSET_BITS=64 -D_GNU_SOURCE -DKVMTOOLS_VERSION='""' -DBUILD_ARCH='"arm"' -Iinclude -Iarm/include -Iarm/aarch32/include -O2 -fno-strict-aliasing -g -Wall -Wformat=2 -Winit-self -Wmissing-declarations -Wmissing-prototypes -Wnested-externs -Wno-system-headers -Wold-style-definition -Wredundant-decls -Wsign-compare -Wstrict-prototypes -Wundef -Wvolatile-register-var -Wwrite-strings -Wno-format-nonliteral -Werror -DCONFIG_HAS_ZLIB -DCONFIG_HAS_AIO -DCONFIG_HAS_LIBFDT util/init.c -o util/init.o
cc1: all warnings being treated as errors
make[1]: *** [Makefile:435: net/uip/csum.o] Error 1
make[1]: *** Waiting for unfinished jobs....
make[1]: Leaving directory '/<<PKGBUILDDIR>>'
dh_auto_build: error: make -j4 returned exit code 2
make: *** [debian/rules:3: build-arch] Error 25

Tail of log for libmath-int128-perl on armhf:

Checking for strings.h... yes
Checking for inttypes.h... yes
Checking for stdint.h... yes
Checking for unistd.h... yes
Checking for uint64_t... yes
Checking for __int128... no
Checking for uint64_t... (cached) yes
Checking for int __attribute__ ((__mode__ (TI)))... 
  It looks like your compiler doesn't support a 128-bit integer type (one of
  "int __attribute__ ((__mode__ (TI)))" or "__int128"). One of these types is
  necessary to compile the Math::Int128 module.

no
dh_auto_configure: error: /usr/bin/perl Makefile.PL INSTALLDIRS=vendor "OPTIMIZE=-g -O2 -ffile-prefix-map=/<<PKGBUILDDIR>>=. -fstack-protector-strong -Wformat -Werror=format-security -Wdate-time -D_FORTIFY_SOURCE=2" "LD=arm-linux-gnueabihf-gcc -g -O2 -ffile-prefix-map=/<<PKGBUILDDIR>>=. -fstack-protector-strong -Wformat -Werror=format-security -Wl,-z,relro -Wl,-z,now" returned exit code 1
make: *** [debian/rules:6: build-arch] Error 25

Tail of log for libbiod on armhf:

gdc: error: unrecognized command-line option ‘-release’; did you mean ‘-frelease’?
gdc: error: unrecognized command-line option ‘-boundscheck=off’; did you mean ‘-fbounds-check=off’?
[3/199] gdc -Ilibbiod.so.0.2.3.p -I. -I.. -Wall -Wdeprecated -g -O2 -ffile-prefix-map=/<<BUILDDIR>>/libbiod-0.2.3+git20191120.b8eecef=. -fstack-protector-strong -frelease -fPIC -O3 -release -enable-inlining -boundscheck=off -MD -MQ libbiod.so.0.2.3.p/contrib_undead_internal_file.d.o -MF libbiod.so.0.2.3.p/contrib_undead_internal_file.d.o.deps -o libbiod.so.0.2.3.p/contrib_undead_internal_file.d.o -c ../contrib/undead/internal/file.d
FAILED: libbiod.so.0.2.3.p/contrib_undead_internal_file.d.o 
gdc -Ilibbiod.so.0.2.3.p -I. -I.. -Wall -Wdeprecated -g -O2 -ffile-prefix-map=/<<BUILDDIR>>/libbiod-0.2.3+git20191120.b8eecef=. -fstack-protector-strong -frelease -fPIC -O3 -release -enable-inlining -boundscheck=off -MD -MQ libbiod.so.0.2.3.p/contrib_undead_internal_file.d.o -MF libbiod.so.0.2.3.p/contrib_undead_internal_file.d.o.deps -o libbiod.so.0.2.3.p/contrib_undead_internal_file.d.o -c ../contrib/undead/internal/file.d
gdc: error: unrecognized command-line option ‘-release’; did you mean ‘-frelease’?
gdc: error: unrecognized command-line option ‘-boundscheck=off’; did you mean ‘-fbounds-check=off’?
[4/199] gdc -Ilibbiod.so.0.2.3.p -I. -I.. -Wall -Wdeprecated -g -O2 -ffile-prefix-map=/<<BUILDDIR>>/libbiod-0.2.3+git20191120.b8eecef=. -fstack-protector-strong -frelease -fPIC -O3 -release -enable-inlining -boundscheck=off -MD -MQ libbiod.so.0.2.3.p/contrib_undead_stream.d.o -MF libbiod.so.0.2.3.p/contrib_undead_stream.d.o.deps -o libbiod.so.0.2.3.p/contrib_undead_stream.d.o -c ../contrib/undead/stream.d
FAILED: libbiod.so.0.2.3.p/contrib_undead_stream.d.o 
gdc -Ilibbiod.so.0.2.3.p -I. -I.. -Wall -Wdeprecated -g -O2 -ffile-prefix-map=/<<BUILDDIR>>/libbiod-0.2.3+git20191120.b8eecef=. -fstack-protector-strong -frelease -fPIC -O3 -release -enable-inlining -boundscheck=off -MD -MQ libbiod.so.0.2.3.p/contrib_undead_stream.d.o -MF libbiod.so.0.2.3.p/contrib_undead_stream.d.o.deps -o libbiod.so.0.2.3.p/contrib_undead_stream.d.o -c ../contrib/undead/stream.d
gdc: error: unrecognized command-line option ‘-release’; did you mean ‘-frelease’?
gdc: error: unrecognized command-line option ‘-boundscheck=off’; did you mean ‘-fbounds-check=off’?
ninja: build stopped: subcommand failed.
dh_auto_build: error: cd obj-arm-linux-gnueabihf && LC_ALL=C.UTF-8 ninja -j4 -v returned exit code 1
make: *** [debian/rules:7: build-arch] Error 25

Tail of log for libgrokj2k on armhf:

[ 99%] Building C object src/bin/jp2/CMakeFiles/grk_compress.dir/__/image_format/iccjpeg.c.o
cd /<<PKGBUILDDIR>>/obj-arm-linux-gnueabihf/src/bin/jp2 && /usr/bin/cc -DSPDLOG_COMPILED_LIB -I/<<PKGBUILDDIR>>/obj-arm-linux-gnueabihf/src/lib/jp2 -I/<<PKGBUILDDIR>>/obj-arm-linux-gnueabihf/src/bin/common -I/<<PKGBUILDDIR>>/src/lib/jp2 -I/<<PKGBUILDDIR>>/src/bin/common -I/<<PKGBUILDDIR>>/src/bin/image_format -I/<<PKGBUILDDIR>>/src/bin/jp2 -I/<<PKGBUILDDIR>>/src/include -I/<<PKGBUILDDIR>>/src/include/taskflow -I/usr/lib/arm-linux-gnueabihf/perl/5.32/CORE -g -O2 -ffile-prefix-map=/<<PKGBUILDDIR>>=. -fstack-protector-strong -Wformat -Werror=format-security -Wdate-time -D_FORTIFY_SOURCE=2 -Wall -Wextra -Wconversion -Wsign-conversion -Wunused-parameter -o CMakeFiles/grk_compress.dir/__/image_format/iccjpeg.c.o -c /<<PKGBUILDDIR>>/src/bin/image_format/iccjpeg.c
[100%] Linking CXX executable ../../../bin/grk_compress
cd /<<PKGBUILDDIR>>/obj-arm-linux-gnueabihf/src/bin/jp2 && /usr/bin/cmake -E cmake_link_script CMakeFiles/grk_compress.dir/link.txt --verbose=1
/usr/bin/c++ -g -O2 -ffile-prefix-map=/<<PKGBUILDDIR>>=. -fstack-protector-strong -Wformat -Werror=format-security -fvisibility=hidden -Wdate-time -D_FORTIFY_SOURCE=2 -Wl,-z,relro -Wl,-z,now CMakeFiles/grk_compress.dir/grk_compress.cpp.o CMakeFiles/grk_compress.dir/__/common/convert.cpp.o CMakeFiles/grk_compress.dir/__/image_format/ImageFormat.cpp.o CMakeFiles/grk_compress.dir/__/image_format/FileStreamIO.cpp.o CMakeFiles/grk_compress.dir/__/image_format/PNMFormat.cpp.o CMakeFiles/grk_compress.dir/__/image_format/PGXFormat.cpp.o CMakeFiles/grk_compress.dir/__/image_format/BMPFormat.cpp.o CMakeFiles/grk_compress.dir/__/image_format/RAWFormat.cpp.o CMakeFiles/grk_compress.dir/__/common/color.cpp.o CMakeFiles/grk_compress.dir/__/common/common.cpp.o CMakeFiles/grk_compress.dir/__/common/exif.cpp.o CMakeFiles/grk_compress.dir/__/common/spdlog/spdlog.cpp.o CMakeFiles/grk_compress.dir/__/common/spdlog/color_sinks.cpp.o CMakeFiles/grk_compress.dir/__/common/spdlog/stdout_sinks.cpp.o CMakeFiles/grk_compress.dir/__/common/spdlog/fmt.cpp.o CMakeFiles/grk_compress.dir/__/common/spdlog/async.cpp.o CMakeFiles/grk_compress.dir/__/common/spdlog/file_sinks.cpp.o CMakeFiles/grk_compress.dir/__/image_format/TIFFFormat.cpp.o CMakeFiles/grk_compress.dir/__/image_format/PNGFormat.cpp.o CMakeFiles/grk_compress.dir/__/image_format/JPEGFormat.cpp.o CMakeFiles/grk_compress.dir/__/image_format/iccjpeg.c.o -o ../../../bin/grk_compress  ../../../bin/libgrokj2k.so.7.6.6 /usr/lib/arm-linux-gnueabihf/libpng.so /usr/lib/arm-linux-gnueabihf/libz.so /usr/lib/arm-linux-gnueabihf/libtiff.so /usr/lib/arm-linux-gnueabihf/liblcms2.so /usr/lib/arm-linux-gnueabihf/libjpeg.so -ldl /usr/lib/arm-linux-gnueabihf/libz.so /usr/lib/arm-linux-gnueabihf/libperl.so.5.32 -lcrypt -lpthread /usr/lib/arm-linux-gnueabihf/libtiff.so /usr/lib/arm-linux-gnueabihf/liblcms2.so /usr/lib/arm-linux-gnueabihf/libjpeg.so -ldl /usr/lib/arm-linux-gnueabihf/libperl.so.5.32 -lcrypt 
/usr/bin/ld: ../../../bin/libgrokj2k.so.7.6.6: undefined reference to `__atomic_fetch_add_8'
collect2: error: ld returned 1 exit status
make[3]: *** [src/bin/jp2/CMakeFiles/grk_compress.dir/build.make:418: bin/grk_compress] Error 1
make[3]: Leaving directory '/<<PKGBUILDDIR>>/obj-arm-linux-gnueabihf'
make[2]: *** [CMakeFiles/Makefile2:342: src/bin/jp2/CMakeFiles/grk_compress.dir/all] Error 2
make[2]: Leaving directory '/<<PKGBUILDDIR>>/obj-arm-linux-gnueabihf'
make[1]: *** [Makefile:174: all] Error 2
make[1]: Leaving directory '/<<PKGBUILDDIR>>/obj-arm-linux-gnueabihf'
dh_auto_build: error: cd obj-arm-linux-gnueabihf && make -j4 "INSTALL=install --strip-program=true" VERBOSE=1 returned exit code 2
make: *** [debian/rules:14: binary-arch] Error 25

Tail of log for libmlx5 on armhf:

#define HAVE_STDLIB_H 1
#define HAVE_STRING_H 1
#define HAVE_MEMORY_H 1
#define HAVE_STRINGS_H 1
#define HAVE_INTTYPES_H 1
#define HAVE_STDINT_H 1
#define HAVE_UNISTD_H 1
#define HAVE_DLFCN_H 1
#define LT_OBJDIR ".libs/"
#define NVALGRIND 1
#define HAVE_LIBIBVERBS 1

configure: exit 1
dh_auto_configure: error: ./configure --build=arm-linux-gnueabihf --prefix=/usr --includedir=\${prefix}/include --mandir=\${prefix}/share/man --infodir=\${prefix}/share/info --sysconfdir=/etc --localstatedir=/var --disable-option-checking --disable-silent-rules --libdir=\${prefix}/lib/arm-linux-gnueabihf --libexecdir=\${prefix}/lib/arm-linux-gnueabihf --disable-maintainer-mode --disable-dependency-tracking returned exit code 1
make: *** [debian/rules:6: build-arch] Error 25

Tail of log for leela-zero on armhf:

/usr/include/c++/10/bits/atomic_base.h:426: undefined reference to `__atomic_load_8'
/usr/bin/ld: /usr/include/c++/10/bits/atomic_base.h:426: undefined reference to `__atomic_load_8'
/usr/bin/ld: /usr/include/c++/10/bits/atomic_base.h:426: undefined reference to `__atomic_load_8'
/usr/bin/ld: /usr/include/c++/10/bits/atomic_base.h:426: undefined reference to `__atomic_load_8'
/usr/bin/ld: /usr/include/c++/10/bits/atomic_base.h:426: undefined reference to `__atomic_load_8'
/usr/bin/ld: CMakeFiles/objs.dir/src/UCTNodePointer.cpp.o:/usr/include/c++/10/bits/atomic_base.h:426: more undefined references to `__atomic_load_8' follow
collect2: error: ld returned 1 exit status
make[3]: *** [CMakeFiles/tests.dir/build.make:177: tests] Error 1
make[3]: Leaving directory '/<<PKGBUILDDIR>>/obj-arm-linux-gnueabihf'
make[2]: *** [CMakeFiles/Makefile2:208: CMakeFiles/tests.dir/all] Error 2
make[2]: Leaving directory '/<<PKGBUILDDIR>>/obj-arm-linux-gnueabihf'
make[1]: *** [Makefile:174: all] Error 2
make[1]: Leaving directory '/<<PKGBUILDDIR>>/obj-arm-linux-gnueabihf'
dh_auto_build: error: cd obj-arm-linux-gnueabihf && make -j4 "INSTALL=install --strip-program=true" VERBOSE=1 returned exit code 2
make: *** [debian/rules:15: build-arch] Error 25

Tail of log for libnunc-stans on armhf:

mkdir -p bin
mkdir -p obj
gcc -MM -std=c99 -I"src" -I"inc" src/abstraction/abstraction_dcas.c >obj/abstraction_dcas.d
gcc -g -O2 -ffile-prefix-map=/<<PKGBUILDDIR>>=. -fstack-protector-strong -Wformat -Werror=format-security  -c -fpic -Wno-unknown-pragmas -std=c99 -I"src" -I"inc"  -o obj/abstraction_dcas.o src/abstraction/abstraction_dcas.c
/tmp/ccMmL0VA.s: Assembler messages:
/tmp/ccMmL0VA.s:74: Error: selected processor does not support `ldrexd r6,r7,[r0]' in ARM mode
/tmp/ccMmL0VA.s:74: Error: selected processor does not support `strexd lr,r2,r3,[r0]' in ARM mode
make[3]: *** [makefile.linux:79: obj/abstraction_dcas.o] Error 1
make[3]: Leaving directory '/<<PKGBUILDDIR>>/liblfds'
make[2]: *** [Makefile:921: all-recursive] Error 1
make[2]: Leaving directory '/<<PKGBUILDDIR>>'
make[1]: *** [Makefile:646: all] Error 2
make[1]: Leaving directory '/<<PKGBUILDDIR>>'
dh_auto_build: error: make -j1 returned exit code 2
make: *** [debian/rules:21: build-arch] Error 25

Tail of log for librandomx on armhf:

collect2: error: ld returned 1 exit status
make[3]: *** [CMakeFiles/randomx-benchmark.dir/build.make:122: randomx-benchmark] Error 1
make[3]: Leaving directory '/<<PKGBUILDDIR>>/obj-arm-linux-gnueabihf'
make[2]: *** [CMakeFiles/Makefile2:104: CMakeFiles/randomx-benchmark.dir/all] Error 2
make[2]: *** Waiting for unfinished jobs....
[100%] Linking CXX executable randomx-tests
/usr/bin/cmake -E cmake_link_script CMakeFiles/randomx-tests.dir/link.txt --verbose=1
/usr/bin/c++ -g -O2 -ffile-prefix-map=/<<PKGBUILDDIR>>=. -fstack-protector-strong -Wformat -Werror=format-security -Wdate-time -D_FORTIFY_SOURCE=2 -Wl,-z,relro -rdynamic CMakeFiles/randomx-tests.dir/src/tests/tests.cpp.o -o randomx-tests  -Wl,-rpath,/<<PKGBUILDDIR>>/obj-arm-linux-gnueabihf librandomx.so.0.0.0 
make[3]: Leaving directory '/<<PKGBUILDDIR>>/obj-arm-linux-gnueabihf'
[100%] Built target randomx-tests
make[2]: Leaving directory '/<<PKGBUILDDIR>>/obj-arm-linux-gnueabihf'
make[1]: *** [Makefile:152: all] Error 2
make[1]: Leaving directory '/<<PKGBUILDDIR>>/obj-arm-linux-gnueabihf'
dh_auto_build: error: cd obj-arm-linux-gnueabihf && make -j4 "INSTALL=install --strip-program=true" VERBOSE=1 returned exit code 2
make: *** [debian/rules:43: binary-arch] Error 25

Tail of log for libtango on armhf:

dpkg-buildpackage: info: host architecture armhf
 fakeroot debian/rules clean
QUILT_PATCHES=debian/patches \
	quilt --quiltrc /dev/null pop -a -R || test $? = 2
No patch removed
rm -rf .pc debian/stamp-patched
dh_testdir
dh_testroot
rm -rf stamps objs
find build -type d -name "objs-*" | xargs rm -rf
rm -f build-stamp-*
dh_clean
dh_clean: warning: Compatibility levels before 10 are deprecated (level 7 in use)
 debian/rules build-arch
make: *** No rule to make target 'build-arch'.  Stop.

Tail of log for libretro-mupen64plus on armhf:

                 from ./libretro-common/include/glsym/rglgen.h:30,
                 from ./libretro/opengl_state_machine.h:4,
                 from ./libretro/SDL_opengles2.h:29,
                 from gles2rice/src/osal_opengl.h:33,
                 from gles2rice/src/DeviceBuilder.cpp:21:
/usr/include/GLES2/gl2ext.h:3092:16: note: previous declaration as 'typedef double GLdouble'
 3092 | typedef double GLdouble;
      |                ^~~~~~~~
make[2]: *** [Makefile:408: gles2rice/src/DeviceBuilder.o] Error 1
make[2]: *** Waiting for unfinished jobs....
make[2]: Leaving directory '/<<BUILDDIR>>/libretro-mupen64plus-2.0+git20160207+dfsg2'
dh_auto_build: error: make -j4 "platform=armv gles neon hardfloat" returned exit code 2
make[1]: *** [debian/rules:19: override_dh_auto_build] Error 25
make[1]: Leaving directory '/<<BUILDDIR>>/libretro-mupen64plus-2.0+git20160207+dfsg2'
make: *** [debian/rules:16: build-arch] Error 2

Tail of log for kleborate on armhf:

- unknown
+ Yersinia (unknown species)


----------------------------------------------------------------------
Ran 219 tests in 638.445s

FAILED (failures=20)
{'Sul_acquired': 'sul2^', 'Tet_acquired': '-', 'Bla_acquired': '-', 'Bla_inhR_acquired': '-', 'Bla_ESBL_acquired': '-', 'Bla_ESBL_inhR_acquired': '-', 'Bla_Carb_acquired': '-', 'Bla_chr': '-', 'SHV_mutations': '-', 'Omp_mutations': 'OmpK35-0%;OmpK36-0%', 'Col_mutations': 'MgrB-0%;PmrB-0%', 'Flq_mutations': '-', 'truncated_resistance_hits': '-', 'spurious_resistance_hits': '-'}
{'Sul_acquired': '-', 'Tet_acquired': '-', 'Bla_acquired': '-', 'Bla_inhR_acquired': '-', 'Bla_ESBL_acquired': '-', 'Bla_ESBL_inhR_acquired': '-', 'Bla_Carb_acquired': '-', 'Bla_chr': 'OKP-B-6^', 'SHV_mutations': '-', 'Omp_mutations': 'OmpK35-0%;OmpK36-0%', 'Col_mutations': 'MgrB-0%;PmrB-0%', 'Flq_mutations': '-', 'truncated_resistance_hits': '-', 'spurious_resistance_hits': '-'}
{'Sul_acquired': '-', 'Tet_acquired': '-', 'Bla_acquired': '-', 'Bla_inhR_acquired': '-', 'Bla_ESBL_acquired': '-', 'Bla_ESBL_inhR_acquired': '-', 'Bla_Carb_acquired': '-', 'Bla_chr': 'OKP-B-6^', 'SHV_mutations': '-', 'Omp_mutations': 'OmpK35-0%;OmpK36-0%', 'Col_mutations': 'MgrB-0%;PmrB-0%', 'Flq_mutations': '-', 'truncated_resistance_hits': '-', 'spurious_resistance_hits': '-'}
{'Sul_acquired': '-', 'Tet_acquired': '-', 'Bla_acquired': '-', 'Bla_inhR_acquired': '-', 'Bla_ESBL_acquired': '-', 'Bla_ESBL_inhR_acquired': '-', 'Bla_Carb_acquired': '-', 'Bla_chr': 'OKP-B-6^', 'SHV_mutations': '-', 'Omp_mutations': 'OmpK35-0%;OmpK36-0%', 'Col_mutations': 'MgrB-0%;PmrB-0%', 'Flq_mutations': '-', 'truncated_resistance_hits': '-', 'spurious_resistance_hits': '-'}
E: pybuild pybuild:353: test: plugin distutils failed with: exit code=1: cd /<<PKGBUILDDIR>>/.pybuild/cpython3_3.9/build; python3.9 -m unittest discover -v 
dh_auto_test: error: pybuild --test -i python{version} -p 3.9 returned exit code 13
make: *** [debian/rules:6: binary-arch] Error 25

Tail of log for libxsmm on armhf:

      |   ^~~~~
In file included from include/libxsmm.h:65,
                 from ./src/libxsmm_gemm_diff.h:34,
                 from ./src/libxsmm_main.c:31:
./src/libxsmm_main.c: In function 'libxsmm_init':
include/libxsmm_sync.h:70:29: warning: implicit declaration of function '__builtin_ia32_pause'; did you mean '__builtin_isspace'? [-Wimplicit-function-declaration]
   70 | # define LIBXSMM_SYNC_PAUSE __builtin_ia32_pause()
      |                             ^~~~~~~~~~~~~~~~~~~~
./src/libxsmm_main.c:719:36: note: in expansion of macro 'LIBXSMM_SYNC_PAUSE'
  719 |       if (0 != once) break; else { LIBXSMM_SYNC_PAUSE; }
      |                                    ^~~~~~~~~~~~~~~~~~
make[1]: *** [Makefile:721: build/intel64/libxsmm_main.o] Error 1
make[1]: Leaving directory '/<<PKGBUILDDIR>>'
dh_auto_build: error: make -j1 returned exit code 2
make: *** [debian/rules:7: build-arch] Error 25

Tail of log for massivethreads on armhf:

      |  ^~~~~
libtool: compile:  gcc -DHAVE_CONFIG_H -I. -Wdate-time -D_FORTIFY_SOURCE=2 -D_GNU_SOURCE -D_XOPEN_SOURCE -D_DARWIN_C_SOURCE -I/<<PKGBUILDDIR>>/include -DMYTH_WRAP=MYTH_WRAP_VANILLA -g -O2 -ffile-prefix-map=/<<PKGBUILDDIR>>=. -fstack-protector-strong -Wformat -Werror=format-security -c myth_internal_barrier.c -o libmyth_la-myth_internal_barrier.o >/dev/null 2>&1
make[4]: *** [Makefile:991: libmyth_la-myth_log.lo] Error 1
make[4]: *** Waiting for unfinished jobs....
make[4]: *** [Makefile:998: libmyth_la-myth_sched.lo] Error 1
libtool: compile:  gcc -DHAVE_CONFIG_H -I. -Wdate-time -D_FORTIFY_SOURCE=2 -D_GNU_SOURCE -D_XOPEN_SOURCE -D_DARWIN_C_SOURCE -I/<<PKGBUILDDIR>>/include -DMYTH_WRAP=MYTH_WRAP_VANILLA -g -O2 -ffile-prefix-map=/<<PKGBUILDDIR>>=. -fstack-protector-strong -Wformat -Werror=format-security -c myth_bind_worker.c -o libmyth_la-myth_bind_worker.o >/dev/null 2>&1
make[4]: Leaving directory '/<<PKGBUILDDIR>>/src'
make[3]: *** [Makefile:1121: all-recursive] Error 1
make[3]: Leaving directory '/<<PKGBUILDDIR>>/src'
make[2]: *** [Makefile:573: all] Error 2
make[2]: Leaving directory '/<<PKGBUILDDIR>>/src'
make[1]: *** [Makefile:392: all-recursive] Error 1
make[1]: Leaving directory '/<<PKGBUILDDIR>>'
dh_auto_build: error: make -j4 returned exit code 2
make: *** [debian/rules:4: binary-arch] Error 25

Tail of log for mariadb-connector-odbc on armhf:

/usr/bin/cc -g -O2 -ffile-prefix-map=/<<PKGBUILDDIR>>=. -fstack-protector-strong -Wformat -Werror=format-security -I/usr/include/mariadb -Wdate-time -D_FORTIFY_SOURCE=2 -DCHECK_FUNCTION_EXISTS=floor -Wl,-z,relro  -rdynamic CMakeFiles/cmTC_bc717.dir/CheckFunctionExists.c.o -o cmTC_bc717 
/usr/bin/ld: CMakeFiles/cmTC_bc717.dir/CheckFunctionExists.c.o: in function `main':
/usr/share/cmake-3.18/Modules/CheckFunctionExists.c:17: undefined reference to `floor'
collect2: error: ld returned 1 exit status
gmake[3]: *** [CMakeFiles/cmTC_bc717.dir/build.make:106: cmTC_bc717] Error 1
gmake[3]: Leaving directory '/<<PKGBUILDDIR>>/obj-arm-linux-gnueabihf/CMakeFiles/CMakeTmp'
gmake[2]: *** [Makefile:140: cmTC_bc717/fast] Error 2
gmake[2]: Leaving directory '/<<PKGBUILDDIR>>/obj-arm-linux-gnueabihf/CMakeFiles/CMakeTmp'



dh_auto_configure: error: cd obj-arm-linux-gnueabihf && cmake -DCMAKE_INSTALL_PREFIX=/usr -DCMAKE_BUILD_TYPE=None -DCMAKE_INSTALL_SYSCONFDIR=/etc -DCMAKE_INSTALL_LOCALSTATEDIR=/var -DCMAKE_EXPORT_NO_PACKAGE_REGISTRY=ON -DCMAKE_FIND_USE_PACKAGE_REGISTRY=OFF -DCMAKE_FIND_PACKAGE_NO_PACKAGE_REGISTRY=ON -DCMAKE_INSTALL_RUNSTATEDIR=/run "-GUnix Makefiles" -DCMAKE_VERBOSE_MAKEFILE=ON -DCMAKE_INSTALL_LIBDIR=lib/arm-linux-gnueabihf -DMARIADB_LINK_DYNAMIC=yes -DINSTALL_LIBDIR=lib/arm-linux-gnueabihf/odbc .. returned exit code 1
make[1]: *** [debian/rules:11: override_dh_auto_configure] Error 25
make[1]: Leaving directory '/<<PKGBUILDDIR>>'
make: *** [debian/rules:8: build-arch] Error 2

Tail of log for mes on armhf:

+ stage0_cpu=armv7l
+ trace 'CCLD       lib/linux/arm-mes-gcc/exit-42.S' /usr/bin/gcc -nostdlib -g lib/linux/arm-mes-gcc/exit-42.S -o exit-42
+ shift
+ echo /usr/bin/gcc -nostdlib -g lib/linux/arm-mes-gcc/exit-42.S -o exit-42
+ eval /usr/bin/gcc -nostdlib -g lib/linux/arm-mes-gcc/exit-42.S -o exit-42
++ /usr/bin/gcc -nostdlib -g lib/linux/arm-mes-gcc/exit-42.S -o exit-42
lib/linux/arm-mes-gcc/exit-42.S: Assembler messages:
lib/linux/arm-mes-gcc/exit-42.S:46: Error: selected processor does not support `wfi' in ARM mode
make[2]: *** [GNUmakefile:95: build] Error 1
make[2]: *** Waiting for unfinished jobs....
make[2]: Leaving directory '/<<PKGBUILDDIR>>'
dh_auto_build: error: make -j4 V=2 returned exit code 2
make[1]: *** [debian/rules:26: override_dh_auto_build] Error 25
make[1]: Leaving directory '/<<PKGBUILDDIR>>'
make: *** [debian/rules:20: binary-arch] Error 2

Tail of log for mojoshader on armhf:

[  6%] Built target lemon
make  -f CMakeFiles/mojoshader.dir/build.make CMakeFiles/mojoshader.dir/depend
make[3]: Entering directory '/<<BUILDDIR>>/mojoshader-0.0~hg1314+dfsg/obj-arm-linux-gnueabihf'
[  9%] Generating ../mojoshader_parser_hlsl.h
./lemon -q -T/<<BUILDDIR>>/mojoshader-0.0~hg1314+dfsg/misc/lempar.c /<<BUILDDIR>>/mojoshader-0.0~hg1314+dfsg/mojoshader_parser_hlsl.lemon
Segmentation fault
make[3]: *** [CMakeFiles/mojoshader.dir/build.make:86: ../mojoshader_parser_hlsl.h] Error 139
make[3]: *** Deleting file '../mojoshader_parser_hlsl.h'
make[3]: Leaving directory '/<<BUILDDIR>>/mojoshader-0.0~hg1314+dfsg/obj-arm-linux-gnueabihf'
make[2]: *** [CMakeFiles/Makefile2:139: CMakeFiles/mojoshader.dir/all] Error 2
make[2]: Leaving directory '/<<BUILDDIR>>/mojoshader-0.0~hg1314+dfsg/obj-arm-linux-gnueabihf'
make[1]: *** [Makefile:152: all] Error 2
make[1]: Leaving directory '/<<BUILDDIR>>/mojoshader-0.0~hg1314+dfsg/obj-arm-linux-gnueabihf'
dh_auto_build: error: cd obj-arm-linux-gnueabihf && make -j4 "INSTALL=install --strip-program=true" VERBOSE=1 returned exit code 2
make: *** [debian/rules:12: binary-arch] Error 25

Tail of log for micropython on armhf:

pass  import/builtin_import.py
pass  import/gen_context.py
pass  import/gen_context2.py
pass  import/import1a.py
pass  unix/time.py
753 tests performed (20567 individual testcases)
747 tests passed
108 tests skipped: annotate_var async_with async_with2 async_with_break async_with_return btree1 btree_error btree_gc builtin_next_arg2 builtin_range_binop class_inplace_op2 cmd_parsetree del_deref del_local emg_exc exception_chain extra_coverage features ffi_types framebuf1 framebuf16 framebuf2 framebuf4 framebuf8 framebuf_palette framebuf_subclass fun_globals fun_name gen_yield_from_close generator_name heap_locked heapalloc_traceback import_mpy_invalid io_buffered_writer machine_timer math_factorial_intbig memoryview_itemsize namedtuple_asdict opt_level_lineno print_exception repl_words_move resource_stream schedule scope_implicit sys_exc_info sys_getsizeof sys_settrace_features sys_settrace_generator sys_settrace_loop try_finally_return2 try_reraise try_reraise2 uasyncio_await_return uasyncio_basic uasyncio_basic2 uasyncio_cancel_fair uasyncio_cancel_fair2 uasyncio_cancel_self uasyncio_cancel_task uasyncio_cancel_wait_on_finished uasyncio_current_task uasyncio_event uasyncio_event_fair uasyncio_exception uasyncio_fair uasyncio_gather uasyncio_get_event_loop uasyncio_heaplock uasyncio_lock uasyncio_lock_cancel uasyncio_loop_stop uasyncio_micropython uasyncio_new_event_loop uasyncio_set_exception_handler uasyncio_task_done uasyncio_threadsafeflag uasyncio_wait_for uasyncio_wait_for_fwd uasyncio_wait_task ucryptolib_aes128_ctr unboundlocal urandom_extra urandom_extra_float urandom_seed_default ure_debug ure_groups ure_span ure_sub ure_sub_unmatched vfs_basic vfs_blockdev vfs_fat_fileio1 vfs_fat_fileio2 vfs_fat_finaliser vfs_fat_more vfs_fat_mtime vfs_fat_oldproto vfs_fat_ramdisk vfs_fat_ramdisklarge vfs_lfs vfs_lfs_corrupt vfs_lfs_error vfs_lfs_file vfs_lfs_mount vfs_lfs_mtime vfs_lfs_superblock vfs_posix vfs_userfs
6 tests failed: extreme_exc fun_largestate import_pkg3 import_pkg4 import_pkg6 string_format2
make[2]: *** [Makefile:313: test] Error 1
make[2]: Leaving directory '/<<BUILDDIR>>/micropython-1.17+ds/ports/unix'
dh_auto_test: error: cd ports/unix && make -j4 test STRIP=true MICROPY_PY_BTREE=0 MICROPY_SSL_AXTLS=0 MICROPY_SSL_MBEDTLS=1 MICROPY_PY_JNI=1 "TESTS_ARGS=--emit native -e '(?:ussl_basic|urandom_basic|import_pkg7|mpy_native)'" returned exit code 2
make[1]: *** [debian/rules:66: override_dh_auto_test-arch] Error 25
make[1]: Leaving directory '/<<BUILDDIR>>/micropython-1.17+ds'
make: *** [debian/rules:36: binary-arch] Error 2

Tail of log for mrs on armhf:

   debian/rules override_dh_auto_configure
make[1]: Entering directory '/<<BUILDDIR>>/mrs-6.0.5+dfsg'
./configure --prefix=/usr --config-dir=/etc/mrs/ \
	--man-dir=/usr/share/man --mrs-user=mrs-dba \
	--data-dir=/var/lib/mrs --log-dir=/var/log/mrs
length() used on @boost_version (did you mean "scalar(@boost_version)"?) at ./configure line 289.
Using perl /usr/bin/perl
Checking for a compiler... OK
Checking for libboost... OK
Checking for libzeep...libzeep is not installed, either install the package libzeep-dev
or download libzeep from ftp://ftp.cmbi.ru.nl/pub/software/libzeep
and run configure again.
make[1]: *** [debian/rules:15: override_dh_auto_configure] Error 2
make[1]: Leaving directory '/<<BUILDDIR>>/mrs-6.0.5+dfsg'
make: *** [debian/rules:12: binary-arch] Error 2

Tail of log for listaller on armhf:

  Command-line option `--thread` is deprecated and will be ignored

  Compilation failed: 7 error(s), 12 warning(s)



make[3]: *** [src/CMakeFiles/listaller-glib_precompile.dir/build.make:126: src/CMakeFiles/listaller-glib_precompile.dir/precompile.stamp] Error 1
make[3]: Leaving directory '/<<PKGBUILDDIR>>/obj-arm-linux-gnueabihf'
make[2]: *** [CMakeFiles/Makefile2:711: src/CMakeFiles/listaller-glib_precompile.dir/all] Error 2
make[2]: Leaving directory '/<<PKGBUILDDIR>>/obj-arm-linux-gnueabihf'
make[1]: *** [Makefile:163: all] Error 2
make[1]: Leaving directory '/<<PKGBUILDDIR>>/obj-arm-linux-gnueabihf'
dh_auto_build: error: cd obj-arm-linux-gnueabihf && make -j1 VERBOSE=1 returned exit code 2
make: *** [debian/rules:15: build-arch] Error 25

Tail of log for msrtool on armhf:

gcc -g -O2 -ffile-prefix-map=/<<PKGBUILDDIR>>=. -fstack-protector-strong -Wformat -Werror=format-security -Os -Wall -Werror   -c -o msrutils.o msrutils.c
gcc -g -O2 -ffile-prefix-map=/<<PKGBUILDDIR>>=. -fstack-protector-strong -Wformat -Werror=format-security -Os -Wall -Werror   -c -o sys.o sys.c
sys.c: In function 'cpuid':
sys.c:40:2: error: unknown register name '%edx' in 'asm'
   40 |  asm ("cpuid" : "=b" (outebx) : "a" (0) : "%ecx", "%edx");
      |  ^~~
sys.c:40:2: error: unknown register name '%ecx' in 'asm'
sys.c:54:2: error: unknown register name '%edx' in 'asm'
   54 |  asm ("cpuid" : "=a" (outeax) : "a" (1) : "%ebx", "%ecx", "%edx");
      |  ^~~
sys.c:54:2: error: unknown register name '%ecx' in 'asm'
sys.c:54:2: error: unknown register name '%ebx' in 'asm'
make[1]: *** [<builtin>: sys.o] Error 1
make[1]: Leaving directory '/<<PKGBUILDDIR>>'
make: *** [/usr/share/cdbs/1/class/makefile.mk:77: debian/stamp-makefile-build] Error 2

Tail of log for neuron on armhf:

libtool: link: (cd ".libs" && rm -f "libocxt.so" && ln -s "libocxt.so.0.0.0" "libocxt.so")
libtool: link: ( cd ".libs" && rm -f "libocxt.la" && ln -s "../libocxt.la" "libocxt.la" )
make[6]: Leaving directory '/<<PKGBUILDDIR>>/src/oc'
make[5]: *** [Makefile:563: all] Error 2
make[5]: Leaving directory '/<<PKGBUILDDIR>>/src/oc'
make[4]: *** [Makefile:520: all-recursive] Error 1
make[4]: Leaving directory '/<<PKGBUILDDIR>>/src'
make[3]: *** [Makefile:658: all-recursive] Error 1
make[3]: Leaving directory '/<<PKGBUILDDIR>>'
make[2]: *** [Makefile:516: all] Error 2
make[2]: Leaving directory '/<<PKGBUILDDIR>>'
dh_auto_build: error: make -j4 returned exit code 2
make[1]: *** [debian/rules:32: override_dh_auto_build] Error 25
make[1]: Leaving directory '/<<PKGBUILDDIR>>'
make: *** [debian/rules:15: build-arch] Error 2

Tail of log for nix on armhf:

  121 |    _M_realloc_insert(end(), std::forward<_Args>(__args)...);
      |    ~~~~~~~~~~~~~~~~~^~~~~~~~~~~~~~~~~~~~~~~~~~~~~~~~~~~~~~~
/usr/include/c++/10/bits/vector.tcc:121:21: note: parameter passing for argument of type '__gnu_cxx::__normal_iterator<nlohmann::basic_json<>*, std::vector<nlohmann::basic_json<>, std::allocator<nlohmann::basic_json<> > > >' changed in GCC 7.1
  121 |    _M_realloc_insert(end(), std::forward<_Args>(__args)...);
      |    ~~~~~~~~~~~~~~~~~^~~~~~~~~~~~~~~~~~~~~~~~~~~~~~~~~~~~~~~
g++ -std=c++17 -o src/libexpr/value-to-xml.o -c src/libexpr/value-to-xml.cc -fstack-protector-strong -Wformat -Werror=format-security -g -Wall -include config.h -Wdate-time -D_FORTIFY_SOURCE=2 -fPIC -g -I . -I src -I src/libutil -I src/libstore -I src/libmain -I src/libexpr -I src/nix  -DREADLINE -I/usr/include/arm-linux-gnueabihf -I/usr/include -g -O2 -ffile-prefix-map=/<<BUILDDIR>>/nix-2.3.10+dfsg1=. -fstack-protector-strong -Wformat -Werror=format-security  -MMD -MF src/libexpr/.value-to-xml.o.dep -MP
g++ -std=c++17 -o /<<BUILDDIR>>/nix-2.3.10+dfsg1/src/libutil/libnixutil.so -shared -L/usr/lib/arm-linux-gnueabihf -Wl,-z,relro -Wl,-z,now -L/usr/lib/arm-linux-gnueabihf -Wl,-z,relro -Wl,-z,now -Wl,--no-copy-dt-needed-entries src/libutil/affinity.o src/libutil/archive.o src/libutil/args.o src/libutil/compression.o src/libutil/config.o src/libutil/hash.o src/libutil/json.o src/libutil/logging.o src/libutil/serialise.o src/libutil/thread-pool.o src/libutil/util.o src/libutil/xml-writer.o -llzma -lbz2 -pthread -lcrypto -lbrotlienc -lbrotlidec -L/usr/lib/arm-linux-gnueabihf -lboost_context -Wl,-z,defs -Wl,-soname=libnixutil.so   
/usr/bin/ld: src/libutil/logging.o: in function `std::__atomic_base<unsigned long long>::fetch_add(unsigned long long, std::memory_order)':
/usr/include/c++/10/bits/atomic_base.h:548: undefined reference to `__atomic_fetch_add_8'
collect2: error: ld returned 1 exit status
make[1]: *** [mk/lib.mk:104: src/libutil/libnixutil.so] Error 1
make[1]: *** Waiting for unfinished jobs....
make[1]: Leaving directory '/<<BUILDDIR>>/nix-2.3.10+dfsg1'
dh_auto_build: error: make -j4 returned exit code 2
make: *** [debian/rules:31: build-arch] Error 25

Tail of log for nsd3 on armhf:

#define FACILITY LOG_DAEMON
#define MAX_INTERFACES 8
#define TCP_TIMEOUT 120
#define ROOT_SERVER /**/
#define INET6 /**/
#define BIND8_STATS /**/
#define NDEBUG /**/
#define RATELIMIT /**/
#define HAVE_SSL /**/

configure: exit 1
dh_auto_configure: error: ./configure --build=arm-linux-gnueabihf --prefix=/usr --includedir=\${prefix}/include --mandir=\${prefix}/share/man --infodir=\${prefix}/share/info --sysconfdir=/etc --localstatedir=/var --disable-option-checking --disable-silent-rules --libexecdir=\${prefix}/lib/nsd3 --disable-maintainer-mode --disable-dependency-tracking --with-configdir=/etc/nsd3 --with-nsd_conf_file=/etc/nsd3/nsd.conf --with-pidfile=/var/run/nsd3/nsd.pid --with-dbfile=/var/lib/nsd3/nsd.db --with-zonesdir=/etc/nsd3 --with-difffile=/var/lib/nsd3/ixfr.db --with-xfrdfile=/var/lib/nsd3/xfrd.state --disable-largefile --enable-root-server --enable-mmap --enable-ratelimit returned exit code 1
make[1]: *** [debian/rules:32: override_dh_auto_configure] Error 25
make[1]: Leaving directory '/<<PKGBUILDDIR>>'
make: *** [debian/rules:26: build-arch] Error 2

Tail of log for node-srs on armhf:

make[1]: *** [gdal.target.mk:154: Release/obj.target/gdal/src/node_gdal.o] Error 1
make[1]: Leaving directory '/<<BUILDDIR>>/node-srs-1.2.0+~2.6.2/gdal/build'
gyp ERR! build error 
gyp ERR! stack Error: `make` failed with exit code: 2
gyp ERR! stack     at ChildProcess.onExit (/usr/share/nodejs/node-gyp/lib/build.js:194:23)
gyp ERR! stack     at ChildProcess.emit (events.js:314:20)
gyp ERR! stack     at Process.ChildProcess._handle.onexit (internal/child_process.js:276:12)
gyp ERR! System Linux 4.9.0-0.bpo.6-armmp
gyp ERR! command "/usr/bin/node" "/usr/bin/node-gyp" "rebuild" "-module_name=gdal" "-module_path=lib/binding/" "-shared_gdal=1"
gyp ERR! cwd /<<BUILDDIR>>/node-srs-1.2.0+~2.6.2/gdal
gyp ERR! node -v v12.22.5
gyp ERR! node-gyp -v v7.1.2
gyp ERR! not ok 
dh_auto_build: error: cd ./gdal && sh -ex ../debian/nodejs/gdal/build returned exit code 1
make: *** [debian/rules:10: binary-arch] Error 25

Tail of log for odc on armhf:

/<<PKGBUILDDIR>>/src/odc/codec/Integer.h:87:41: error: static assertion failed: unsafe casting check
/<<PKGBUILDDIR>>/src/odc/codec/Integer.h: In instantiation of 'void odc::codec::CodecIntegerOffset<ByteOrder, ValueType, InternalValueType, DerivedCodec>::decode(double*) [with ByteOrder = odc::core::OtherByteOrder; ValueType = long long int; InternalValueType = short unsigned int; DerivedCodec = odc::codec::CodecInt16<odc::core::OtherByteOrder, long long int>]':
/<<PKGBUILDDIR>>/src/odc/codec/Integer.h:86:10:   required from here
/<<PKGBUILDDIR>>/src/odc/codec/Integer.h:87:41: error: static assertion failed: unsafe casting check
/<<PKGBUILDDIR>>/src/odc/codec/Integer.h: In instantiation of 'void odc::codec::CodecIntegerOffset<ByteOrder, ValueType, InternalValueType, DerivedCodec>::decode(double*) [with ByteOrder = odc::core::SameByteOrder; ValueType = long long int; InternalValueType = short unsigned int; DerivedCodec = odc::codec::CodecInt16<odc::core::SameByteOrder, long long int>]':
/<<PKGBUILDDIR>>/src/odc/codec/Integer.h:86:10:   required from here
/<<PKGBUILDDIR>>/src/odc/codec/Integer.h:87:41: error: static assertion failed: unsafe casting check
make[3]: *** [src/odc/CMakeFiles/odccore.dir/build.make:631: src/odc/CMakeFiles/odccore.dir/codec/String.cc.o] Error 1
make[3]: Leaving directory '/<<PKGBUILDDIR>>/obj-arm-linux-gnueabihf'
make[2]: *** [CMakeFiles/Makefile2:1322: src/odc/CMakeFiles/odccore.dir/all] Error 2
make[2]: Leaving directory '/<<PKGBUILDDIR>>/obj-arm-linux-gnueabihf'
make[1]: *** [Makefile:185: all] Error 2
make[1]: Leaving directory '/<<PKGBUILDDIR>>/obj-arm-linux-gnueabihf'
dh_auto_build: error: cd obj-arm-linux-gnueabihf && make -j4 "INSTALL=install --strip-program=true" returned exit code 2
make: *** [debian/rules:19: build-arch] Error 25

Tail of log for open-axiom on armhf:

/* confdefs.h */
#define PACKAGE_NAME "OpenAxiom"
#define PACKAGE_TARNAME "openaxiom"
#define PACKAGE_VERSION "1.5.0-2013-06-21"
#define PACKAGE_STRING "OpenAxiom 1.5.0-2013-06-21"
#define PACKAGE_BUGREPORT "open-axiom-bugs@lists.sf.net"
#define PACKAGE_URL ""
#define PACKAGE "openaxiom"
#define VERSION "1.5.0-2013-06-21"
#define OPENAXIOM_BASE_RTS Runtime::sbcl

configure: exit 1
dh_auto_configure: error: cd build-tree && ../configure --build=arm-linux-gnueabihf --prefix=/usr --includedir=\${prefix}/include --mandir=\${prefix}/share/man --infodir=\${prefix}/share/info --sysconfdir=/etc --localstatedir=/var --disable-option-checking --disable-silent-rules --libexecdir=\${prefix}/lib/open-axiom --disable-maintainer-mode --disable-dependency-tracking --with-lisp=sbcl --with-x --disable-gcl returned exit code 1
make: *** [debian/rules:50: configure-stamp] Error 25

Tail of log for openmm on armhf:

In file included from /<<PKGBUILDDIR>>/libraries/vecmath/src/vecmath.cpp:2:
/<<PKGBUILDDIR>>/libraries/vecmath/include/neon_mathfun.h:53:25: note: called from here
   53 |   v4sf one = vdupq_n_f32(1);
      |              ~~~~~~~~~~~^~~
make[4]: *** [CMakeFiles/OpenMM.dir/build.make:2555: CMakeFiles/OpenMM.dir/libraries/vecmath/src/vecmath.cpp.o] Error 1
make[4]: *** Waiting for unfinished jobs....
make[4]: Leaving directory '/<<PKGBUILDDIR>>/obj-arm-linux-gnueabihf'
make[3]: *** [CMakeFiles/Makefile2:1442: CMakeFiles/OpenMM.dir/all] Error 2
make[3]: Leaving directory '/<<PKGBUILDDIR>>/obj-arm-linux-gnueabihf'
make[2]: *** [Makefile:163: all] Error 2
make[2]: Leaving directory '/<<PKGBUILDDIR>>/obj-arm-linux-gnueabihf'
dh_auto_build: error: cd obj-arm-linux-gnueabihf && make -j4 "INSTALL=install --strip-program=true" VERBOSE=1 returned exit code 2
make[1]: *** [debian/rules:31: override_dh_auto_build] Error 25
make[1]: Leaving directory '/<<PKGBUILDDIR>>'
make: *** [debian/rules:25: binary-arch] Error 2

Tail of log for pbseqlib on armhf:

                 from ../alignment/algorithms/anchoring/BWTSearch.hpp:6,
                 from ../alignment/algorithms/anchoring/BWTSearch.cpp:1:
../alignment/suffixarray/SuffixArray.hpp: In member function ‘void SuffixArray<T, Sigma, Compare, Tuple>::LarssonBuildSuffixArray(T*, SAIndexLength, Sigma&)’:
../alignment/suffixarray/SuffixArray.hpp:288:44: error: narrowing conversion of ‘4294967295’ from ‘unsigned int’ to ‘long int’ [-Wnarrowing]
  288 |         LarssonSuffixSort<SAIndex, UINT_MAX> sorter;
      |                                            ^
../alignment/suffixarray/SuffixArray.hpp:289:84: error: ‘sorter’ cannot be used as a function
  289 |         sorter(index, p, ((SAIndex)targetLength), ((SAIndex)maxVal + 1), (SAIndex)1);
      |                                                                                    ^
[44/187] c++ -Ilibblasr.so.5.3.5.p -I. -I.. -I/usr/include/hdf5/serial -fdiagnostics-color=always -D_FILE_OFFSET_BITS=64 -Wall -Winvalid-pch -Wnon-virtual-dtor -Wextra -Wpedantic -std=c++17 -g -O2 -ffile-prefix-map=/<<BUILDDIR>>/pbseqlib-5.3.5+dfsg=. -fstack-protector-strong -Wformat -Werror=format-security -O3 -std=c++14 -Wdate-time -D_FORTIFY_SOURCE=2 -DHAVE_HDF5_1_10_1 -O3 -fPIC -DBOOST_ALL_NO_LIB -Wno-delete-non-virtual-dtor -Wno-unused-variable -Wno-non-virtual-dtor -MD -MQ libblasr.so.5.3.5.p/alignment_algorithms_anchoring_FindMaxInterval.cpp.o -MF libblasr.so.5.3.5.p/alignment_algorithms_anchoring_FindMaxInterval.cpp.o.d -o libblasr.so.5.3.5.p/alignment_algorithms_anchoring_FindMaxInterval.cpp.o -c ../alignment/algorithms/anchoring/FindMaxInterval.cpp
[45/187] c++ -Ilibblasr.so.5.3.5.p -I. -I.. -I/usr/include/hdf5/serial -fdiagnostics-color=always -D_FILE_OFFSET_BITS=64 -Wall -Winvalid-pch -Wnon-virtual-dtor -Wextra -Wpedantic -std=c++17 -g -O2 -ffile-prefix-map=/<<BUILDDIR>>/pbseqlib-5.3.5+dfsg=. -fstack-protector-strong -Wformat -Werror=format-security -O3 -std=c++14 -Wdate-time -D_FORTIFY_SOURCE=2 -DHAVE_HDF5_1_10_1 -O3 -fPIC -DBOOST_ALL_NO_LIB -Wno-delete-non-virtual-dtor -Wno-unused-variable -Wno-non-virtual-dtor -MD -MQ libblasr.so.5.3.5.p/alignment_algorithms_sorting_MultikeyQuicksort.cpp.o -MF libblasr.so.5.3.5.p/alignment_algorithms_sorting_MultikeyQuicksort.cpp.o.d -o libblasr.so.5.3.5.p/alignment_algorithms_sorting_MultikeyQuicksort.cpp.o -c ../alignment/algorithms/sorting/MultikeyQuicksort.cpp
[46/187] c++ -Ilibblasr.so.5.3.5.p -I. -I.. -I/usr/include/hdf5/serial -fdiagnostics-color=always -D_FILE_OFFSET_BITS=64 -Wall -Winvalid-pch -Wnon-virtual-dtor -Wextra -Wpedantic -std=c++17 -g -O2 -ffile-prefix-map=/<<BUILDDIR>>/pbseqlib-5.3.5+dfsg=. -fstack-protector-strong -Wformat -Werror=format-security -O3 -std=c++14 -Wdate-time -D_FORTIFY_SOURCE=2 -DHAVE_HDF5_1_10_1 -O3 -fPIC -DBOOST_ALL_NO_LIB -Wno-delete-non-virtual-dtor -Wno-unused-variable -Wno-non-virtual-dtor -MD -MQ libblasr.so.5.3.5.p/alignment_algorithms_sorting_LightweightSuffixArray.cpp.o -MF libblasr.so.5.3.5.p/alignment_algorithms_sorting_LightweightSuffixArray.cpp.o.d -o libblasr.so.5.3.5.p/alignment_algorithms_sorting_LightweightSuffixArray.cpp.o -c ../alignment/algorithms/sorting/LightweightSuffixArray.cpp
ninja: build stopped: subcommand failed.
dh_auto_build: error: cd obj-arm-linux-gnueabihf && LC_ALL=C.UTF-8 ninja -j4 -v returned exit code 1
make: *** [debian/rules:25: binary-arch] Error 25

Tail of log for olive on armhf:

project/clip.cpp:261:2: note: here
  261 |  case MEDIA_TYPE_SEQUENCE:
      |  ^~~~
project/clip.cpp: In member function 'int Clip::getHeight()':
project/clip.cpp:277:54: warning: this statement may fall through [-Wimplicit-fallthrough=]
  277 |         if (sequence != NULL) return sequence->height;
      |                                                      ^
project/clip.cpp:279:2: note: here
  279 |  case MEDIA_TYPE_SEQUENCE:
      |  ^~~~
make[1]: *** [Makefile:1369: clip.o] Error 1
make[1]: *** [Makefile:1392: playback.o] Error 1
make[1]: Leaving directory '/<<PKGBUILDDIR>>'
dh_auto_build: error: make -j4 returned exit code 2
make: *** [debian/rules:17: build-arch] Error 25

Tail of log for paco on armhf:

      |                   ^~~~~~
/usr/include/glibmm-2.4/glibmm/refptr.h:95:10: warning: inline function 'Glib::RefPtr<T_CppObject>::~RefPtr() [with T_CppObject = Glib::ByteArray]' used but never defined
   95 |   inline ~RefPtr() noexcept;
      |          ^
/usr/include/glibmm-2.4/glibmm/refptr.h:104:10: warning: inline function 'Glib::RefPtr<T_CppObject>::RefPtr(const Glib::RefPtr<T_CppObject>&) [with T_CppObject = Glib::ByteArray]' used but never defined
  104 |   inline RefPtr(const RefPtr& src) noexcept;
      |          ^~~~~~
make[3]: *** [Makefile:535: gpaco-main.o] Error 1
make[3]: Leaving directory '/<<PKGBUILDDIR>>/gpaco'
make[2]: *** [Makefile:485: all-recursive] Error 1
make[2]: Leaving directory '/<<PKGBUILDDIR>>'
make[1]: *** [Makefile:396: all] Error 2
make[1]: Leaving directory '/<<PKGBUILDDIR>>'
dh_auto_build: error: make -j1 returned exit code 2
make: *** [debian/rules:21: build-arch] Error 25

Tail of log for percona-xtradb-cluster-galera-2.x on armhf:

   debian/rules override_dh_auto_build
make[1]: Entering directory '/<<PKGBUILDDIR>>'
scons revno=318911d boost_pool=0 garb/garbd libgalera_smm.so 
scons: Reading SConscript files ...
  File "/<<PKGBUILDDIR>>/SConstruct", line 23

    print 'Host: ' + sysname + ' ' + machine

          ^

SyntaxError: Missing parentheses in call to 'print'. Did you mean print('Host: ' + sysname + ' ' + machine)?

make[1]: *** [debian/rules:15: override_dh_auto_build] Error 2
make[1]: Leaving directory '/<<PKGBUILDDIR>>'
make: *** [debian/rules:18: build-arch] Error 2

Tail of log for perftest on armhf:

                 from src/perftest_communication.h:45,
                 from src/perftest_communication.c:17:
src/get_clock.h:109:2: warning: #warning get_cycles not implemented for this architecture: attempt asm/timex.h [-Wcpp]
  109 | #warning get_cycles not implemented for this architecture: attempt asm/timex.h
      |  ^~~~~~~
src/get_clock.h:110:10: fatal error: asm/timex.h: No such file or directory
  110 | #include <asm/timex.h>
      |          ^~~~~~~~~~~~~
compilation terminated.
make[2]: *** [Makefile:858: src/perftest_communication.o] Error 1
make[2]: Leaving directory '/<<BUILDDIR>>/perftest-4.4+0.37'
make[1]: *** [Makefile:582: all] Error 2
make[1]: Leaving directory '/<<BUILDDIR>>/perftest-4.4+0.37'
dh_auto_build: error: make -j4 returned exit code 2
make: *** [debian/rules:7: binary-arch] Error 25

Tail of log for plink2 on armhf:

g++ -Wdate-time -D_FORTIFY_SOURCE=2 -g -O2 -ffile-prefix-map=/<<BUILDDIR>>/plink2-2.00~a3-210816+dfsg=. -fstack-protector-strong -Wformat -Werror=format-security -DSIMDE_ENABLE_OPENMP -fopenmp-simd -O3 -I/usr/include/simde -std=c++11 -O2 -DZSTD_MULTITHREAD   -Wall -Wextra -Wshadow -Wformat-security -Wold-style-cast -I../simde ../include/plink2_base.cc ../include/plink2_bits.cc ../include/pgenlib_misc.cc ../include/pgenlib_read.cc ../include/pgenlib_write.cc ../include/plink2_bgzf.cc ../include/plink2_stats.cc ../include/plink2_string.cc ../include/plink2_text.cc ../include/plink2_thread.cc ../include/plink2_zstfile.cc ../plink2.cc ../plink2_adjust.cc ../plink2_cmdline.cc ../plink2_common.cc ../plink2_compress_stream.cc ../plink2_data.cc ../plink2_decompress.cc ../plink2_export.cc ../plink2_fasta.cc ../plink2_filter.cc ../plink2_glm.cc ../plink2_help.cc ../plink2_import.cc ../plink2_ld.cc ../plink2_matrix.cc ../plink2_matrix_calc.cc ../plink2_merge.cc ../plink2_misc.cc ../plink2_psam.cc ../plink2_pvar.cc ../plink2_random.cc ../plink2_set.cc -c
../plink2_psam.cc: In function 'plink2::PglErr plink2::LoadPhenos(const char*, const RangeList*, const uintptr_t*, const SampleIdInfo*, uint32_t, uint32_t, int32_t, uint32_t, uint32_t, uint32_t, uint32_t, plink2::PhenoCol**, char**, uint32_t*, uintptr_t*)':
../plink2_psam.cc:1255:105: warning: '*' in boolean context, suggest '&&' instead [-Wint-in-bool-context]
 1255 |       if (unlikely(S_CAST(uintptr_t, tmp_bigstack_end - bigstack_base_copy) < pheno_info_alloc_byte_ct) * (xid_idx_end - xid_idx_start)) {
g++  -Wdate-time -D_FORTIFY_SOURCE=2 ../plink2_cpu.cc -c
g++ SFMT.o plink2_base.o plink2_bits.o pgenlib_misc.o pgenlib_read.o pgenlib_write.o plink2_bgzf.o plink2_stats.o plink2_string.o plink2_text.o plink2_thread.o plink2_zstfile.o plink2.o plink2_adjust.o plink2_cmdline.o plink2_common.o plink2_compress_stream.o plink2_data.o plink2_decompress.o plink2_export.o plink2_fasta.o plink2_filter.o plink2_glm.o plink2_help.o plink2_import.o plink2_ld.o plink2_matrix.o plink2_matrix_calc.o plink2_merge.o plink2_misc.o plink2_psam.o plink2_pvar.o plink2_random.o plink2_set.o plink2_cpu.o  -o plink2"" -llapack -lblas -lcblas -latlas -lm -lpthread  -lz -lzstd -Wl,-z,relro -Wl,-z,now -ldeflate
/usr/bin/ld: plink2_thread.o: in function `plink2::UpdateU64IfSmaller(unsigned long long, unsigned long long*)':
./build_dynamic/../include/plink2_thread.cc:373: undefined reference to `__atomic_compare_exchange_8'
collect2: error: ld returned 1 exit status
make[2]: *** [Makefile:157: plink2""] Error 1
make[2]: Leaving directory '/<<BUILDDIR>>/plink2-2.00~a3-210816+dfsg/build_dynamic'
dh_auto_build: error: cd build_dynamic && make -j4 "INSTALL=install --strip-program=true" returned exit code 2
make[1]: *** [debian/rules:74: override_dh_auto_build-arch] Error 25
make[1]: Leaving directory '/<<BUILDDIR>>/plink2-2.00~a3-210816+dfsg'
make: *** [debian/rules:23: binary-arch] Error 2

Tail of log for patat on armhf:

patat:   -Mgrace=<n>
patat:             The amount of allocation after the program receives a
patat:             HeapOverflow exception before the exception is thrown again, if
patat:             the program is still exceeding the heap limit.
patat: 
patat: RTS options may also be specified using the GHCRTS environment variable.
patat: 
patat: Other RTS options may be available for programs compiled a different way.
patat: The GHC User's Guide has full details.
patat: 
make[2]: *** [Makefile:80: extra/patat.bash-completion] Error 1
make[2]: Leaving directory '/<<PKGBUILDDIR>>'
make[1]: *** [debian/rules:23: override_dh_auto_build] Error 2
make[1]: Leaving directory '/<<PKGBUILDDIR>>'
make: *** [debian/rules:12: build-arch] Error 2

Tail of log for python-peachpy on armhf:

----------------------------------------------------------------------
Traceback (most recent call last):
  File "/<<PKGBUILDDIR>>/.pybuild/cpython3_3.9_peachpy/build/test/x86_64/test_load.py", line 28, in runTest
    py_multiply = asm_multiply.finalize(abi.detect()).encode().load()
  File "/<<PKGBUILDDIR>>/.pybuild/cpython3_3.9_peachpy/build/peachpy/x86_64/function.py", line 308, in finalize
    raise TypeError("%s is not an ABI object" % str(abi))
TypeError: None is not an ABI object

----------------------------------------------------------------------
Ran 1309 tests in 4.252s

FAILED (errors=1)
E: pybuild pybuild:353: test: plugin distutils failed with: exit code=1: cd '/<<PKGBUILDDIR>>/.pybuild/cpython3_3.9_peachpy/build'; python3.9 -m unittest discover -v 
dh_auto_test: error: pybuild --test -i python{version} -p 3.9 returned exit code 13
make: *** [debian/rules:8: binary-arch] Error 25

Tail of log for prboom on armhf:

      |                                png_error_ptr
i_sshot.c:234:32: note: each undeclared identifier is reported only once for each function it appears in
i_sshot.c:282:43: error: 'png_infopp_NULL' undeclared (first use in this function); did you mean 'png_infopp'?
  282 |       png_destroy_write_struct(&png_ptr,  png_infopp_NULL);
      |                                           ^~~~~~~~~~~~~~~
      |                                           png_infopp
make[4]: *** [Makefile:242: i_sshot.o] Error 1
make[4]: Leaving directory '/<<BUILDDIR>>/prboom-2.5.0+dfsg1/src/SDL'
make[3]: *** [Makefile:460: all-recursive] Error 1
make[3]: Leaving directory '/<<BUILDDIR>>/prboom-2.5.0+dfsg1/src'
make[2]: *** [Makefile:285: all-recursive] Error 1
make[2]: Leaving directory '/<<BUILDDIR>>/prboom-2.5.0+dfsg1'
make[1]: *** [Makefile:205: all] Error 2
make[1]: Leaving directory '/<<BUILDDIR>>/prboom-2.5.0+dfsg1'
make: *** [debian/rules:28: build-stamp] Error 2

Tail of log for projectm on armhf:

/usr/include/arm-linux-gnueabihf/qt5/QtCore/qflags.h:123:80: note: declared here
  123 |     QT_DEPRECATED_X("Use default constructor instead") Q_DECL_CONSTEXPR inline QFlags(Zero) noexcept : i(0) {}
      |                                                                                ^~~~~~
make[5]: *** [Makefile:536: qprojectm_mainwindow.o] Error 1
make[5]: Leaving directory '/<<PKGBUILDDIR>>/src/projectM-qt'
make[4]: *** [Makefile:457: all] Error 2
make[4]: Leaving directory '/<<PKGBUILDDIR>>/src/projectM-qt'
make[3]: *** [Makefile:461: all-recursive] Error 1
make[3]: Leaving directory '/<<PKGBUILDDIR>>/src'
make[2]: *** [Makefile:531: all-recursive] Error 1
make[2]: Leaving directory '/<<PKGBUILDDIR>>'
make[1]: *** [Makefile:421: all] Error 2
make[1]: Leaving directory '/<<PKGBUILDDIR>>'
dh_auto_build: error: make -j4 returned exit code 2
make: *** [debian/rules:9: binary-arch] Error 25

Tail of log for qwinff on armhf:

src/qmpwidget/qmpwidget.cpp:575:43: warning: 'QTextStream& QTextStreamFunctions::endl(QTextStream&)' is deprecated: Use Qt::endl [-Wdeprecated-declarations]
  575 |     out << keys[i] << " " << "ignored" << endl;
      |                                           ^~~~
In file included from /usr/include/arm-linux-gnueabihf/qt5/QtCore/qdebug.h:49,
                 from /usr/include/arm-linux-gnueabihf/qt5/QtCore/QtDebug:1,
                 from src/qmpwidget/qmpwidget.cpp:27:
/usr/include/arm-linux-gnueabihf/qt5/QtCore/qtextstream.h:293:75: note: declared here
  293 | Q_CORE_EXPORT QT_DEPRECATED_VERSION_X(5, 15, "Use Qt::endl") QTextStream &endl(QTextStream &s);
      |                                                                           ^~~~
make[2]: *** [Makefile:1151: qmpwidget.o] Error 1
make[2]: Leaving directory '/<<BUILDDIR>>/qwinff-0.2.1+git20201215'
dh_auto_build: error: make -j4 "INSTALL=install --strip-program=true" QMAKE=arm-linux-gnueabihf-qmake returned exit code 2
make[1]: *** [debian/rules:28: override_dh_auto_build] Error 25
make[1]: Leaving directory '/<<BUILDDIR>>/qwinff-0.2.1+git20201215'
make: *** [debian/rules:20: binary-arch] Error 2

Tail of log for qtjsbackend-opensource-src on armhf:

../3rdparty/v8/src/objects.h:7486:36: error: left operand of shift expression '(-8 << 26)' is negative [-fpermissive]
 7486 |       (~kMaxCachedArrayIndexLength << kArrayIndexHashLengthShift) |
      |       ~~~~~~~~~~~~~~~~~~~~~~~~~~~~~^~~~~~~~~~~~~~~~~~~~~~~~~~~~~~
make[3]: *** [Makefile:924: .obj/accessors.o] Error 1
make[3]: *** Waiting for unfinished jobs....
make[3]: *** [Makefile:1362: .obj/ast.o] Error 1
make[3]: *** [Makefile:1244: .obj/assembler.o] Error 1
make[3]: *** [Makefile:1097: .obj/api.o] Error 1
make[3]: Leaving directory '/<<PKGBUILDDIR>>/src/v8'
make[2]: *** [Makefile:91: sub-v8-make_first-ordered] Error 2
make[2]: Leaving directory '/<<PKGBUILDDIR>>/src'
make[1]: *** [Makefile:48: sub-src-make_first] Error 2
make[1]: Leaving directory '/<<PKGBUILDDIR>>'
dh_auto_build: error: make -j4 returned exit code 2
make: *** [debian/rules:14: build-arch] Error 25

Tail of log for rpm2html on armhf:

  758 |              headerNextIterator(sIter, &tag, &type, (void *) &p, &count);) {
      |              ^~~~~~~~~~~~~~~~~~
      |              headerInitIterator
rpmopen.c: In function ‘rpmOpen’:
rpmopen.c:1052:20: error: storage size of ‘lead’ isn’t known
 1052 |     struct rpmlead lead;
      |                    ^~~~
rpmopen.c:1140:9: warning: implicit declaration of function ‘fdClose’; did you mean ‘fclose’? [-Wimplicit-function-declaration]
 1140 |         fdClose(fd);
      |         ^~~~~~~
      |         fclose
make[1]: *** [Makefile:515: rpmopen.o] Error 1
make[1]: Leaving directory '/<<PKGBUILDDIR>>'
dh_auto_build: error: make -j1 returned exit code 2
make: *** [debian/rules:7: build-arch] Error 25

Tail of log for r-bioc-rsubread on armhf:

/usr/include/stdint.h:96:23: error: conflicting types for 'uintptr_t'
   96 | typedef unsigned int  uintptr_t;
      |                       ^~~~~~~~~
In file included from R_wrapper.c:30:
/usr/share/R/include/Rinterface.h:110:24: note: previous declaration of 'uintptr_t' was here
  110 |  typedef unsigned long uintptr_t;
      |                        ^~~~~~~~~
make[1]: *** [/usr/lib/R/etc/Makeconf:168: R_wrapper.o] Error 1
make[1]: Leaving directory '/<<PKGBUILDDIR>>/src'
make[1]: Entering directory '/<<PKGBUILDDIR>>/src'
make[1]: Leaving directory '/<<PKGBUILDDIR>>/src'
ERROR: compilation failed for package 'Rsubread'
* removing '/<<PKGBUILDDIR>>/debian/r-bioc-rsubread/usr/lib/R/site-library/Rsubread'
dh_auto_install: error: R CMD INSTALL -l /<<PKGBUILDDIR>>/debian/r-bioc-rsubread/usr/lib/R/site-library --clean . "--built-timestamp='Thu, 02 Sep 2021 11:37:52 +0200'" returned exit code 1
make: *** [debian/rules:4: binary-arch] Error 25

Tail of log for ruby-cbor on armhf:

     # ./spec/format_spec.rb:503:in `to_cbor'
     # ./spec/format_spec.rb:503:in `check'
     # ./spec/format_spec.rb:383:in `block (2 levels) in <top (required)>'

Finished in 32.59 seconds (files took 1.31 seconds to load)
160 examples, 1 failure

Failed examples:

rspec ./spec/format_spec.rb:378 # CBOR Tagged

/usr/bin/ruby2.7 -I/usr/share/rubygems-integration/all/gems/rspec-support-3.9.3/lib:/usr/share/rubygems-integration/all/gems/rspec-core-3.9.2/lib /usr/share/rubygems-integration/all/gems/rspec-core-3.9.2/exe/rspec --pattern ./spec/\*\*/\*_spec.rb --format documentation failed
ERROR: Test "ruby2.7" failed. Exiting.
dh_auto_install: error: dh_ruby --install /<<PKGBUILDDIR>>/debian/ruby-cbor returned exit code 1
make: *** [debian/rules:7: binary-arch] Error 25

Tail of log for rust-generator on armhf:

  thread 'main' panicked at 'Unsupported architecture: arm-unknown-linux-gnueabihf', build.rs:30:13
  stack backtrace:
     0: rust_begin_unwind
               at /usr/src/rustc-1.49.0/library/std/src/panicking.rs:495:5
     1: std::panicking::begin_panic_fmt
               at /usr/src/rustc-1.49.0/library/std/src/panicking.rs:437:5
     2: build_script_build::main
               at ./build.rs:30:13
     3: core::ops::function::FnOnce::call_once
               at /usr/src/rustc-1.49.0/library/core/src/ops/function.rs:227:5
  note: Some details are omitted, run with `RUST_BACKTRACE=full` for a verbose backtrace.
dh_auto_test: error: /usr/share/cargo/bin/cargo test --all returned exit code 101
make[1]: *** [debian/rules:6: override_dh_auto_test] Error 25
make[1]: Leaving directory '/<<PKGBUILDDIR>>'
make: *** [debian/rules:3: build-arch] Error 2

Tail of log for rust-mach-o-sys on armhf:

For more information about this error, try `rustc --explain E0600`.
error: could not compile `mach_o_sys`.

Caused by:
  process didn't exit successfully: `CARGO=/usr/bin/cargo CARGO_CRATE_NAME=mach_o_sys CARGO_MANIFEST_DIR=/<<PKGBUILDDIR>> CARGO_PKG_AUTHORS='Nick Fitzgerald <fitzgen@gmail.com>' CARGO_PKG_DESCRIPTION='Bindings to the OSX mach-o system library' CARGO_PKG_HOMEPAGE='' CARGO_PKG_LICENSE=Apache-2.0/MIT CARGO_PKG_LICENSE_FILE='' CARGO_PKG_NAME=mach_o_sys CARGO_PKG_REPOSITORY='https://github.com/fitzgen/mach_o_sys' CARGO_PKG_VERSION=0.1.1 CARGO_PKG_VERSION_MAJOR=0 CARGO_PKG_VERSION_MINOR=1 CARGO_PKG_VERSION_PATCH=1 CARGO_PKG_VERSION_PRE='' LD_LIBRARY_PATH='/<<PKGBUILDDIR>>/target/debug/deps:/usr/lib' rustc --crate-name mach_o_sys src/lib.rs --error-format=json --json=diagnostic-rendered-ansi --crate-type lib --emit=dep-info,metadata,link -Cembed-bitcode=no -C debuginfo=2 -C metadata=ac71bc4dbb4e6526 -C extra-filename=-ac71bc4dbb4e6526 --out-dir /<<PKGBUILDDIR>>/target/arm-unknown-linux-gnueabihf/debug/deps --target arm-unknown-linux-gnueabihf -C incremental=/<<PKGBUILDDIR>>/target/arm-unknown-linux-gnueabihf/debug/incremental -L dependency=/<<PKGBUILDDIR>>/target/arm-unknown-linux-gnueabihf/debug/deps -L dependency=/<<PKGBUILDDIR>>/target/debug/deps -C debuginfo=2 --cap-lints warn -C linker=arm-linux-gnueabihf-gcc -C link-arg=-Wl,-z,relro --remap-path-prefix /<<PKGBUILDDIR>>=/usr/share/cargo/registry/mach-o-sys-0.1.1` (exit code: 1)
warning: build failed, waiting for other jobs to finish...
error: aborting due to 130 previous errors

For more information about this error, try `rustc --explain E0600`.
error: build failed
dh_auto_test: error: /usr/share/cargo/bin/cargo test --all returned exit code 101
make[1]: *** [debian/rules:6: override_dh_auto_test] Error 25
make[1]: Leaving directory '/<<PKGBUILDDIR>>'
make: *** [debian/rules:3: build-arch] Error 2

Tail of log for rust-kvm-ioctls on armhf:

    |                                                     ^^^^^^^^^^ types differ in mutability
    |
    = note: expected mutable reference `&mut [u8]`
                       found reference `&[u8]`

error: aborting due to 151 previous errors; 4 warnings emitted

Some errors have detailed explanations: E0308, E0412, E0422, E0425, E0432.
For more information about an error, try `rustc --explain E0308`.
error: could not compile `kvm-ioctls`.

Caused by:
  process didn't exit successfully: `CARGO=/usr/bin/cargo CARGO_CRATE_NAME=kvm_ioctls CARGO_MANIFEST_DIR=/<<PKGBUILDDIR>> CARGO_PKG_AUTHORS='Amazon Firecracker Team <firecracker-maintainers@amazon.com>' CARGO_PKG_DESCRIPTION='Safe wrappers over KVM ioctls' CARGO_PKG_HOMEPAGE='' CARGO_PKG_LICENSE='Apache-2.0 OR MIT' CARGO_PKG_LICENSE_FILE='' CARGO_PKG_NAME=kvm-ioctls CARGO_PKG_REPOSITORY='https://github.com/rust-vmm/kvm-ioctls' CARGO_PKG_VERSION=0.2.0 CARGO_PKG_VERSION_MAJOR=0 CARGO_PKG_VERSION_MINOR=2 CARGO_PKG_VERSION_PATCH=0 CARGO_PKG_VERSION_PRE='' LD_LIBRARY_PATH='/<<PKGBUILDDIR>>/target/debug/deps:/usr/lib' rustc --crate-name kvm_ioctls src/lib.rs --error-format=json --json=diagnostic-rendered-ansi --crate-type lib --emit=dep-info,metadata,link -Cembed-bitcode=no -C debuginfo=2 -C metadata=13e9af86235d5134 -C extra-filename=-13e9af86235d5134 --out-dir /<<PKGBUILDDIR>>/target/arm-unknown-linux-gnueabihf/debug/deps --target arm-unknown-linux-gnueabihf -C incremental=/<<PKGBUILDDIR>>/target/arm-unknown-linux-gnueabihf/debug/incremental -L dependency=/<<PKGBUILDDIR>>/target/arm-unknown-linux-gnueabihf/debug/deps -L dependency=/<<PKGBUILDDIR>>/target/debug/deps --extern kvm_bindings=/<<PKGBUILDDIR>>/target/arm-unknown-linux-gnueabihf/debug/deps/libkvm_bindings-d41b394796d9146a.rmeta --extern libc=/<<PKGBUILDDIR>>/target/arm-unknown-linux-gnueabihf/debug/deps/liblibc-62c6b3826d142181.rmeta -C debuginfo=2 --cap-lints warn -C linker=arm-linux-gnueabihf-gcc -C link-arg=-Wl,-z,relro --remap-path-prefix /<<PKGBUILDDIR>>=/usr/share/cargo/registry/kvm-ioctls-0.2.0` (exit code: 1)
dh_auto_test: error: /usr/share/cargo/bin/cargo build returned exit code 101
make: *** [debian/rules:3: build-arch] Error 25

Tail of log for ruby2.1 on armhf:

 4979 | #define yydestruct(m, t, v) ruby_parser_yydestruct(m, t, v, parser)
      | 
parse.c:10853:63: error: macro "yydestruct" passed 4 arguments, but takes just 3
10853 |      this YYABORT or YYACCEPT.  */
      |                                                               ^
parse.c:4979: note: macro "yydestruct" defined here
 4979 | #define yydestruct(m, t, v) ruby_parser_yydestruct(m, t, v, parser)
      | 
make[2]: *** [Makefile:334: parse.o] Error 1
make[2]: *** Waiting for unfinished jobs....
make[2]: Leaving directory '/<<PKGBUILDDIR>>'
dh_auto_build: error: make -j4 main V=1 returned exit code 2
make[1]: *** [debian/rules:67: override_dh_auto_build-arch] Error 25
make[1]: Leaving directory '/<<PKGBUILDDIR>>'
make: *** [debian/rules:49: build-arch] Error 2

Tail of log for rust-mysqlclient-sys on armhf:

    bindgen_test_layout_st_mysql_res
    bindgen_test_layout_st_mysql_rows
    bindgen_test_layout_st_mysql_stmt
    bindgen_test_layout_st_mysql_time
    bindgen_test_layout_st_net
    bindgen_test_layout_st_plugin_vio
    bindgen_test_layout_st_used_mem

test result: FAILED. 2 passed; 16 failed; 0 ignored; 0 measured; 0 filtered out

error: test failed, to rerun pass '--lib'
dh_auto_test: error: /usr/share/cargo/bin/cargo test --all returned exit code 101
make[1]: *** [debian/rules:6: override_dh_auto_test] Error 25
make[1]: Leaving directory '/<<PKGBUILDDIR>>'
make: *** [debian/rules:3: build-arch] Error 2

Tail of log for rust-pq-sys on armhf:

failures:
    bindgen_test_layout__PQconninfoOption
    bindgen_test_layout__PQprintOpt
    bindgen_test_layout___sFILE
    bindgen_test_layout___sbuf
    bindgen_test_layout_pgNotify
    bindgen_test_layout_pgresAttDesc

test result: FAILED. 2 passed; 6 failed; 0 ignored; 0 measured; 0 filtered out

error: test failed, to rerun pass '--lib'
dh_auto_test: error: /usr/share/cargo/bin/cargo test --all returned exit code 101
make[1]: *** [debian/rules:6: override_dh_auto_test] Error 25
make[1]: Leaving directory '/<<PKGBUILDDIR>>'
make: *** [debian/rules:3: build-arch] Error 2

Tail of log for rust-servo-freetype-sys on armhf:

     2: cmake::fail
               at ./debian/cargo_registry/cmake-0.1.45/src/lib.rs:894:5
     3: cmake::run
               at ./debian/cargo_registry/cmake-0.1.45/src/lib.rs:872:9
     4: cmake::Config::build
               at ./debian/cargo_registry/cmake-0.1.45/src/lib.rs:707:13
     5: build_script_build::main
               at ./build.rs:23:15
     6: core::ops::function::FnOnce::call_once
               at /usr/src/rustc-1.49.0/library/core/src/ops/function.rs:227:5
  note: Some details are omitted, run with `RUST_BACKTRACE=full` for a verbose backtrace.
dh_auto_test: error: /usr/share/cargo/bin/cargo test --all returned exit code 101
make[1]: *** [debian/rules:6: override_dh_auto_test] Error 25
make[1]: Leaving directory '/<<PKGBUILDDIR>>'
make: *** [debian/rules:3: build-arch] Error 2

Tail of log for scanbuttond on armhf:

dpkg-buildpackage: info: source package scanbuttond
dpkg-buildpackage: info: source version 0.2.3.cvs20090713-16
dpkg-buildpackage: info: source distribution unstable
 dpkg-source --before-build .
dpkg-buildpackage: info: host architecture armhf
 fakeroot debian/rules clean
dh_testdir
set -e; for f in include/scanbuttond/config.h.in INSTALL; do cp "$f" "$f.upstream"; done
if [ -f /usr/share/libtool/config/ltmain.sh ]; then \
  cp /usr/share/libtool/config/ltmain.sh .; \
else \
  cp /usr/share/libtool/ltmain.sh .; \
fi
cp: cannot stat '/usr/share/libtool/ltmain.sh': No such file or directory
make: *** [debian/rules:45: configure-stamp] Error 1

Tail of log for rust-ucd-generate on armhf:

102 |                 wtr.dense_regex(args.name(), &re)?;
    |                                              ^^^ the trait `StateID` is not implemented for `u64`

error: aborting due to 10 previous errors; 2 warnings emitted

Some errors have detailed explanations: E0277, E0599.
For more information about an error, try `rustc --explain E0277`.
error: could not compile `ucd-generate`.

Caused by:
  process didn't exit successfully: `CARGO=/usr/bin/cargo CARGO_BIN_NAME=ucd-generate CARGO_CRATE_NAME=ucd_generate CARGO_MANIFEST_DIR=/<<PKGBUILDDIR>> CARGO_PKG_AUTHORS='Andrew Gallant <jamslam@gmail.com>' CARGO_PKG_DESCRIPTION='A program for generating packed representations of the Unicode character
  database that can be efficiently searched.
  ' CARGO_PKG_HOMEPAGE='https://github.com/BurntSushi/ucd-generate' CARGO_PKG_LICENSE=MIT/Apache-2.0 CARGO_PKG_LICENSE_FILE='' CARGO_PKG_NAME=ucd-generate CARGO_PKG_REPOSITORY='https://github.com/BurntSushi/ucd-generate' CARGO_PKG_VERSION=0.2.3 CARGO_PKG_VERSION_MAJOR=0 CARGO_PKG_VERSION_MINOR=2 CARGO_PKG_VERSION_PATCH=3 CARGO_PKG_VERSION_PRE='' LD_LIBRARY_PATH='/<<PKGBUILDDIR>>/target/debug/deps:/usr/lib' rustc --crate-name ucd_generate src/main.rs --error-format=json --json=diagnostic-rendered-ansi --crate-type bin --emit=dep-info,link -Cembed-bitcode=no -C debuginfo=2 -C metadata=b8cf73b42b9f7acf -C extra-filename=-b8cf73b42b9f7acf --out-dir /<<PKGBUILDDIR>>/target/arm-unknown-linux-gnueabihf/debug/deps --target arm-unknown-linux-gnueabihf -C incremental=/<<PKGBUILDDIR>>/target/arm-unknown-linux-gnueabihf/debug/incremental -L dependency=/<<PKGBUILDDIR>>/target/arm-unknown-linux-gnueabihf/debug/deps -L dependency=/<<PKGBUILDDIR>>/target/debug/deps --extern byteorder=/<<PKGBUILDDIR>>/target/arm-unknown-linux-gnueabihf/debug/deps/libbyteorder-6c4e86974de8f2f9.rlib --extern clap=/<<PKGBUILDDIR>>/target/arm-unknown-linux-gnueabihf/debug/deps/libclap-47b7a2762e4fb492.rlib --extern fst=/<<PKGBUILDDIR>>/target/arm-unknown-linux-gnueabihf/debug/deps/libfst-e2e313fa8fc55ba7.rlib --extern regex_automata=/<<PKGBUILDDIR>>/target/arm-unknown-linux-gnueabihf/debug/deps/libregex_automata-4b4aa4af68f005f9.rlib --extern ucd_parse=/<<PKGBUILDDIR>>/target/arm-unknown-linux-gnueabihf/debug/deps/libucd_parse-bc6af3c6586caa4d.rlib --extern ucd_trie=/<<PKGBUILDDIR>>/target/arm-unknown-linux-gnueabihf/debug/deps/libucd_trie-9212d9a41b9dd5a2.rlib --extern ucd_util=/<<PKGBUILDDIR>>/target/arm-unknown-linux-gnueabihf/debug/deps/libucd_util-8151450be535bc2a.rlib -C debuginfo=2 --cap-lints warn -C linker=arm-linux-gnueabihf-gcc -C link-arg=-Wl,-z,relro --remap-path-prefix /<<PKGBUILDDIR>>=/usr/share/cargo/registry/ucd-generate-0.2.3` (exit code: 1)
dh_auto_test: error: /usr/share/cargo/bin/cargo build returned exit code 101
make: *** [debian/rules:3: build-arch] Error 25

Tail of log for rust-libnotcurses-sys on armhf:

   |                                         ^^ types differ in mutability
   |
   = note: expected raw pointer `*mut bindings::ffi::notcurses`
                found reference `&bindings::ffi::notcurses`

error: aborting due to 49 previous errors

Some errors have detailed explanations: E0061, E0063, E0308, E0412, E0425, E0432, E0606.
For more information about an error, try `rustc --explain E0061`.
error: could not compile `libnotcurses-sys`.

Caused by:
  process didn't exit successfully: `CARGO=/usr/bin/cargo CARGO_CRATE_NAME=libnotcurses_sys CARGO_MANIFEST_DIR=/<<PKGBUILDDIR>> CARGO_PKG_AUTHORS='nick black <dankamongmen@gmail.com>:José Luis Cruz <joseluis@andamira.net>' CARGO_PKG_DESCRIPTION='Low-level Rust bindings for the notcurses C library.' CARGO_PKG_HOMEPAGE='https://nick-black.com/dankwiki/index.php/Notcurses' CARGO_PKG_LICENSE=Apache-2.0 CARGO_PKG_LICENSE_FILE='' CARGO_PKG_NAME=libnotcurses-sys CARGO_PKG_REPOSITORY='https://github.com/dankamongmen/notcurses' CARGO_PKG_VERSION=2.1.8 CARGO_PKG_VERSION_MAJOR=2 CARGO_PKG_VERSION_MINOR=1 CARGO_PKG_VERSION_PATCH=8 CARGO_PKG_VERSION_PRE='' LD_LIBRARY_PATH='/<<PKGBUILDDIR>>/target/debug/deps:/usr/lib' OUT_DIR=/<<PKGBUILDDIR>>/target/arm-unknown-linux-gnueabihf/debug/build/libnotcurses-sys-4deef393e8925713/out rustc --crate-name libnotcurses_sys --edition=2018 src/lib.rs --error-format=json --json=diagnostic-rendered-ansi --crate-type lib --emit=dep-info,metadata,link -Cembed-bitcode=no -C debuginfo=2 -C metadata=18f98cb0bdd190d8 -C extra-filename=-18f98cb0bdd190d8 --out-dir /<<PKGBUILDDIR>>/target/arm-unknown-linux-gnueabihf/debug/deps --target arm-unknown-linux-gnueabihf -C incremental=/<<PKGBUILDDIR>>/target/arm-unknown-linux-gnueabihf/debug/incremental -L dependency=/<<PKGBUILDDIR>>/target/arm-unknown-linux-gnueabihf/debug/deps -L dependency=/<<PKGBUILDDIR>>/target/debug/deps --extern cty=/<<PKGBUILDDIR>>/target/arm-unknown-linux-gnueabihf/debug/deps/libcty-86b3a7484bd1db9b.rmeta --extern libc=/<<PKGBUILDDIR>>/target/arm-unknown-linux-gnueabihf/debug/deps/liblibc-62c6b3826d142181.rmeta -C debuginfo=2 --cap-lints warn -C linker=arm-linux-gnueabihf-gcc -C link-arg=-Wl,-z,relro --remap-path-prefix /<<PKGBUILDDIR>>=/usr/share/cargo/registry/libnotcurses-sys-2.1.8 -L native=/usr/lib/arm-linux-gnueabihf -l notcurses -l notcurses-core` (exit code: 1)
dh_auto_test: error: /usr/share/cargo/bin/cargo build returned exit code 101
make: *** [debian/rules:3: binary-arch] Error 25

Tail of log for slang-slirp on armhf:

checking for dlfcn.h... yes
checking for dlopen in -ldl... yes
checking for g++... g++
checking whether we are using the GNU C++ compiler... yes
checking whether g++ accepts -g... yes
checking for gfortran... gfortran
checking whether we are using the GNU Fortran compiler... yes
checking whether gfortran accepts -g... yes
checking how to get verbose linking output from gfortran... -v
checking for Fortran libraries of gfortran...  -L/usr/lib/gcc/arm-linux-gnueabihf/10 -L/usr/lib/gcc/arm-linux-gnueabihf/10/../../../arm-linux-gnueabihf -L/usr/lib/gcc/arm-linux-gnueabihf/10/../../.. -L/lib/arm-linux-gnueabihf -L/usr/lib/arm-linux-gnueabihf -lgfortran -lm
checking for dummy main to link with Fortran libraries... none
checking for Fortran name-mangling scheme... lower case, underscore, no extra underscore
checking for the slang library and header files ... no
configure: error: unable to find the slang library and header file slang.h
make: *** [/usr/share/cdbs/1/class/autotools.mk:46: debian/stamp-autotools] Error 1

Tail of log for tarantool on armhf:

      |    ^~~~~
/<<PKGBUILDDIR>>/third_party/coro/coro.c:480:14: error: 'NUM_SAVED' undeclared (first use in this function)
  480 |   ctx->sp -= NUM_SAVED;
      |              ^~~~~~~~~
/<<PKGBUILDDIR>>/third_party/coro/coro.c:480:14: note: each undeclared identifier is reported only once for each function it appears in
/<<PKGBUILDDIR>>/third_party/coro/coro.c:494:4: error: #error unsupported architecture
  494 |   #error unsupported architecture
      |    ^~~~~
make[3]: *** [CMakeFiles/coro.dir/build.make:85: CMakeFiles/coro.dir/third_party/coro/coro.c.o] Error 1
make[3]: Leaving directory '/<<PKGBUILDDIR>>/obj-arm-linux-gnueabihf'
make[2]: *** [CMakeFiles/Makefile2:1367: CMakeFiles/coro.dir/all] Error 2
make[2]: Leaving directory '/<<PKGBUILDDIR>>/obj-arm-linux-gnueabihf'
make[1]: *** [Makefile:174: all] Error 2
make[1]: Leaving directory '/<<PKGBUILDDIR>>/obj-arm-linux-gnueabihf'
make: *** [/usr/share/cdbs/1/class/makefile.mk:77: debian/stamp-makefile-build] Error 2

Tail of log for traildb on armhf:

#define HAVE_SYS_TYPES_H 1
#define HAVE_UNISTD_H 1
#define STDC_HEADERS 1
#define HAVE_DLFCN_H 1
#define LT_OBJDIR ".libs/"
#define DSFMT_MEXP 521
#define HAVE_SSE2 1
#define HAVE_LIBJUDY 1
#define HAVE_JUDY_H 1
#define HAVE_ARCHIVE_H 1
#define HAVE_LIBARCHIVE 1

configure: exit 1
dh_auto_configure: error: ./configure --build=arm-linux-gnueabihf --prefix=/usr --includedir=\${prefix}/include --mandir=\${prefix}/share/man --infodir=\${prefix}/share/info --sysconfdir=/etc --localstatedir=/var --disable-option-checking --disable-silent-rules --libdir=\${prefix}/lib/arm-linux-gnueabihf --libexecdir=\${prefix}/lib/arm-linux-gnueabihf --disable-maintainer-mode --disable-dependency-tracking returned exit code 1
make: *** [debian/rules:10: build-arch] Error 25

Tail of log for tendermint on armhf:

--- PASS: TestBadVotes (0.02s)
=== RUN   TestConflicts
--- PASS: TestConflicts (0.03s)
=== RUN   TestMakeCommit
--- PASS: TestMakeCommit (0.04s)
=== RUN   TestVoteSignable
--- PASS: TestVoteSignable (0.00s)
PASS
ok  	github.com/tendermint/tendermint/types	4.580s
?   	github.com/tendermint/tendermint/version	[no test files]
FAIL
dh_auto_test: error: cd obj-arm-linux-gnueabihf && go test -vet=off -v -p 1 github.com/tendermint/tendermint/benchmarks github.com/tendermint/tendermint/benchmarks/proto github.com/tendermint/tendermint/benchmarks/simu github.com/tendermint/tendermint/blockchain github.com/tendermint/tendermint/cmd/tendermint github.com/tendermint/tendermint/config/tendermint github.com/tendermint/tendermint/config/tendermint_test github.com/tendermint/tendermint/consensus github.com/tendermint/tendermint/fail-test github.com/tendermint/tendermint/mempool github.com/tendermint/tendermint/node github.com/tendermint/tendermint/proxy github.com/tendermint/tendermint/rpc/core github.com/tendermint/tendermint/rpc/core/types github.com/tendermint/tendermint/rpc/grpc github.com/tendermint/tendermint/rpc/test github.com/tendermint/tendermint/state github.com/tendermint/tendermint/test/app github.com/tendermint/tendermint/types github.com/tendermint/tendermint/version returned exit code 1
make[1]: *** [debian/rules:9: override_dh_auto_test] Error 25
make[1]: Leaving directory '/<<PKGBUILDDIR>>'
make: *** [debian/rules:6: build-arch] Error 2

Tail of log for tinyarray on armhf:

  File "/usr/lib/python3/dist-packages/pluggy/callers.py", line 187 in _multicall
  File "/usr/lib/python3/dist-packages/pluggy/manager.py", line 83 in <lambda>
  File "/usr/lib/python3/dist-packages/pluggy/manager.py", line 92 in _hookexec
  File "/usr/lib/python3/dist-packages/pluggy/hooks.py", line 286 in __call__
  File "/usr/lib/python3/dist-packages/_pytest/config/__init__.py", line 157 in main
  File "/usr/lib/python3/dist-packages/_pytest/config/__init__.py", line 180 in console_main
  File "/usr/lib/python3/dist-packages/pytest/__main__.py", line 7 in <module>
  File "/usr/lib/python3.9/runpy.py", line 87 in _run_code
  File "/usr/lib/python3.9/runpy.py", line 197 in _run_module_as_main
Aborted (core dumped)
E: pybuild pybuild:353: test: plugin distutils failed with: exit code=134: cd /<<PKGBUILDDIR>>/.pybuild/cpython3_3.9_tinyarray/build; python3.9 -m pytest ../../../test_tinyarray.py
dh_auto_test: error: pybuild --test --test-pytest -i python{version} -p 3.9 --test-pytest --test-args=../../../test_tinyarray.py returned exit code 13
make[1]: *** [debian/rules:11: override_dh_auto_test] Error 25
make[1]: Leaving directory '/<<PKGBUILDDIR>>'
make: *** [debian/rules:7: binary-arch] Error 2

Tail of log for tiledarray on armhf:

      |       ^~~~~~~~
/<<PKGBUILDDIR>>/src/TiledArray/math/vector_op.h:107:7: note:   template argument deduction/substitution failed:
/<<PKGBUILDDIR>>/src/TiledArray/math/vector_op.h:155:29: note:   candidate expects 2 arguments, 3 provided
  155 |       VecOpUnwindN::for_each(op, result, args...);
      |       ~~~~~~~~~~~~~~~~~~~~~~^~~~~~~~~~~~~~~~~~~~~
make[4]: *** [src/CMakeFiles/tiledarray.dir/build.make:85: src/CMakeFiles/tiledarray.dir/TiledArray/tensor/tensor.cpp.o] Error 1
make[4]: Leaving directory '/<<PKGBUILDDIR>>/obj-arm-linux-gnueabihf'
make[3]: *** [CMakeFiles/Makefile2:448: src/CMakeFiles/tiledarray.dir/all] Error 2
make[3]: Leaving directory '/<<PKGBUILDDIR>>/obj-arm-linux-gnueabihf'
make[2]: *** [Makefile:163: all] Error 2
make[2]: Leaving directory '/<<PKGBUILDDIR>>/obj-arm-linux-gnueabihf'
dh_auto_build: error: cd obj-arm-linux-gnueabihf && make -j1 VERBOSE=1 returned exit code 2
make[1]: *** [debian/rules:52: override_dh_auto_build] Error 25
make[1]: Leaving directory '/<<PKGBUILDDIR>>'
make: *** [debian/rules:40: build-arch] Error 2

Tail of log for xavs2 on armhf:

gcc: error: common/arm/blockcopy8.o: No such file or directory
gcc: error: common/arm/cpu-a.o: No such file or directory
gcc: error: common/arm/dct-a.o: No such file or directory
gcc: error: common/arm/ipfilter8.o: No such file or directory
gcc: error: common/arm/mc-a.o: No such file or directory
gcc: error: common/arm/pixel-util.o: No such file or directory
gcc: error: common/arm/sad-a.o: No such file or directory
gcc: error: common/arm/ssd-a.o: No such file or directory
make[1]: *** [Makefile:226: libxavs2.so.13] Error 1
make[1]: *** Waiting for unfinished jobs....
/usr/bin/ar: common/arm/blockcopy8.o: No such file or directory
make[1]: *** [Makefile:221: libxavs2.a] Error 1
make[1]: Leaving directory '/<<PKGBUILDDIR>>/build/linux'
dh_auto_build: error: cd build/linux && make -j4 returned exit code 2
make: *** [debian/rules:9: binary-arch] Error 25

Tail of log for wmmail on armhf:

/usr/bin/make
make[1]: Entering directory '/<<PKGBUILDDIR>>'
Making all in src
make[2]: Entering directory '/<<PKGBUILDDIR>>/src'
gcc -DPACKAGE=\"WMMail\" -DVERSION=\"0.64\" -DHAVE_LIBNSL=1 -DHAVE_LIBX11=1 -DHAVE_LIBXEXT=1 -DHAVE_LIBXT=1 -DHAVE_LIBXPM=1 -DHAVE_LIBWUTIL=1 -DSTDC_HEADERS=1 -DHAVE_LIMITS_H=1 -DHAVE_STRINGS_H=1 -DHAVE_UNISTD_H=1 -DRETSIGTYPE=int -DHAVE_VPRINTF=1 -DHAVE_SOCKET=1 -DHAVE_STRSTR=1  -I. -I.      -g -O2 -I  -c global.c
In file included from global.c:27:
wmmail.h:32:10: fatal error: WINGs/proplist-compat.h: No such file or directory
   32 | #include <WINGs/proplist-compat.h>
      |          ^~~~~~~~~~~~~~~~~~~~~~~~~
compilation terminated.
make[2]: *** [Makefile:247: global.o] Error 1
make[2]: Leaving directory '/<<PKGBUILDDIR>>/src'
make[1]: *** [Makefile:125: all-recursive] Error 1
make[1]: Leaving directory '/<<PKGBUILDDIR>>'
make: *** [debian/rules:17: build-stamp] Error 2

Tail of log for xnnpack on armhf:

/tmp/ccmhfWRD.s: Assembler messages:
/tmp/ccmhfWRD.s:226: Error: selected processor does not support `vsdot.s8 q8,q11,d5[0]' in ARM mode
/tmp/ccmhfWRD.s:255: Error: selected processor does not support `vsdot.s8 q9,q10,d5[0]' in ARM mode
/tmp/ccmhfWRD.s:283: Error: selected processor does not support `vsdot.s8 q8,q10,d5[1]' in ARM mode
/tmp/ccmhfWRD.s:335: Error: selected processor does not support `vsdot.s8 q9,q10,d5[1]' in ARM mode
/tmp/ccmhfWRD.s:809: Error: selected processor does not support `vsdot.s8 q8,q11,d5[0]' in ARM mode
/tmp/ccmhfWRD.s:839: Error: selected processor does not support `vsdot.s8 q9,q10,d5[0]' in ARM mode
/tmp/ccmhfWRD.s:882: Error: selected processor does not support `vsdot.s8 q8,q10,d5[1]' in ARM mode
/tmp/ccmhfWRD.s:914: Error: selected processor does not support `vsdot.s8 q9,q10,d5[1]' in ARM mode
[523/1062] /usr/bin/cc -DXNNPACK_EXPORTS -DXNN_ENABLE_ASSEMBLY=1 -DXNN_ENABLE_MEMOPT=1 -DXNN_ENABLE_SPARSE=1 -DXNN_LOG_LEVEL=0 -I../include -I../src -g -O2 -ffile-prefix-map=/<<PKGBUILDDIR>>=. -fstack-protector-strong -Wformat -Werror=format-security -Wdate-time -D_FORTIFY_SOURCE=2 -fPIC -Wno-psabi -std=gnu99  -marm  -march=armv7-a -mfpu=neon  -O2 -MD -MT CMakeFiles/XNNPACK.dir/src/f32-dwconv/gen/up8x9-minmax-neon-acc2.c.o -MF CMakeFiles/XNNPACK.dir/src/f32-dwconv/gen/up8x9-minmax-neon-acc2.c.o.d -o CMakeFiles/XNNPACK.dir/src/f32-dwconv/gen/up8x9-minmax-neon-acc2.c.o -c ../src/f32-dwconv/gen/up8x9-minmax-neon-acc2.c
[524/1062] /usr/bin/cc -DXNNPACK_EXPORTS -DXNN_ENABLE_ASSEMBLY=1 -DXNN_ENABLE_MEMOPT=1 -DXNN_ENABLE_SPARSE=1 -DXNN_LOG_LEVEL=0 -I../include -I../src -g -O2 -ffile-prefix-map=/<<PKGBUILDDIR>>=. -fstack-protector-strong -Wformat -Werror=format-security -Wdate-time -D_FORTIFY_SOURCE=2 -fPIC -Wno-psabi -std=gnu99  -marm  -march=armv7-a -mfpu=neon  -O2 -MD -MT CMakeFiles/XNNPACK.dir/src/f32-dwconv/gen/up8x9-minmax-neon.c.o -MF CMakeFiles/XNNPACK.dir/src/f32-dwconv/gen/up8x9-minmax-neon.c.o.d -o CMakeFiles/XNNPACK.dir/src/f32-dwconv/gen/up8x9-minmax-neon.c.o -c ../src/f32-dwconv/gen/up8x9-minmax-neon.c
[525/1062] /usr/bin/cc -DXNNPACK_EXPORTS -DXNN_ENABLE_ASSEMBLY=1 -DXNN_ENABLE_MEMOPT=1 -DXNN_ENABLE_SPARSE=1 -DXNN_LOG_LEVEL=0 -I../include -I../src -g -O2 -ffile-prefix-map=/<<PKGBUILDDIR>>=. -fstack-protector-strong -Wformat -Werror=format-security -Wdate-time -D_FORTIFY_SOURCE=2 -fPIC -Wno-psabi -std=gnu99  -marm  -march=armv7-a -mfpu=neon  -O2 -MD -MT CMakeFiles/XNNPACK.dir/src/f32-dwconv/gen/up8x25-minmax-neon-acc2.c.o -MF CMakeFiles/XNNPACK.dir/src/f32-dwconv/gen/up8x25-minmax-neon-acc2.c.o.d -o CMakeFiles/XNNPACK.dir/src/f32-dwconv/gen/up8x25-minmax-neon-acc2.c.o -c ../src/f32-dwconv/gen/up8x25-minmax-neon-acc2.c
ninja: build stopped: subcommand failed.
dh_auto_build: error: cd obj-arm-linux-gnueabihf && LC_ALL=C.UTF-8 ninja -j4 -v returned exit code 1
make: *** [debian/rules:4: binary-arch] Error 25

Tail of log for xf86-video-msm on armhf:

                 from neon_memsets.c:30:
/usr/include/xorg/servermd.h:51:2: error: #error Drivers must include xorg-server.h before any other xserver headers
   51 | #error Drivers must include xorg-server.h before any other xserver headers
      |  ^~~~~
/usr/include/xorg/servermd.h:52:2: error: #error xserver code must include dix-config.h before any other headers
   52 | #error xserver code must include dix-config.h before any other headers
      |  ^~~~~
make[3]: *** [Makefile:550: neon_memsets.lo] Error 1
make[3]: Leaving directory '/<<PKGBUILDDIR>>/src'
make[2]: *** [Makefile:427: all-recursive] Error 1
make[2]: Leaving directory '/<<PKGBUILDDIR>>'
make[1]: *** [Makefile:359: all] Error 2
make[1]: Leaving directory '/<<PKGBUILDDIR>>'
dh_auto_build: error: make -j1 returned exit code 2
make: *** [debian/rules:8: build-arch] Error 25

Tail of log for virt-v2v on armhf:

make[4]: Leaving directory '/<<PKGBUILDDIR>>/test-data/binaries'
Making all in blank-disks
make[4]: Entering directory '/<<PKGBUILDDIR>>/test-data/blank-disks'
qemu-img create -f raw blank-disk-1s.raw 512
/bin/bash: line 1: qemu-img: command not found
make[4]: *** [Makefile:717: blank-disk-1s.raw] Error 127
make[4]: Leaving directory '/<<PKGBUILDDIR>>/test-data/blank-disks'
make[3]: *** [Makefile:626: all-recursive] Error 1
make[3]: Leaving directory '/<<PKGBUILDDIR>>/test-data'
make[2]: *** [Makefile:848: all-recursive] Error 1
make[2]: Leaving directory '/<<PKGBUILDDIR>>'
make[1]: *** [Makefile:766: all] Error 2
make[1]: Leaving directory '/<<PKGBUILDDIR>>'
dh_auto_build: error: make -j4 returned exit code 2
make: *** [debian/rules:4: binary-arch] Error 25

Tail of log for sfcgal on armhf:

/usr/bin/ld: CMakeFiles/SFCGAL.dir/detail/generator/building.cpp.o:(.data.rel.ro+0x3c): multiple definition of `typeinfo for CORE::AddSubRep<CORE::Add>'; CMakeFiles/SFCGAL.dir/algorithm/straightSkeleton.cpp.o:(.data.rel.ro+0x3c): first defined here
/usr/bin/ld: CMakeFiles/SFCGAL.dir/detail/generator/building.cpp.o:(.data.rel.ro+0x48): multiple definition of `typeinfo for CORE::AddSubRep<CORE::Sub>'; CMakeFiles/SFCGAL.dir/algorithm/straightSkeleton.cpp.o:(.data.rel.ro+0x48): first defined here
/usr/bin/ld: CMakeFiles/SFCGAL.dir/detail/generator/building.cpp.o:(.data.rel.ro+0x54): multiple definition of `typeinfo for CORE::ConstPolyRep<CORE::Expr>'; CMakeFiles/SFCGAL.dir/algorithm/straightSkeleton.cpp.o:(.data.rel.ro+0x54): first defined here
/usr/bin/ld: CMakeFiles/SFCGAL.dir/detail/generator/building.cpp.o:(.data.rel.ro+0x60): multiple definition of `typeinfo for CORE::ConstPolyRep<CORE::BigFloat>'; CMakeFiles/SFCGAL.dir/algorithm/straightSkeleton.cpp.o:(.data.rel.ro+0x60): first defined here
/usr/bin/ld: CMakeFiles/SFCGAL.dir/detail/generator/building.cpp.o:(.data.rel.ro+0x6c): multiple definition of `typeinfo for CORE::ConstPolyRep<CORE::BigInt>'; CMakeFiles/SFCGAL.dir/algorithm/straightSkeleton.cpp.o:(.data.rel.ro+0x6c): first defined here
/usr/bin/ld: CMakeFiles/SFCGAL.dir/detail/generator/building.cpp.o:(.data.rel.ro+0x78): multiple definition of `typeinfo for CORE::ConstPolyRep<CORE::BigRat>'; CMakeFiles/SFCGAL.dir/algorithm/straightSkeleton.cpp.o:(.data.rel.ro+0x78): first defined here
collect2: error: ld returned 1 exit status
make[3]: *** [src/CMakeFiles/SFCGAL.dir/build.make:1423: src/libSFCGAL.so.1.4.0] Error 1
make[3]: Leaving directory '/<<PKGBUILDDIR>>/obj-arm-linux-gnueabihf'
make[2]: *** [CMakeFiles/Makefile2:280: src/CMakeFiles/SFCGAL.dir/all] Error 2
make[2]: Leaving directory '/<<PKGBUILDDIR>>/obj-arm-linux-gnueabihf'
make[1]: *** [Makefile:163: all] Error 2
make[1]: Leaving directory '/<<PKGBUILDDIR>>/obj-arm-linux-gnueabihf'
dh_auto_build: error: cd obj-arm-linux-gnueabihf && make -j4 "INSTALL=install --strip-program=true" VERBOSE=1 returned exit code 2
make: *** [debian/rules:22: build-arch] Error 25

Tail of log for haskell-ormolu on armhf:

  tests/Ormolu/PrinterSpec.hs:25:25: 
  4) Ormolu.Printer module-header/leading-empty-line.hs works
       uncaught exception: IOException of type InvalidArgument
       data/examples/module-header/leading-empty-line.hs: hGetContents: invalid argument (invalid byte sequence)

  To rerun use: --match "/Ormolu.Printer/module-header/leading-empty-line.hs works/"

Randomized with seed 1907410341

Finished in 7.6689 seconds
367 examples, 4 failures
Test suite tests: FAIL
Test suite logged to: dist-ghc/test/ormolu-0.1.2.0-tests.log
0 of 1 test suites (0 of 1 test cases) passed.
make: *** [/usr/share/cdbs/1/class/hlibrary.mk:154: check-ghc-stamp] Error 1

Tail of log for qtmir on armhf:

+ _ZTVSt23_Sp_counted_ptr_inplaceIN5qtmir20PromptSessionManagerESaIS1_ELN9__gnu_cxx12_Lock_policyE1EE@Base 0.6.1
+#MISSING: 0.6.1-7# (arch=!armel)_ZTVSt23_Sp_counted_ptr_inplaceIN5qtmir20PromptSessionManagerESaIS1_ELN9__gnu_cxx12_Lock_policyE2EE@Base 0.6.1
+ _ZTVSt23_Sp_counted_ptr_inplaceIN5qtmir26DisplayConfigurationPolicyESaIS1_ELN9__gnu_cxx12_Lock_policyE1EE@Base 0.6.1
+#MISSING: 0.6.1-7# (arch=!armel)_ZTVSt23_Sp_counted_ptr_inplaceIN5qtmir26DisplayConfigurationPolicyESaIS1_ELN9__gnu_cxx12_Lock_policyE2EE@Base 0.6.1
+ _ZTVSt23_Sp_counted_ptr_inplaceIN5qtmir29WindowManagementPolicyPrivateESaIS1_ELN9__gnu_cxx12_Lock_policyE1EE@Base 0.6.1
+#MISSING: 0.6.1-7# (arch=!armel)_ZTVSt23_Sp_counted_ptr_inplaceIN5qtmir29WindowManagementPolicyPrivateESaIS1_ELN9__gnu_cxx12_Lock_policyE2EE@Base 0.6.1
+ _ZTVSt23_Sp_counted_ptr_inplaceIN5qtmir34BasicSetDisplayConfigurationPolicy4SelfESaIS2_ELN9__gnu_cxx12_Lock_policyE1EE@Base 0.6.1
+#MISSING: 0.6.1-7# (arch=!armel)_ZTVSt23_Sp_counted_ptr_inplaceIN5qtmir34BasicSetDisplayConfigurationPolicy4SelfESaIS2_ELN9__gnu_cxx12_Lock_policyE2EE@Base 0.6.1
+ _ZTVSt23_Sp_counted_ptr_inplaceIN5qtmir35BasicSetDisplayConfigurationStorage4SelfESaIS2_ELN9__gnu_cxx12_Lock_policyE1EE@Base 0.6.1
+#MISSING: 0.6.1-7# (arch=!armel)_ZTVSt23_Sp_counted_ptr_inplaceIN5qtmir35BasicSetDisplayConfigurationStorage4SelfESaIS2_ELN9__gnu_cxx12_Lock_policyE2EE@Base 0.6.1
  (optional=templinst)_ZZN11QMetaTypeIdIN3Mir5StateEE14qt_metatype_idEvE11metatype_id@Base 0.6.1
  (optional=templinst)_ZZN11QMetaTypeIdIN5miral10WindowInfoEE14qt_metatype_idEvE11metatype_id@Base 0.6.1
  (optional=templinst)_ZZN11QMetaTypeIdIN5miral15ApplicationInfoEE14qt_metatype_idEvE11metatype_id@Base 0.6.1
dh_makeshlibs: error: failing due to earlier errors
make: *** [debian/rules:24: binary-arch] Error 25

Tail of log for libmaus2 on armhf:

/usr/bin/ld: /usr/include/c++/10/bits/atomic_base.h:426: undefined reference to `__atomic_load_8'
/usr/bin/ld: test/testThreadPoolBgzfDecompress-testThreadPoolBgzfDecompress.o: in function `std::__atomic_base<unsigned long long>::operator++()':
/usr/include/c++/10/bits/atomic_base.h:326: undefined reference to `__atomic_fetch_add_8'
/usr/bin/ld: ./.libs/libmaus2.so: undefined reference to `__atomic_fetch_or_8'
/usr/bin/ld: ./.libs/libmaus2.so: undefined reference to `__atomic_compare_exchange_8'
/usr/bin/ld: ./.libs/libmaus2.so: undefined reference to `__atomic_fetch_and_8'
collect2: error: ld returned 1 exit status
make[3]: *** [Makefile:6960: testThreadPoolBgzfDecompress] Error 1
make[3]: Leaving directory '/<<BUILDDIR>>/libmaus2-2.0.803+dfsg/src'
make[2]: *** [Makefile:681: all-recursive] Error 1
make[2]: Leaving directory '/<<BUILDDIR>>/libmaus2-2.0.803+dfsg'
make[1]: *** [Makefile:565: all] Error 2
make[1]: Leaving directory '/<<BUILDDIR>>/libmaus2-2.0.803+dfsg'
dh_auto_build: error: make -j4 returned exit code 2
make: *** [debian/rules:16: binary-arch] Error 25

Tail of log for paraview on armhf:

make[4]: Leaving directory '/<<PKGBUILDDIR>>/build.python3.9'
[  9%] Built target ioss
[  9%] Linking CXX shared library ../../../../../../../lib/arm-linux-gnueabihf/libvtkm_worklet-pv5.9.so
cd /<<PKGBUILDDIR>>/build.python3.9/VTK/ThirdParty/vtkm/vtkvtkm/vtk-m/vtkm/worklet && /usr/bin/cmake -E cmake_link_script CMakeFiles/vtkm_worklet.dir/link.txt --verbose=1
/usr/bin/c++ -fPIC -g -O2 -ffile-prefix-map=/<<PKGBUILDDIR>>=. -fstack-protector-strong -Wformat -Werror=format-security -Wdate-time -D_FORTIFY_SOURCE=2 -Wdate-time -D_FORTIFY_SOURCE=2  -O3 -DNDEBUG  -Wl,-lc -Wl,-z,relro -Wl,--as-needed  -shared -Wl,-soname,libvtkm_worklet-pv5.9.so.1 -o ../../../../../../../lib/arm-linux-gnueabihf/libvtkm_worklet-pv5.9.so.1 CMakeFiles/vtkm_worklet.dir/KeysUnsignedTypes.cxx.o CMakeFiles/vtkm_worklet.dir/KeysSignedTypes.cxx.o CMakeFiles/vtkm_worklet.dir/MaskSelect.cxx.o CMakeFiles/vtkm_worklet.dir/ScatterCounting.cxx.o  -Wl,-rpath,/<<PKGBUILDDIR>>/build.python3.9/lib/arm-linux-gnueabihf: ../../../../../../../lib/arm-linux-gnueabihf/libvtkm_cont-pv5.9.so.1 -pthread ../../../../../../../lib/arm-linux-gnueabihf/libvtkmdiympi_nompi.so 
cd /<<PKGBUILDDIR>>/build.python3.9/VTK/ThirdParty/vtkm/vtkvtkm/vtk-m/vtkm/worklet && /usr/bin/cmake -E cmake_symlink_library ../../../../../../../lib/arm-linux-gnueabihf/libvtkm_worklet-pv5.9.so.1 ../../../../../../../lib/arm-linux-gnueabihf/libvtkm_worklet-pv5.9.so.1 ../../../../../../../lib/arm-linux-gnueabihf/libvtkm_worklet-pv5.9.so
make[4]: Leaving directory '/<<PKGBUILDDIR>>/build.python3.9'
[  9%] Built target vtkm_worklet
make[3]: Leaving directory '/<<PKGBUILDDIR>>/build.python3.9'
make[2]: *** [Makefile:163: all] Error 2
make[2]: Leaving directory '/<<PKGBUILDDIR>>/build.python3.9'
dh_auto_build: error: cd build.python3.9 && make -j4 "INSTALL=install --strip-program=true" VERBOSE=1 returned exit code 2
make[1]: *** [debian/rules:95: my_build_python3.9] Error 25
make[1]: Leaving directory '/<<PKGBUILDDIR>>'
make: *** [debian/rules:8: build-arch] Error 2

Tail of log for gatb-core on armhf:

/<<BUILDDIR>>/gatb-core-1.4.2+dfsg/gatb-core/src/gatb/debruijn/impl/GraphUnitigs.cpp:602:1: note: parameter passing for argument of type 'std::vector<long long unsigned int>::iterator' changed in GCC 7.1
[ 86%] Linking CXX static library ../lib/None/libgatbcore.a
cd /<<BUILDDIR>>/gatb-core-1.4.2+dfsg/obj-arm-linux-gnueabihf/src && /usr/bin/cmake -P CMakeFiles/gatbcore-static.dir/cmake_clean_target.cmake
cd /<<BUILDDIR>>/gatb-core-1.4.2+dfsg/obj-arm-linux-gnueabihf/src && /usr/bin/cmake -E cmake_link_script CMakeFiles/gatbcore-static.dir/link.txt --verbose=1
/usr/bin/ar qc ../lib/None/libgatbcore.a CMakeFiles/gatbcore-static.dir/gatb/bank/impl/Bank.cpp.o CMakeFiles/gatbcore-static.dir/gatb/bank/impl/BankAlbum.cpp.o CMakeFiles/gatbcore-static.dir/gatb/bank/impl/BankBinary.cpp.o CMakeFiles/gatbcore-static.dir/gatb/bank/impl/BankConverterAlgorithm.cpp.o CMakeFiles/gatbcore-static.dir/gatb/bank/impl/BankFasta.cpp.o CMakeFiles/gatbcore-static.dir/gatb/bank/impl/BankHelpers.cpp.o CMakeFiles/gatbcore-static.dir/gatb/bank/impl/BankRandom.cpp.o CMakeFiles/gatbcore-static.dir/gatb/bank/impl/BankSplitter.cpp.o CMakeFiles/gatbcore-static.dir/gatb/bcalm2/bcalm_algo.cpp.o CMakeFiles/gatbcore-static.dir/gatb/bcalm2/bglue_algo.cpp.o CMakeFiles/gatbcore-static.dir/gatb/bcalm2/logging.cpp.o CMakeFiles/gatbcore-static.dir/gatb/bcalm2/ograph.cpp.o CMakeFiles/gatbcore-static.dir/gatb/debruijn/impl/BranchingAlgorithm.cpp.o CMakeFiles/gatbcore-static.dir/gatb/debruijn/impl/Frontline.cpp.o CMakeFiles/gatbcore-static.dir/gatb/debruijn/impl/Graph.cpp.o CMakeFiles/gatbcore-static.dir/gatb/debruijn/impl/GraphUnitigs.cpp.o CMakeFiles/gatbcore-static.dir/gatb/debruijn/impl/IterativeExtensions.cpp.o CMakeFiles/gatbcore-static.dir/gatb/debruijn/impl/LinkTigs.cpp.o CMakeFiles/gatbcore-static.dir/gatb/debruijn/impl/Simplifications.cpp.o CMakeFiles/gatbcore-static.dir/gatb/debruijn/impl/Terminator.cpp.o CMakeFiles/gatbcore-static.dir/gatb/debruijn/impl/Traversal.cpp.o CMakeFiles/gatbcore-static.dir/gatb/debruijn/impl/UnitigsConstructionAlgorithm.cpp.o CMakeFiles/gatbcore-static.dir/gatb/kmer/impl/BloomAlgorithm.cpp.o CMakeFiles/gatbcore-static.dir/gatb/kmer/impl/BloomBuilder.cpp.o CMakeFiles/gatbcore-static.dir/gatb/kmer/impl/Configuration.cpp.o CMakeFiles/gatbcore-static.dir/gatb/kmer/impl/ConfigurationAlgorithm.cpp.o CMakeFiles/gatbcore-static.dir/gatb/kmer/impl/DebloomAlgorithm.cpp.o CMakeFiles/gatbcore-static.dir/gatb/kmer/impl/DebloomMinimizerAlgorithm.cpp.o CMakeFiles/gatbcore-static.dir/gatb/kmer/impl/LinearCounter.cpp.o CMakeFiles/gatbcore-static.dir/gatb/kmer/impl/MPHFAlgorithm.cpp.o CMakeFiles/gatbcore-static.dir/gatb/kmer/impl/Model.cpp.o CMakeFiles/gatbcore-static.dir/gatb/kmer/impl/ModelData.cpp.o CMakeFiles/gatbcore-static.dir/gatb/kmer/impl/PartiInfo.cpp.o CMakeFiles/gatbcore-static.dir/gatb/kmer/impl/PartitionsCommand.cpp.o CMakeFiles/gatbcore-static.dir/gatb/kmer/impl/RepartitionAlgorithm.cpp.o CMakeFiles/gatbcore-static.dir/gatb/kmer/impl/SortingCountAlgorithm.cpp.o CMakeFiles/gatbcore-static.dir/gatb/system/impl/FileSystemCommon.cpp.o CMakeFiles/gatbcore-static.dir/gatb/system/impl/FileSystemLinux.cpp.o CMakeFiles/gatbcore-static.dir/gatb/system/impl/FileSystemMacos.cpp.o CMakeFiles/gatbcore-static.dir/gatb/system/impl/System.cpp.o CMakeFiles/gatbcore-static.dir/gatb/system/impl/SystemInfoCommon.cpp.o CMakeFiles/gatbcore-static.dir/gatb/system/impl/ThreadLinux.cpp.o CMakeFiles/gatbcore-static.dir/gatb/system/impl/ThreadMacos.cpp.o CMakeFiles/gatbcore-static.dir/gatb/tools/collections/impl/Bloom.cpp.o CMakeFiles/gatbcore-static.dir/gatb/tools/compression/DnaCoder.cpp.o CMakeFiles/gatbcore-static.dir/gatb/tools/compression/HeaderCoder.cpp.o CMakeFiles/gatbcore-static.dir/gatb/tools/compression/Leon.cpp.o CMakeFiles/gatbcore-static.dir/gatb/tools/compression/RangeCoder.cpp.o CMakeFiles/gatbcore-static.dir/gatb/tools/designpattern/impl/Command.cpp.o CMakeFiles/gatbcore-static.dir/gatb/tools/designpattern/impl/Observer.cpp.o CMakeFiles/gatbcore-static.dir/gatb/tools/misc/api/Data.cpp.o CMakeFiles/gatbcore-static.dir/gatb/tools/misc/impl/Algorithm.cpp.o CMakeFiles/gatbcore-static.dir/gatb/tools/misc/impl/Histogram.cpp.o CMakeFiles/gatbcore-static.dir/gatb/tools/misc/impl/OptionsParser.cpp.o CMakeFiles/gatbcore-static.dir/gatb/tools/misc/impl/Progress.cpp.o CMakeFiles/gatbcore-static.dir/gatb/tools/misc/impl/Property.cpp.o CMakeFiles/gatbcore-static.dir/gatb/tools/misc/impl/TimeInfo.cpp.o CMakeFiles/gatbcore-static.dir/gatb/tools/misc/impl/Tokenizer.cpp.o CMakeFiles/gatbcore-static.dir/gatb/tools/misc/impl/Tool.cpp.o CMakeFiles/gatbcore-static.dir/gatb/tools/misc/impl/XmlReader.cpp.o CMakeFiles/gatbcore-static.dir/gatb/tools/storage/impl/Storage.cpp.o CMakeFiles/gatbcore-static.dir/gatb/tools/storage/impl/StorageTools.cpp.o CMakeFiles/gatbcore-static.dir/gatb/template/TemplateSpecialization1.cpp.in_128.cpp.o CMakeFiles/gatbcore-static.dir/gatb/template/TemplateSpecialization1.cpp.in_32.cpp.o CMakeFiles/gatbcore-static.dir/gatb/template/TemplateSpecialization1.cpp.in_64.cpp.o CMakeFiles/gatbcore-static.dir/gatb/template/TemplateSpecialization1.cpp.in_96.cpp.o CMakeFiles/gatbcore-static.dir/gatb/template/TemplateSpecialization10.cpp.in_128.cpp.o CMakeFiles/gatbcore-static.dir/gatb/template/TemplateSpecialization10.cpp.in_32.cpp.o CMakeFiles/gatbcore-static.dir/gatb/template/TemplateSpecialization10.cpp.in_64.cpp.o CMakeFiles/gatbcore-static.dir/gatb/template/TemplateSpecialization10.cpp.in_96.cpp.o CMakeFiles/gatbcore-static.dir/gatb/template/TemplateSpecialization2.cpp.in_128.cpp.o CMakeFiles/gatbcore-static.dir/gatb/template/TemplateSpecialization2.cpp.in_32.cpp.o CMakeFiles/gatbcore-static.dir/gatb/template/TemplateSpecialization2.cpp.in_64.cpp.o CMakeFiles/gatbcore-static.dir/gatb/template/TemplateSpecialization2.cpp.in_96.cpp.o CMakeFiles/gatbcore-static.dir/gatb/template/TemplateSpecialization3.cpp.in_128.cpp.o CMakeFiles/gatbcore-static.dir/gatb/template/TemplateSpecialization3.cpp.in_32.cpp.o CMakeFiles/gatbcore-static.dir/gatb/template/TemplateSpecialization3.cpp.in_64.cpp.o CMakeFiles/gatbcore-static.dir/gatb/template/TemplateSpecialization3.cpp.in_96.cpp.o CMakeFiles/gatbcore-static.dir/gatb/template/TemplateSpecialization4.cpp.in_128.cpp.o CMakeFiles/gatbcore-static.dir/gatb/template/TemplateSpecialization4.cpp.in_32.cpp.o CMakeFiles/gatbcore-static.dir/gatb/template/TemplateSpecialization4.cpp.in_64.cpp.o CMakeFiles/gatbcore-static.dir/gatb/template/TemplateSpecialization4.cpp.in_96.cpp.o CMakeFiles/gatbcore-static.dir/gatb/template/TemplateSpecialization5.cpp.in_128.cpp.o CMakeFiles/gatbcore-static.dir/gatb/template/TemplateSpecialization5.cpp.in_32.cpp.o CMakeFiles/gatbcore-static.dir/gatb/template/TemplateSpecialization5.cpp.in_64.cpp.o CMakeFiles/gatbcore-static.dir/gatb/template/TemplateSpecialization5.cpp.in_96.cpp.o CMakeFiles/gatbcore-static.dir/gatb/template/TemplateSpecialization6.cpp.in_128.cpp.o CMakeFiles/gatbcore-static.dir/gatb/template/TemplateSpecialization6.cpp.in_32.cpp.o CMakeFiles/gatbcore-static.dir/gatb/template/TemplateSpecialization6.cpp.in_64.cpp.o CMakeFiles/gatbcore-static.dir/gatb/template/TemplateSpecialization6.cpp.in_96.cpp.o CMakeFiles/gatbcore-static.dir/gatb/template/TemplateSpecialization7.cpp.in_128.cpp.o CMakeFiles/gatbcore-static.dir/gatb/template/TemplateSpecialization7.cpp.in_32.cpp.o CMakeFiles/gatbcore-static.dir/gatb/template/TemplateSpecialization7.cpp.in_64.cpp.o CMakeFiles/gatbcore-static.dir/gatb/template/TemplateSpecialization7.cpp.in_96.cpp.o CMakeFiles/gatbcore-static.dir/gatb/template/TemplateSpecialization8.cpp.in_128.cpp.o CMakeFiles/gatbcore-static.dir/gatb/template/TemplateSpecialization8.cpp.in_32.cpp.o CMakeFiles/gatbcore-static.dir/gatb/template/TemplateSpecialization8.cpp.in_64.cpp.o CMakeFiles/gatbcore-static.dir/gatb/template/TemplateSpecialization8.cpp.in_96.cpp.o CMakeFiles/gatbcore-static.dir/gatb/template/TemplateSpecialization9.cpp.in_128.cpp.o CMakeFiles/gatbcore-static.dir/gatb/template/TemplateSpecialization9.cpp.in_32.cpp.o CMakeFiles/gatbcore-static.dir/gatb/template/TemplateSpecialization9.cpp.in_64.cpp.o CMakeFiles/gatbcore-static.dir/gatb/template/TemplateSpecialization9.cpp.in_96.cpp.o
/usr/bin/ranlib ../lib/None/libgatbcore.a
make[4]: Leaving directory '/<<BUILDDIR>>/gatb-core-1.4.2+dfsg/obj-arm-linux-gnueabihf'
[ 86%] Built target gatbcore-static
make[3]: Leaving directory '/<<BUILDDIR>>/gatb-core-1.4.2+dfsg/obj-arm-linux-gnueabihf'
make[2]: *** [Makefile:174: all] Error 2
make[2]: Leaving directory '/<<BUILDDIR>>/gatb-core-1.4.2+dfsg/obj-arm-linux-gnueabihf'
dh_auto_build: error: cd obj-arm-linux-gnueabihf && make -j4 "INSTALL=install --strip-program=true" VERBOSE=1 returned exit code 2
make[1]: *** [debian/rules:21: override_dh_auto_build-arch] Error 25
make[1]: Leaving directory '/<<BUILDDIR>>/gatb-core-1.4.2+dfsg'
make: *** [debian/rules:15: binary-arch] Error 2

Tail of log for sagemath on armhf:

during this run of 'make all-build'):

It is safe to delete any log files and build directories, but they
contain information that is helpful for debugging build problems.
WARNING: If you now run 'make' again, the build directory of the
same version of the package will, by default, be deleted. Set the
environment variable SAGE_KEEP_BUILT_SPKGS=yes to prevent this.

make[3]: *** [Makefile:33: all-build] Error 1
make[3]: Leaving directory '/<<PKGBUILDDIR>>/sage'
make[2]: *** [Makefile:16: build] Error 2
make[2]: Leaving directory '/<<PKGBUILDDIR>>/sage'
make[1]: *** [debian/rules:70: override_dh_auto_build-arch] Error 2
make[1]: Leaving directory '/<<PKGBUILDDIR>>'
make: *** [debian/rules:40: binary-arch] Error 2

Tail of log for pyfftw on armhf:

One run: 19.45 ms (versus 65.04 ms for singled threaded)
One run: 21.40 ms (versus 65.08 ms for singled threaded)
One run: 70.39 ms (versus 84.17 ms for numpy.fft)
One run: 70.37 ms (versus 84.17 ms for numpy.fft)
One run: 28.73 ms (versus 106.02 ms for numpy.fft)
One run: 28.49 ms (versus 106.02 ms for numpy.fft)
One run: 70.64 ms (versus 61.80 ms for numpy.fft)
One run: 70.38 ms (versus 61.79 ms for numpy.fft)
One run: 36.15 ms (versus 78.76 ms for numpy.fft)
One run: 36.01 ms (versus 78.73 ms for numpy.fft)
E: pybuild pybuild:353: test: plugin distutils failed with: exit code=1: cd /<<PKGBUILDDIR>>/.pybuild/cpython3_3.9_pyfftw/build; python3.9 -m unittest discover -v 
dh_auto_test: error: pybuild --test -i python{version} -p 3.9 returned exit code 13
make[1]: *** [debian/rules:35: override_dh_auto_test] Error 1
make[1]: Leaving directory '/<<PKGBUILDDIR>>'
make: *** [debian/rules:14: build-arch] Error 2

Tail of log for kdiff3 on armhf:

cd /<<PKGBUILDDIR>>/obj-arm-linux-gnueabihf/src && /usr/bin/c++ -DBOOST_ALLOW_DEPRECATED_HEADERS -DENABLE_AUTO -DKCOREADDONS_LIB -DKF_DEPRECATED_WARNINGS_SINCE=0x052400 -DKIOCORE_DEPRECATED_WARNINGS_SINCE=0x052400 -DQT_CONCURRENT_LIB -DQT_CORE_LIB -DQT_DBUS_LIB -DQT_DEPRECATED_WARNINGS -DQT_DISABLE_DEPRECATED_BEFORE=0x050800 -DQT_GUI_LIB -DQT_NETWORK_LIB -DQT_NO_CAST_TO_ASCII -DQT_NO_DEBUG -DQT_NO_KEYWORDS -DQT_NO_PROCESS_COMBINED_ARGUMENT_START -DQT_NO_URL_CAST_FROM_STRING -DQT_PRINTSUPPORT_LIB -DQT_RESTRICTED_CAST_FROM_ASCII -DQT_WIDGETS_LIB -DQT_XML_LIB -D_FILE_OFFSET_BITS=64 -D_GNU_SOURCE -D_LARGEFILE64_SOURCE -I/<<PKGBUILDDIR>>/obj-arm-linux-gnueabihf/src -I/<<PKGBUILDDIR>>/src -I/<<PKGBUILDDIR>>/obj-arm-linux-gnueabihf/src/kdiff3_autogen/include -isystem /usr/include/KF5/KConfigCore -isystem /usr/include/KF5 -isystem /usr/include/arm-linux-gnueabihf/qt5 -isystem /usr/include/arm-linux-gnueabihf/qt5/QtCore -isystem /usr/lib/arm-linux-gnueabihf/qt5/mkspecs/linux-g++ -isystem /usr/include/KF5/KConfigGui -isystem /usr/include/arm-linux-gnueabihf/qt5/QtGui -isystem /usr/include/arm-linux-gnueabihf/qt5/QtXml -isystem /usr/include/KF5/KParts -isystem /usr/include/KF5/KIOWidgets -isystem /usr/include/KF5/KIOGui -isystem /usr/include/KF5/KIOCore -isystem /usr/include/KF5/KCoreAddons -isystem /usr/include/KF5/KService -isystem /usr/include/arm-linux-gnueabihf/qt5/QtNetwork -isystem /usr/include/arm-linux-gnueabihf/qt5/QtDBus -isystem /usr/include/arm-linux-gnueabihf/qt5/QtConcurrent -isystem /usr/include/KF5/KWindowSystem -isystem /usr/include/arm-linux-gnueabihf/qt5/QtWidgets -isystem /usr/include/KF5/KJobWidgets -isystem /usr/include/KF5/Solid -isystem /usr/include/KF5/KCompletion -isystem /usr/include/KF5/KWidgetsAddons -isystem /usr/include/KF5/KXmlGui -isystem /usr/include/KF5/KConfigWidgets -isystem /usr/include/KF5/KCodecs -isystem /usr/include/KF5/KAuth -isystem /usr/include/KF5/KTextWidgets -isystem /usr/include/KF5/SonnetUi -isystem /usr/include/KF5/KI18n -isystem /usr/include/KF5/KCrash -isystem /usr/include/arm-linux-gnueabihf/qt5/QtPrintSupport -g -O2 -ffile-prefix-map=/<<PKGBUILDDIR>>=. -fstack-protector-strong -Wformat -Werror=format-security -Wdate-time -D_FORTIFY_SOURCE=2 -fno-operator-names -fno-exceptions -Wall -Wextra -Wcast-align -Wchar-subscripts -Wformat-security -Wno-long-long -Wpointer-arith -Wundef -Wnon-virtual-dtor -Woverloaded-virtual -Werror=return-type -Wvla -Wdate-time -Wsuggest-override -Wlogical-op -Wall -Wno-trigraphs -Wduplicated-cond -Wduplicated-branches -Wshadow -fvisibility=hidden -fvisibility-inlines-hidden -fPIC -std=gnu++11 -o CMakeFiles/kdiff3.dir/CommentParser.cpp.o -c /<<PKGBUILDDIR>>/src/CommentParser.cpp
[ 99%] Linking CXX executable kdiff3
cd /<<PKGBUILDDIR>>/obj-arm-linux-gnueabihf/src && /usr/bin/cmake -E cmake_link_script CMakeFiles/kdiff3.dir/link.txt --verbose=1
/usr/bin/c++ -g -O2 -ffile-prefix-map=/<<PKGBUILDDIR>>=. -fstack-protector-strong -Wformat -Werror=format-security -Wdate-time -D_FORTIFY_SOURCE=2 -fno-operator-names -fno-exceptions -Wall -Wextra -Wcast-align -Wchar-subscripts -Wformat-security -Wno-long-long -Wpointer-arith -Wundef -Wnon-virtual-dtor -Woverloaded-virtual -Werror=return-type -Wvla -Wdate-time -Wsuggest-override -Wlogical-op -Wall -Wno-trigraphs -Wduplicated-cond -Wduplicated-branches -Wshadow -Wl,--enable-new-dtags -Wl,-z,relro CMakeFiles/kdiff3.dir/kdiff3_autogen/mocs_compilation.cpp.o CMakeFiles/kdiff3.dir/main.cpp.o CMakeFiles/kdiff3.dir/kdiff3_shell.cpp.o CMakeFiles/kdiff3.dir/kdiff3_part.cpp.o CMakeFiles/kdiff3.dir/kdiff3.cpp.o CMakeFiles/kdiff3.dir/DirectoryInfo.cpp.o CMakeFiles/kdiff3.dir/directorymergewindow.cpp.o CMakeFiles/kdiff3.dir/merger.cpp.o CMakeFiles/kdiff3.dir/pdiff.cpp.o CMakeFiles/kdiff3.dir/difftextwindow.cpp.o CMakeFiles/kdiff3.dir/diff.cpp.o CMakeFiles/kdiff3.dir/optiondialog.cpp.o CMakeFiles/kdiff3.dir/mergeresultwindow.cpp.o CMakeFiles/kdiff3.dir/fileaccess.cpp.o CMakeFiles/kdiff3.dir/DefaultFileAccessJobHandler.cpp.o CMakeFiles/kdiff3.dir/gnudiff_analyze.cpp.o CMakeFiles/kdiff3.dir/gnudiff_io.cpp.o CMakeFiles/kdiff3.dir/gnudiff_xmalloc.cpp.o CMakeFiles/kdiff3.dir/common.cpp.o CMakeFiles/kdiff3.dir/smalldialogs.cpp.o CMakeFiles/kdiff3.dir/progress.cpp.o CMakeFiles/kdiff3.dir/ProgressProxyExtender.cpp.o CMakeFiles/kdiff3.dir/PixMapUtils.cpp.o CMakeFiles/kdiff3.dir/MergeFileInfos.cpp.o CMakeFiles/kdiff3.dir/Utils.cpp.o CMakeFiles/kdiff3.dir/selection.cpp.o CMakeFiles/kdiff3.dir/ignorelist.cpp.o CMakeFiles/kdiff3.dir/SourceData.cpp.o CMakeFiles/kdiff3.dir/Overview.cpp.o CMakeFiles/kdiff3.dir/Logging.cpp.o CMakeFiles/kdiff3.dir/FileNameLineEdit.cpp.o CMakeFiles/kdiff3.dir/MergeEditLine.cpp.o CMakeFiles/kdiff3.dir/Options.cpp.o CMakeFiles/kdiff3.dir/CommentParser.cpp.o -o kdiff3  /usr/lib/arm-linux-gnueabihf/libKF5Parts.so.5.86.0 /usr/lib/arm-linux-gnueabihf/libKF5KIOWidgets.so.5.86.0 /usr/lib/arm-linux-gnueabihf/libKF5KIOGui.so.5.86.0 /usr/lib/arm-linux-gnueabihf/libKF5KIOCore.so.5.86.0 /usr/lib/arm-linux-gnueabihf/libKF5Crash.so.5.86.0 /usr/lib/arm-linux-gnueabihf/libKF5JobWidgets.so.5.86.0 /usr/lib/arm-linux-gnueabihf/libKF5Service.so.5.86.0 /usr/lib/arm-linux-gnueabihf/libKF5Solid.so.5.86.0 /usr/lib/arm-linux-gnueabihf/libKF5WindowSystem.so.5.86.0 /usr/lib/arm-linux-gnueabihf/libX11.so /usr/lib/arm-linux-gnueabihf/libQt5Concurrent.so.5.15.2 /usr/lib/arm-linux-gnueabihf/libKF5XmlGui.so.5.86.0 /usr/lib/arm-linux-gnueabihf/libQt5PrintSupport.so.5.15.2 /usr/lib/arm-linux-gnueabihf/libQt5Network.so.5.15.2 /usr/lib/arm-linux-gnueabihf/libKF5TextWidgets.so.5.86.0 /usr/lib/arm-linux-gnueabihf/libKF5Completion.so.5.86.0 /usr/lib/arm-linux-gnueabihf/libKF5ConfigWidgets.so.5.86.0 /usr/lib/arm-linux-gnueabihf/libKF5ConfigGui.so.5.86.0 /usr/lib/arm-linux-gnueabihf/libKF5ConfigCore.so.5.86.0 /usr/lib/arm-linux-gnueabihf/libQt5Xml.so.5.15.2 /usr/lib/arm-linux-gnueabihf/libKF5I18n.so.5.86.0 /usr/lib/arm-linux-gnueabihf/libKF5WidgetsAddons.so.5.86.0 /usr/lib/arm-linux-gnueabihf/libKF5Codecs.so.5.86.0 /usr/lib/arm-linux-gnueabihf/libKF5Auth.so.5.86.0 /usr/lib/arm-linux-gnueabihf/libKF5AuthCore.so.5.86.0 /usr/lib/arm-linux-gnueabihf/libKF5CoreAddons.so.5.86.0 /usr/lib/arm-linux-gnueabihf/libQt5DBus.so.5.15.2 /usr/lib/arm-linux-gnueabihf/libKF5SonnetUi.so.5.86.0 /usr/lib/arm-linux-gnueabihf/libQt5Widgets.so.5.15.2 /usr/lib/arm-linux-gnueabihf/libQt5Gui.so.5.15.2 /usr/lib/arm-linux-gnueabihf/libQt5Core.so.5.15.2 
/usr/bin/ld: CMakeFiles/kdiff3.dir/progress.cpp.o: undefined reference to symbol '__atomic_load_8@@LIBATOMIC_1.0'
/usr/bin/ld: /usr/lib/arm-linux-gnueabihf/libatomic.so.1: error adding symbols: DSO missing from command line
collect2: error: ld returned 1 exit status
make[3]: *** [src/CMakeFiles/kdiff3.dir/build.make:610: src/kdiff3] Error 1
make[3]: Leaving directory '/<<PKGBUILDDIR>>/obj-arm-linux-gnueabihf'
make[2]: *** [CMakeFiles/Makefile2:869: src/CMakeFiles/kdiff3.dir/all] Error 2
make[2]: Leaving directory '/<<PKGBUILDDIR>>/obj-arm-linux-gnueabihf'
make[1]: *** [Makefile:163: all] Error 2
make[1]: Leaving directory '/<<PKGBUILDDIR>>/obj-arm-linux-gnueabihf'
dh_auto_build: error: cd obj-arm-linux-gnueabihf && make -j4 "INSTALL=install --strip-program=true" VERBOSE=1 returned exit code 2
make: *** [debian/rules:11: binary-arch] Error 25

Tail of log for virtuoso-opensource on armhf:

#define SIZEOF_UNSIGNED 4
#define SIZEOF_INT 4
#define SIZEOF_LONG 4
#define SIZEOF_LONG_LONG 8
#define SIZEOF_FLOAT 4
#define SIZEOF_DOUBLE 8
#define SIZEOF_LONG_DOUBLE 8
#define SIZEOF_CHAR_P 4
#define SIZEOF_VOID_P 4

configure: exit 1
dh_auto_configure: error: ./configure --build=arm-linux-gnueabihf --prefix=/usr --includedir=\${prefix}/include --mandir=\${prefix}/share/man --infodir=\${prefix}/share/info --sysconfdir=/etc --localstatedir=/var --disable-option-checking --disable-silent-rules --libdir=\${prefix}/lib/arm-linux-gnueabihf --runstatedir=/run --disable-maintainer-mode --disable-dependency-tracking --with-layout=Debian --program-transform-name=s/isql\$/isql-vt/\;s/isqlw/isqlw-vt/ --with-readline --without-internal-zlib --enable-all-vads returned exit code 1
make[1]: *** [debian/rules:28: override_dh_auto_configure] Error 25
make[1]: Leaving directory '/<<BUILDDIR>>/virtuoso-opensource-7.2.5.1+dfsg1'
make: *** [debian/rules:20: build-arch] Error 2

Tail of log for prometheus-libvirt-exporter on armhf:

text/template
go/doc
gopkg.in/alecthomas/kingpin.v2
github.com/prometheus/common/expfmt
expvar
github.com/prometheus/client_golang/prometheus
github.com/prometheus/client_golang/prometheus/promhttp
# github.com/libvirt/libvirt-go
src/github.com/libvirt/libvirt-go/connect.go:181:77: constant 2147483648 overflows ConnectGetAllDomainStatsFlags
src/github.com/libvirt/libvirt-go/domain_events.go:332:18: type [1073741824]_Ctype_struct__virDomainEventGraphicsSubjectIdentity larger than address space
src/github.com/libvirt/libvirt-go/domain_events.go:332:18: type [1073741824]_Ctype_struct__virDomainEventGraphicsSubjectIdentity too large
dh_auto_build: error: cd build && go install -trimpath -v -p 4 github.com/kumina/libvirt_exporter github.com/kumina/libvirt_exporter/libvirt_schema returned exit code 2
make[1]: *** [debian/rules:19: override_dh_auto_build] Error 25
make[1]: Leaving directory '/<<PKGBUILDDIR>>'
make: *** [debian/rules:12: binary-arch] Error 2

Tail of log for nncp on armhf:

?   	go.cypherpunks.ru/nncp/v7/cmd/nncp-hash	[no test files]
?   	go.cypherpunks.ru/nncp/v7/cmd/nncp-log	[no test files]
?   	go.cypherpunks.ru/nncp/v7/cmd/nncp-pkt	[no test files]
?   	go.cypherpunks.ru/nncp/v7/cmd/nncp-reass	[no test files]
?   	go.cypherpunks.ru/nncp/v7/cmd/nncp-rm	[no test files]
?   	go.cypherpunks.ru/nncp/v7/cmd/nncp-stat	[no test files]
?   	go.cypherpunks.ru/nncp/v7/cmd/nncp-toss	[no test files]
?   	go.cypherpunks.ru/nncp/v7/cmd/nncp-trns	[no test files]
?   	go.cypherpunks.ru/nncp/v7/cmd/nncp-xfer	[no test files]
?   	go.cypherpunks.ru/nncp/v7/uilive	[no test files]
FAIL
dh_auto_test: error: cd _build && go test -vet=off -v -p 4 -timeout 1800s go.cypherpunks.ru/nncp/v7 go.cypherpunks.ru/nncp/v7/cmd/nncp-bundle go.cypherpunks.ru/nncp/v7/cmd/nncp-call go.cypherpunks.ru/nncp/v7/cmd/nncp-caller go.cypherpunks.ru/nncp/v7/cmd/nncp-cfgdir go.cypherpunks.ru/nncp/v7/cmd/nncp-cfgenc go.cypherpunks.ru/nncp/v7/cmd/nncp-cfgmin go.cypherpunks.ru/nncp/v7/cmd/nncp-cfgnew go.cypherpunks.ru/nncp/v7/cmd/nncp-check go.cypherpunks.ru/nncp/v7/cmd/nncp-cronexpr go.cypherpunks.ru/nncp/v7/cmd/nncp-daemon go.cypherpunks.ru/nncp/v7/cmd/nncp-exec go.cypherpunks.ru/nncp/v7/cmd/nncp-file go.cypherpunks.ru/nncp/v7/cmd/nncp-freq go.cypherpunks.ru/nncp/v7/cmd/nncp-hash go.cypherpunks.ru/nncp/v7/cmd/nncp-log go.cypherpunks.ru/nncp/v7/cmd/nncp-pkt go.cypherpunks.ru/nncp/v7/cmd/nncp-reass go.cypherpunks.ru/nncp/v7/cmd/nncp-rm go.cypherpunks.ru/nncp/v7/cmd/nncp-stat go.cypherpunks.ru/nncp/v7/cmd/nncp-toss go.cypherpunks.ru/nncp/v7/cmd/nncp-trns go.cypherpunks.ru/nncp/v7/cmd/nncp-xfer go.cypherpunks.ru/nncp/v7/uilive returned exit code 1
make[1]: *** [debian/rules:54: override_dh_auto_test] Error 25
make[1]: Leaving directory '/<<PKGBUILDDIR>>'
make: *** [debian/rules:6: binary-arch] Error 2

Tail of log for agda on armhf:

[146 of 369] Compiling Agda.Utils.TypeLits ( src/full/Agda/Utils/TypeLits.hs, dist-ghc/build/Agda/Utils/TypeLits.o )
[147 of 369] Compiling Agda.Utils.Update ( src/full/Agda/Utils/Update.hs, dist-ghc/build/Agda/Utils/Update.o )
[148 of 369] Compiling Agda.Syntax.Concrete.Definitions ( src/full/Agda/Syntax/Concrete/Definitions.hs, dist-ghc/build/Agda/Syntax/Concrete/Definitions.o )
[149 of 369] Compiling Agda.Utils.VarSet ( src/full/Agda/Utils/VarSet.hs, dist-ghc/build/Agda/Utils/VarSet.o )
[150 of 369] Compiling Agda.Utils.Warshall ( src/full/Agda/Utils/Warshall.hs, dist-ghc/build/Agda/Utils/Warshall.o )
[151 of 369] Compiling Agda.Utils.WithDefault ( src/full/Agda/Utils/WithDefault.hs, dist-ghc/build/Agda/Utils/WithDefault.o )
[152 of 369] Compiling Agda.Utils.Zipper ( src/full/Agda/Utils/Zipper.hs, dist-ghc/build/Agda/Utils/Zipper.o )
[153 of 369] Compiling Paths_Agda       ( dist-ghc/build/autogen/Paths_Agda.hs, dist-ghc/build/Paths_Agda.o )
[154 of 369] Compiling Agda.Version     ( src/full/Agda/Version.hs, dist-ghc/build/Agda/Version.o )
[155 of 369] Compiling Agda.VersionCommit ( src/full/Agda/VersionCommit.hs, dist-ghc/build/Agda/VersionCommit.o )
[156 of 369] Compiling Agda.Interaction.Library ( src/full/Agda/Interaction/Library.hs, dist-ghc/build/Agda/Interaction/Library.o )
[157 of 369] Compiling Agda.Interaction.Options ( src/full/Agda/Interaction/Options.hs, dist-ghc/build/Agda/Interaction/Options.o )
[158 of 369] Compiling Agda.TypeChecking.Monad.Base ( src/full/Agda/TypeChecking/Monad/Base.hs, dist-ghc/build/Agda/TypeChecking/Monad/Base.o )
ghc: out of memory (requested 2097152 bytes)
make: *** [/usr/share/cdbs/1/class/hlibrary.mk:147: build-ghc-stamp] Error 251

Tail of log for nextpnr on armhf:

In file included from /<<PKGBUILDDIR>>/debian/build/ice40-qt/generated/gui/ice40/gui_ice40_autogen/4RVOBD3RJM/moc_ImGuiRenderer.cpp:10,
                 from /<<PKGBUILDDIR>>/debian/build/ice40-qt/generated/gui/ice40/gui_ice40_autogen/mocs_compilation.cpp:2:
/<<PKGBUILDDIR>>/debian/build/ice40-qt/generated/gui/ice40/gui_ice40_autogen/4RVOBD3RJM/../../../../../../../../3rdparty/qtimgui/ImGuiRenderer.h:57:5: error: 'QOpenGLFunctions_3_2_Core' does not name a type; did you mean 'QOpenGLFunctionsPrivate'?
   57 |     QOpenGLFunctions_3_2_Core *g_fun = nullptr;
      |     ^~~~~~~~~~~~~~~~~~~~~~~~~
      |     QOpenGLFunctionsPrivate
make[4]: *** [generated/gui/ice40/CMakeFiles/gui_ice40.dir/build.make:125: generated/gui/ice40/CMakeFiles/gui_ice40.dir/gui_ice40_autogen/mocs_compilation.cpp.o] Error 1
make[4]: Leaving directory '/<<PKGBUILDDIR>>/debian/build/ice40-qt'
make[3]: *** [CMakeFiles/Makefile2:500: generated/gui/ice40/CMakeFiles/gui_ice40.dir/all] Error 2
make[3]: Leaving directory '/<<PKGBUILDDIR>>/debian/build/ice40-qt'
make[2]: *** [Makefile:160: all] Error 2
make[2]: Leaving directory '/<<PKGBUILDDIR>>/debian/build/ice40-qt'
make[1]: *** [debian/rules:76: build-ice40-qt] Error 2
make[1]: Leaving directory '/<<PKGBUILDDIR>>'
make: *** [debian/rules:21: binary-arch] Error 2

Tail of log for openms on armhf:

  101 |         return static_cast< QOpenGLFunctions_2_0*>(this);
      |                                                         ^
      |                                                         )
make[5]: *** [src/openms_gui/CMakeFiles/OpenMS_GUI.dir/build.make:227: src/openms_gui/CMakeFiles/OpenMS_GUI.dir/OpenMS_GUI_autogen/mocs_compilation.cpp.o] Error 1
make[5]: Leaving directory '/<<BUILDDIR>>/openms-2.6.0+cleaned1/obj-arm-linux-gnueabihf'
make[4]: *** [CMakeFiles/Makefile2:1961: src/openms_gui/CMakeFiles/OpenMS_GUI.dir/all] Error 2
make[4]: Leaving directory '/<<BUILDDIR>>/openms-2.6.0+cleaned1/obj-arm-linux-gnueabihf'
make[3]: *** [CMakeFiles/Makefile2:1819: src/openms_gui/CMakeFiles/GUI.dir/rule] Error 2
make[3]: Leaving directory '/<<BUILDDIR>>/openms-2.6.0+cleaned1/obj-arm-linux-gnueabihf'
make[2]: *** [Makefile:626: GUI] Error 2
make[2]: Leaving directory '/<<BUILDDIR>>/openms-2.6.0+cleaned1/obj-arm-linux-gnueabihf'
dh_auto_build: error: cd obj-arm-linux-gnueabihf && make -j1 "INSTALL=install --strip-program=true" OpenMS GUI TOPP UTILS VERBOSE=1 returned exit code 2
make[1]: *** [debian/rules:95: override_dh_auto_build] Error 25
make[1]: Leaving directory '/<<BUILDDIR>>/openms-2.6.0+cleaned1'
make: *** [debian/rules:43: build-arch] Error 2

Tail of log for iem-plugin-suite on armhf:

                 from ../../JuceLibraryCode/../JuceLibraryCode/JuceHeader.h:17,
                 from ../../../resources/Standalone/StandaloneApp.cpp:53:
/usr/share/juce/modules/juce_core/memory/juce_Atomic.h: In instantiation of 'juce::Atomic<Type>::~Atomic() [with Type = bool]':
../../JuceLibraryCode/../Source/../../resources/OSC/OSCUtilities.h:33:5:   required from here
/usr/share/juce/modules/juce_core/memory/juce_Atomic.h:58:43: error: static assertion failed: This class can only be used for lock-free types
   58 |         static_assert (std::atomic<Type>::is_always_lock_free,
      |                                           ^~~~~~~~~~~~~~~~~~~
make[3]: *** [Makefile:179: build/intermediate/Release/StandaloneApp_2a979640.o] Error 1
make[3]: Leaving directory '/<<PKGBUILDDIR>>/RoomEncoder/Builds/LinuxMakefile'
make[2]: *** [Makefile:125: RoomEncoder-LinuxMakefile-build] Error 2
make[2]: Leaving directory '/<<PKGBUILDDIR>>'
dh_auto_build: error: make -j1 "INSTALL=install --strip-program=true" returned exit code 2
make[1]: *** [debian/rules:42: override_dh_auto_build] Error 25
make[1]: Leaving directory '/<<PKGBUILDDIR>>'
make: *** [debian/rules:39: binary-arch] Error 2

Tail of log for rheolef on armhf:

/usr/bin/ld: ./.libs/libfem.a(geo_domain_indirect_seq.o):(.data.rel.ro+0x18): multiple definition of `typeinfo for rheolef::geo_domain_indirect_rep<double, rheolef::sequential>'; ./.libs/libfem.a(geo_domain_indirect.o):(.data.rel.ro+0x0): first defined here
/usr/bin/ld: ./.libs/libfem.a(geo_domain_indirect_mpi.o):(.rodata+0x0): multiple definition of `typeinfo name for rheolef::geo_domain_indirect_rep<double, rheolef::distributed>'; ./.libs/libfem.a(geo_domain_indirect.o):(.rodata+0x38): first defined here
/usr/bin/ld: ./.libs/libfem.a(geo_domain_indirect_mpi.o):(.data.rel.ro+0x0): multiple definition of `typeinfo for rheolef::geo_domain_indirect_rep<double, rheolef::distributed>'; ./.libs/libfem.a(geo_domain_indirect.o):(.data.rel.ro+0xc): first defined here
/usr/bin/ld: ./.libs/libfem.a(geo_domain_seq.o):(.rodata+0x0): multiple definition of `typeinfo name for rheolef::geo_rep<double, rheolef::sequential>'; ./.libs/libfem.a(geo.o):(.rodata+0x2c): first defined here
/usr/bin/ld: ./.libs/libfem.a(geo_domain_seq.o):(.data.rel.ro+0x0): multiple definition of `typeinfo for rheolef::geo_rep<double, rheolef::sequential>'; ./.libs/libfem.a(geo.o):(.data.rel.ro+0xc): first defined here
/usr/bin/ld: ./.libs/libfem.a(geo_domain_mpi.o):(.rodata+0x0): multiple definition of `typeinfo name for rheolef::geo_rep<double, rheolef::distributed>'; ./.libs/libfem.a(geo.o):(.rodata+0x84): first defined here
/usr/bin/ld: ./.libs/libfem.a(geo_domain_mpi.o):(.data.rel.ro+0x0): multiple definition of `typeinfo for rheolef::geo_rep<double, rheolef::distributed>'; ./.libs/libfem.a(geo.o):(.data.rel.ro+0x24): first defined here
collect2: error: ld returned 1 exit status
make[4]: *** [Makefile:948: librheolef.la] Error 1
make[3]: *** [Makefile:864: all] Error 2
make[2]: *** [Makefile:446: all-recursive] Error 1
make[1]: *** [Makefile:514: all-recursive] Error 1
make[1]: Leaving directory '/<<PKGBUILDDIR>>'
dh_auto_build: error: make -j4 returned exit code 2
make: *** [debian/rules:30: build-arch] Error 25

Tail of log for mlpack on armhf:

make[3]: Leaving directory '/<<PKGBUILDDIR>>/obj-arm-linux-gnueabihf'
[ 73%] Built target build_pyx_decision_stump
1 warning generated.
clang++ -pthread -shared -Wl,-O1 -Wl,-Bsymbolic-functions -Wl,-z,relro -g -fwrapv -O2 -Wl,-z,relro -Wl,-z,now -g -O2 -ffile-prefix-map=/<<PKGBUILDDIR>>=. -fstack-protector-strong -Wformat -Werror=format-security -Wdate-time -D_FORTIFY_SOURCE=2 build/temp.linux-armv7l-3.9/mlpack/dbscan.o -L/<<PKGBUILDDIR>>/obj-arm-linux-gnueabihf/lib -o build/lib.linux-armv7l-3.9/mlpack/dbscan.cpython-39-arm-linux-gnueabihf.so /<<PKGBUILDDIR>>/obj-arm-linux-gnueabihf/lib/libmlpack.so /usr/lib/arm-linux-gnueabihf/libboost_serialization.so /usr/lib/libarmadillo.so
make[3]: Leaving directory '/<<PKGBUILDDIR>>/obj-arm-linux-gnueabihf'
[ 73%] Built target build_pyx_dbscan
1 warning generated.
clang++ -pthread -shared -Wl,-O1 -Wl,-Bsymbolic-functions -Wl,-z,relro -g -fwrapv -O2 -Wl,-z,relro -Wl,-z,now -g -O2 -ffile-prefix-map=/<<PKGBUILDDIR>>=. -fstack-protector-strong -Wformat -Werror=format-security -Wdate-time -D_FORTIFY_SOURCE=2 build/temp.linux-armv7l-3.9/mlpack/cf.o -L/<<PKGBUILDDIR>>/obj-arm-linux-gnueabihf/lib -o build/lib.linux-armv7l-3.9/mlpack/cf.cpython-39-arm-linux-gnueabihf.so /<<PKGBUILDDIR>>/obj-arm-linux-gnueabihf/lib/libmlpack.so /usr/lib/arm-linux-gnueabihf/libboost_serialization.so /usr/lib/libarmadillo.so
make[3]: Leaving directory '/<<PKGBUILDDIR>>/obj-arm-linux-gnueabihf'
[ 73%] Built target build_pyx_cf
make[2]: Leaving directory '/<<PKGBUILDDIR>>/obj-arm-linux-gnueabihf'
make[1]: *** [Makefile:163: all] Error 2
make[1]: Leaving directory '/<<PKGBUILDDIR>>/obj-arm-linux-gnueabihf'
dh_auto_build: error: cd obj-arm-linux-gnueabihf && make -j4 "INSTALL=install --strip-program=true" VERBOSE=1 returned exit code 2
make: *** [debian/rules:59: binary-arch] Error 25

Tail of log for siconos on armhf:

 6518 |     npy_intp this_vector_dim[1] = { v.size() };
      |                                     ~~~~~~^~
/<<BUILDDIR>>/siconos-4.3.1+dfsg/obj-arm-linux-gnueabihf/wrap/siconos/kernelPYTHON_wrap.cxx: In function 'PyObject* SP_SiconosVector_to_numpy(SP::SiconosVector)':
/<<BUILDDIR>>/siconos-4.3.1+dfsg/obj-arm-linux-gnueabihf/wrap/siconos/kernelPYTHON_wrap.cxx:6528:44: warning: narrowing conversion of '((std::__shared_ptr_access<SiconosVector, __gnu_cxx::_S_mutex, false, false>*)(& v))->std::__shared_ptr_access<SiconosVector, __gnu_cxx::_S_mutex, false, false>::operator->()->SiconosVector::size()' from 'unsigned int' to 'npy_intp' {aka 'int'} [-Wnarrowing]
 6528 |     npy_intp this_vector_dim[1] = { v->size() };
      |                                     ~~~~~~~^~
virtual memory exhausted: Cannot allocate memory
make[3]: *** [kernel/swig/CMakeFiles/_kernel.dir/build.make:85: kernel/swig/CMakeFiles/_kernel.dir/__/__/wrap/siconos/kernelPYTHON_wrap.cxx.o] Error 1
make[3]: Leaving directory '/<<BUILDDIR>>/siconos-4.3.1+dfsg/obj-arm-linux-gnueabihf'
make[2]: *** [CMakeFiles/Makefile2:6035: kernel/swig/CMakeFiles/_kernel.dir/all] Error 2
make[2]: Leaving directory '/<<BUILDDIR>>/siconos-4.3.1+dfsg/obj-arm-linux-gnueabihf'
make[1]: *** [Makefile:163: all] Error 2
make[1]: Leaving directory '/<<BUILDDIR>>/siconos-4.3.1+dfsg/obj-arm-linux-gnueabihf'
dh_auto_build: error: cd obj-arm-linux-gnueabihf && make -j1 "INSTALL=install --strip-program=true" VERBOSE=1 returned exit code 2
make: *** [debian/rules:49: binary-arch] Error 25

Tail of log for kodi on armhf:

cd /<<BUILDDIR>>/kodi-19.2+dfsg1/obj-arm-linux-gnueabihf/build/upnp && /usr/bin/c++ -DNPT_CONFIG_ENABLE_LOGGING -I/<<BUILDDIR>>/kodi-19.2+dfsg1/obj-arm-linux-gnueabihf -I/<<BUILDDIR>>/kodi-19.2+dfsg1 -I/<<BUILDDIR>>/kodi-19.2+dfsg1/lib -I/<<BUILDDIR>>/kodi-19.2+dfsg1/xbmc -I/<<BUILDDIR>>/kodi-19.2+dfsg1/xbmc/platform/linux -I/<<BUILDDIR>>/kodi-19.2+dfsg1/xbmc/cores/VideoPlayer -I/<<BUILDDIR>>/kodi-19.2+dfsg1/obj-arm-linux-gnueabihf/build -I/<<BUILDDIR>>/kodi-19.2+dfsg1/obj-arm-linux-gnueabihf/build/include -I/<<BUILDDIR>>/kodi-19.2+dfsg1/xbmc/platform/posix -I/usr/include/dbus-1.0 -I/usr/lib/arm-linux-gnueabihf/dbus-1.0/include -I/usr/include/python3.9 -I/usr/include/samba-4.0 -I/usr/include/libxml2 -I/<<BUILDDIR>>/kodi-19.2+dfsg1/obj-arm-linux-gnueabihf/build/cores/RetroPlayer/messages -I/usr/include/freetype2 -I/usr/include/fribidi -I/<<BUILDDIR>>/kodi-19.2+dfsg1/obj-arm-linux-gnueabihf/build/libdvd/include -I/usr/include/lzo -I/usr/include/libdrm -I/<<BUILDDIR>>/kodi-19.2+dfsg1/lib/libUPnP -I/<<BUILDDIR>>/kodi-19.2+dfsg1/lib/libUPnP/Platinum/Source/Core -I/<<BUILDDIR>>/kodi-19.2+dfsg1/lib/libUPnP/Platinum/Source/Platinum -I/<<BUILDDIR>>/kodi-19.2+dfsg1/lib/libUPnP/Platinum/Source/Devices/MediaConnect -I/<<BUILDDIR>>/kodi-19.2+dfsg1/lib/libUPnP/Platinum/Source/Devices/MediaRenderer -I/<<BUILDDIR>>/kodi-19.2+dfsg1/lib/libUPnP/Platinum/Source/Devices/MediaServer -I/<<BUILDDIR>>/kodi-19.2+dfsg1/lib/libUPnP/Neptune/Source/Core -I/<<BUILDDIR>>/kodi-19.2+dfsg1/lib/libUPnP/Neptune/Source/System/Posix -g -ffile-prefix-map=/<<BUILDDIR>>/kodi-19.2+dfsg1=. -fstack-protector-strong -Wformat -Werror=format-security -O3 -Wdate-time -D_FORTIFY_SOURCE=2 -D_XBMC -Wall -O2 -g -DNDEBUG -DTARGET_POSIX -DTARGET_LINUX -D_GNU_SOURCE -DHAVE_LINUX_UDMABUF=1 -DHAVE_LINUX_DMA_HEAP=1 -DHAVE_LINUX_DMA_BUF=1 -DHAVE_MKOSTEMP=1 -DHAVE_LINUX_MEMFD=1 -DHAVE_STATX=1 -D__STDC_CONSTANT_MACROS -D_FILE_OFFSET_BITS=64 -DHAS_POSIX_NETWORK -DHAS_LINUX_NETWORK -DHAS_BUILTIN_SYNC_ADD_AND_FETCH=1 -DHAS_BUILTIN_SYNC_SUB_AND_FETCH=1 -DHAS_BUILTIN_SYNC_VAL_COMPARE_AND_SWAP=1 -DHAVE_INOTIFY=1 -DHAVE_POSIX_FADVISE=1 -DHAVE_LOCALTIME_R=1 -DHAVE_GMTIME_R=1 -DHAVE_INTTYPES_H=1 -DHAS_ALSA=1 -DHAS_AVAHI=1 -DHAS_ZEROCONF=1 -DHAVE_LIBBLURAY=1 -DHAVE_LIBBLURAY_BDJ=1 -DHAVE_LIBCEC=1 -DHAS_DBUS=1 -DHAS_ISO9660PP=1 -DHAVE_LCMS2=1 -DHAS_LIRC=1 -DHAS_WEB_SERVER=1 -DHAS_WEB_INTERFACE=1 -DHAS_FILESYSTEM_NFS=1 -DHAS_NFS_SET_TIMEOUT -DHAS_AIRPLAY=1 -DHAS_PULSEAUDIO=1 -DHAS_PYTHON=1 -DHAS_FILESYSTEM_SMB=1 -DHAS_SNDIO=1 -DHAVE_LIBUDEV=1 -DHAS_UDFREAD=1 -DHAVE_LIBXSLT=1 -DHAVE_LIBVA=1 -DHAS_GLX=1 -DHAVE_LIBVDPAU=1 -DFFMPEG_VER_SHA=\"4.3\" -I/usr/include/fribidi -DHAVE_GCRYPT=1 -DSPDLOG_FMT_EXTERNAL -DSPDLOG_DEBUG_ON -DSPDLOG_NO_ATOMIC_LEVELS -DSPDLOG_ENABLE_PATTERN_PADDING -DHAS_EGL=1 -DHAVE_X11=1 -DHAVE_LIBXRANDR=1 -DHAVE_HDR_OUTPUT_METADATA=1 -DHAS_GL=1 -DHAVE_WAYLAND=1 -DHAVE_GBM=1 -DHAS_GBM_BO_MAP=1 -DHAS_GBM_MODIFIERS=1 -DHAS_MYSQL=1 -DHAS_UPNP=1 -DHAS_DVD_DRIVE -DHAS_CDDA_RIPPER -DHAS_AIRTUNES=1 -DBIN_INSTALL_PATH=\"/usr/lib/arm-linux-gnueabihf/kodi\" -DINSTALL_PATH=\"/usr/share/kodi\" -std=c++14 -MD -MT build/upnp/CMakeFiles/upnp.dir/Neptune/Source/System/Null/NptNullAutoreleasePool.cpp.o -MF CMakeFiles/upnp.dir/Neptune/Source/System/Null/NptNullAutoreleasePool.cpp.o.d -o CMakeFiles/upnp.dir/Neptune/Source/System/Null/NptNullAutoreleasePool.cpp.o -c /<<BUILDDIR>>/kodi-19.2+dfsg1/lib/libUPnP/Neptune/Source/System/Null/NptNullAutoreleasePool.cpp
[  6%] Linking CXX static library libupnp.a
cd /<<BUILDDIR>>/kodi-19.2+dfsg1/obj-arm-linux-gnueabihf/build/upnp && /usr/bin/cmake -P CMakeFiles/upnp.dir/cmake_clean_target.cmake
cd /<<BUILDDIR>>/kodi-19.2+dfsg1/obj-arm-linux-gnueabihf/build/upnp && /usr/bin/cmake -E cmake_link_script CMakeFiles/upnp.dir/link.txt --verbose=1
/usr/bin/ar qc libupnp.a CMakeFiles/upnp.dir/Platinum/Source/Core/PltAction.cpp.o CMakeFiles/upnp.dir/Platinum/Source/Core/PltArgument.cpp.o CMakeFiles/upnp.dir/Platinum/Source/Core/PltConstants.cpp.o CMakeFiles/upnp.dir/Platinum/Source/Core/PltCtrlPoint.cpp.o CMakeFiles/upnp.dir/Platinum/Source/Core/PltCtrlPointTask.cpp.o CMakeFiles/upnp.dir/Platinum/Source/Core/PltDatagramStream.cpp.o CMakeFiles/upnp.dir/Platinum/Source/Core/PltDeviceData.cpp.o CMakeFiles/upnp.dir/Platinum/Source/Core/PltDeviceHost.cpp.o CMakeFiles/upnp.dir/Platinum/Source/Core/PltEvent.cpp.o CMakeFiles/upnp.dir/Platinum/Source/Core/PltHttp.cpp.o CMakeFiles/upnp.dir/Platinum/Source/Core/PltHttpClientTask.cpp.o CMakeFiles/upnp.dir/Platinum/Source/Core/PltHttpServer.cpp.o CMakeFiles/upnp.dir/Platinum/Source/Core/PltHttpServerTask.cpp.o CMakeFiles/upnp.dir/Platinum/Source/Core/PltIconsData.cpp.o CMakeFiles/upnp.dir/Platinum/Source/Core/PltMimeType.cpp.o CMakeFiles/upnp.dir/Platinum/Source/Core/PltProtocolInfo.cpp.o CMakeFiles/upnp.dir/Platinum/Source/Core/PltService.cpp.o CMakeFiles/upnp.dir/Platinum/Source/Core/PltSsdp.cpp.o CMakeFiles/upnp.dir/Platinum/Source/Core/PltStateVariable.cpp.o CMakeFiles/upnp.dir/Platinum/Source/Core/PltTaskManager.cpp.o CMakeFiles/upnp.dir/Platinum/Source/Core/PltThreadTask.cpp.o CMakeFiles/upnp.dir/Platinum/Source/Core/PltUPnP.cpp.o CMakeFiles/upnp.dir/Platinum/Source/Devices/MediaServer/PltDidl.cpp.o CMakeFiles/upnp.dir/Platinum/Source/Devices/MediaServer/PltFileMediaServer.cpp.o CMakeFiles/upnp.dir/Platinum/Source/Devices/MediaServer/PltMediaBrowser.cpp.o CMakeFiles/upnp.dir/Platinum/Source/Devices/MediaServer/PltMediaCache.cpp.o CMakeFiles/upnp.dir/Platinum/Source/Devices/MediaServer/PltMediaItem.cpp.o CMakeFiles/upnp.dir/Platinum/Source/Devices/MediaServer/PltMediaServer.cpp.o CMakeFiles/upnp.dir/Platinum/Source/Devices/MediaServer/ConnectionManagerSCPD.cpp.o CMakeFiles/upnp.dir/Platinum/Source/Devices/MediaServer/ContentDirectorySCPD.cpp.o CMakeFiles/upnp.dir/Platinum/Source/Devices/MediaServer/ContentDirectorywSearchSCPD.cpp.o CMakeFiles/upnp.dir/Platinum/Source/Devices/MediaServer/PltSyncMediaBrowser.cpp.o CMakeFiles/upnp.dir/Neptune/Source/Core/Neptune.cpp.o CMakeFiles/upnp.dir/Neptune/Source/Core/NptAutomaticCleaner.cpp.o CMakeFiles/upnp.dir/Neptune/Source/Core/NptBase64.cpp.o CMakeFiles/upnp.dir/Neptune/Source/Core/NptBufferedStreams.cpp.o CMakeFiles/upnp.dir/Neptune/Source/Core/NptCommon.cpp.o CMakeFiles/upnp.dir/Neptune/Source/Core/NptDataBuffer.cpp.o CMakeFiles/upnp.dir/Neptune/Source/Core/NptDebug.cpp.o CMakeFiles/upnp.dir/Neptune/Source/Core/NptFile.cpp.o CMakeFiles/upnp.dir/Neptune/Source/Core/NptHash.cpp.o CMakeFiles/upnp.dir/Neptune/Source/Core/NptHttp.cpp.o CMakeFiles/upnp.dir/Neptune/Source/Core/NptList.cpp.o CMakeFiles/upnp.dir/Neptune/Source/Core/NptLogging.cpp.o CMakeFiles/upnp.dir/Neptune/Source/Core/NptMessaging.cpp.o CMakeFiles/upnp.dir/Neptune/Source/Core/NptNetwork.cpp.o CMakeFiles/upnp.dir/Neptune/Source/Core/NptQueue.cpp.o CMakeFiles/upnp.dir/Neptune/Source/Core/NptResults.cpp.o CMakeFiles/upnp.dir/Neptune/Source/Core/NptRingBuffer.cpp.o CMakeFiles/upnp.dir/Neptune/Source/Core/NptSimpleMessageQueue.cpp.o CMakeFiles/upnp.dir/Neptune/Source/Core/NptSockets.cpp.o CMakeFiles/upnp.dir/Neptune/Source/Core/NptStreams.cpp.o CMakeFiles/upnp.dir/Neptune/Source/Core/NptStrings.cpp.o CMakeFiles/upnp.dir/Neptune/Source/Core/NptSystem.cpp.o CMakeFiles/upnp.dir/Neptune/Source/Core/NptThreads.cpp.o CMakeFiles/upnp.dir/Neptune/Source/Core/NptTime.cpp.o CMakeFiles/upnp.dir/Neptune/Source/Core/NptTls.cpp.o CMakeFiles/upnp.dir/Neptune/Source/Core/NptUri.cpp.o CMakeFiles/upnp.dir/Neptune/Source/Core/NptUtils.cpp.o CMakeFiles/upnp.dir/Neptune/Source/Core/NptXml.cpp.o CMakeFiles/upnp.dir/Neptune/Source/System/Bsd/NptBsdResolver.cpp.o CMakeFiles/upnp.dir/Neptune/Source/System/Bsd/NptBsdSockets.cpp.o CMakeFiles/upnp.dir/Neptune/Source/System/StdC/NptStdcDebug.cpp.o CMakeFiles/upnp.dir/Neptune/Source/System/StdC/NptStdcEnvironment.cpp.o CMakeFiles/upnp.dir/Platinum/Source/Devices/MediaRenderer/PltMediaRenderer.cpp.o CMakeFiles/upnp.dir/Platinum/Source/Devices/MediaRenderer/PltMediaController.cpp.o CMakeFiles/upnp.dir/Platinum/Source/Devices/MediaRenderer/AVTransportSCPD.cpp.o CMakeFiles/upnp.dir/Platinum/Source/Devices/MediaRenderer/RdrConnectionManagerSCPD.cpp.o CMakeFiles/upnp.dir/Platinum/Source/Devices/MediaRenderer/RenderingControlSCPD.cpp.o CMakeFiles/upnp.dir/Platinum/Source/Devices/MediaConnect/X_MS_MediaReceiverRegistrarSCPD.cpp.o CMakeFiles/upnp.dir/Platinum/Source/Devices/MediaConnect/PltMediaConnect.cpp.o CMakeFiles/upnp.dir/Neptune/Source/System/Posix/NptPosixEnvironment.cpp.o CMakeFiles/upnp.dir/Neptune/Source/System/Posix/NptPosixSystem.cpp.o CMakeFiles/upnp.dir/Neptune/Source/System/Posix/NptSelectableMessageQueue.cpp.o CMakeFiles/upnp.dir/Neptune/Source/System/Posix/NptPosixQueue.cpp.o CMakeFiles/upnp.dir/Neptune/Source/System/Posix/NptPosixThreads.cpp.o CMakeFiles/upnp.dir/Neptune/Source/System/Posix/NptPosixTime.cpp.o CMakeFiles/upnp.dir/Neptune/Source/System/Bsd/NptBsdNetwork.cpp.o CMakeFiles/upnp.dir/Neptune/Source/System/Null/NptNullAutoreleasePool.cpp.o
/usr/bin/ranlib libupnp.a
make[4]: Leaving directory '/<<BUILDDIR>>/kodi-19.2+dfsg1/obj-arm-linux-gnueabihf'
[  6%] Built target upnp
make[3]: Leaving directory '/<<BUILDDIR>>/kodi-19.2+dfsg1/obj-arm-linux-gnueabihf'
make[2]: *** [Makefile:149: all] Error 2
make[2]: Leaving directory '/<<BUILDDIR>>/kodi-19.2+dfsg1/obj-arm-linux-gnueabihf'
dh_auto_build: error: cd obj-arm-linux-gnueabihf && make -j4 "INSTALL=install --strip-program=true" VERBOSE=1 returned exit code 2
make[1]: *** [debian/rules:138: override_dh_auto_build] Error 25
make[1]: Leaving directory '/<<BUILDDIR>>/kodi-19.2+dfsg1'
make: *** [debian/rules:98: binary-arch] Error 2

Tail of log for openstructure on armhf:

...
----------------------------------------------------------------------
Ran 3 tests in 0.002s

OK
make[4]: Leaving directory '/<<PKGBUILDDIR>>/obj-arm-linux-gnueabihf'
[100%] Built target test_local_align.py_run
.
----------------------------------------------------------------------
Ran 2 tests in 65.482s

OK
Could not find CAD score classic executables: ignoring unit tests
make[4]: Leaving directory '/<<PKGBUILDDIR>>/obj-arm-linux-gnueabihf'
[100%] Built target test_cadscore.py_run

Tail of log for chromium on armhf:

FAILED: gen/ui/webui/resources/tsconfig_definitions.json gen/ui/webui/resources/preprocessed/cr_components/managed_dialog/managed_dialog.d.ts gen/ui/webui/resources/preprocessed/cr_elements/action_link_css.m.d.ts gen/ui/webui/resources/preprocessed/cr_elements/cr_a11y_announcer/cr_a11y_announcer.d.ts gen/ui/webui/resources/preprocessed/cr_elements/cr_actionable_row_style.m.d.ts gen/ui/webui/resources/preprocessed/cr_elements/cr_fingerprint/cr_fingerprint_icon.m.d.ts gen/ui/webui/resources/preprocessed/cr_elements/cr_fingerprint/cr_fingerprint_progress_arc.m.d.ts gen/ui/webui/resources/preprocessed/cr_elements/cr_grid/cr_grid.d.ts gen/ui/webui/resources/preprocessed/cr_elements/cr_icons_css.m.d.ts gen/ui/webui/resources/preprocessed/cr_elements/cr_auto_img/cr_auto_img.d.ts gen/ui/webui/resources/preprocessed/cr_elements/cr_input/cr_input_style_css.m.d.ts gen/ui/webui/resources/preprocessed/cr_elements/cr_link_row/cr_link_row.d.ts gen/ui/webui/resources/preprocessed/cr_elements/cr_lottie/cr_lottie.m.d.ts gen/ui/webui/resources/preprocessed/cr_elements/cr_menu_selector/cr_menu_selector.d.ts gen/ui/webui/resources/preprocessed/cr_elements/cr_page_host_style_css.d.ts gen/ui/webui/resources/preprocessed/cr_elements/cr_profile_avatar_selector/cr_profile_avatar_selector_grid.d.ts gen/ui/webui/resources/preprocessed/cr_elements/cr_profile_avatar_selector/cr_profile_avatar_selector.d.ts gen/ui/webui/resources/preprocessed/cr_elements/cr_radio_button/cr_radio_button_style_css.m.d.ts gen/ui/webui/resources/preprocessed/cr_elements/cr_scrollable_behavior.m.d.ts gen/ui/webui/resources/preprocessed/cr_elements/cr_search_field/cr_search_field.d.ts gen/ui/webui/resources/preprocessed/cr_elements/cr_slider/cr_slider.d.ts gen/ui/webui/resources/preprocessed/cr_elements/cr_splitter/cr_splitter.d.ts gen/ui/webui/resources/preprocessed/cr_elements/cr_tabs/cr_tabs.d.ts gen/ui/webui/resources/preprocessed/cr_elements/cr_toolbar/cr_toolbar.d.ts gen/ui/webui/resources/preprocessed/cr_elements/cr_toolbar/cr_toolbar_selection_overlay.d.ts gen/ui/webui/resources/preprocessed/cr_elements/hidden_style_css.m.d.ts gen/ui/webui/resources/preprocessed/cr_elements/icons.m.d.ts gen/ui/webui/resources/preprocessed/cr_elements/md_select_css.m.d.ts gen/ui/webui/resources/preprocessed/cr_elements/mouse_hoverable_mixin.d.ts gen/ui/webui/resources/preprocessed/cr_elements/mwb_shared_style.d.ts gen/ui/webui/resources/preprocessed/cr_elements/mwb_shared_vars.d.ts gen/ui/webui/resources/preprocessed/cr_elements/policy/cr_policy_pref_behavior.m.d.ts gen/ui/webui/resources/preprocessed/cr_elements/policy/cr_policy_pref_indicator.m.d.ts gen/ui/webui/resources/preprocessed/cr_elements/search_highlight_style_css.d.ts gen/ui/webui/resources/preprocessed/cr_elements/shared_style_css.m.d.ts gen/ui/webui/resources/preprocessed/cr_elements/shared_vars_css.m.d.ts gen/ui/webui/resources/preprocessed/js/action_link.d.ts gen/ui/webui/resources/preprocessed/js/assert.m.d.ts gen/ui/webui/resources/preprocessed/js/color_utils.d.ts gen/ui/webui/resources/preprocessed/js/cr/event_target.m.d.ts gen/ui/webui/resources/preprocessed/js/cr.m.d.ts gen/ui/webui/resources/preprocessed/js/cr/ui/drag_wrapper.d.ts gen/ui/webui/resources/preprocessed/js/cr/ui/focus_grid.d.ts gen/ui/webui/resources/preprocessed/js/cr/ui/focus_outline_manager.m.d.ts gen/ui/webui/resources/preprocessed/js/cr/ui/focus_row.m.d.ts gen/ui/webui/resources/preprocessed/js/cr/ui/keyboard_shortcut_list.m.d.ts gen/ui/webui/resources/preprocessed/js/cr/ui/store_client.m.d.ts gen/ui/webui/resources/preprocessed/js/cr/ui/store.m.d.ts gen/ui/webui/resources/preprocessed/js/custom_element.d.ts gen/ui/webui/resources/preprocessed/js/event_tracker.m.d.ts gen/ui/webui/resources/preprocessed/js/icon.m.d.ts gen/ui/webui/resources/preprocessed/js/load_time_data.m.d.ts gen/ui/webui/resources/preprocessed/js/parse_html_subset.m.d.ts gen/ui/webui/resources/preprocessed/js/plural_string_proxy.d.ts gen/ui/webui/resources/preprocessed/js/search_highlight_utils.d.ts gen/ui/webui/resources/preprocessed/js/util.m.d.ts gen/ui/webui/resources/preprocessed/js/cr/ui/focus_without_ink.m.d.ts 
python3 ../../tools/typescript/ts_definitions.py --root_dir gen/ui/webui/resources/preprocessed --gen_dir gen/ui/webui/resources --out_dir gen/ui/webui/resources/preprocessed --js_files cr_components/managed_dialog/managed_dialog.js cr_elements/action_link_css.m.js cr_elements/cr_a11y_announcer/cr_a11y_announcer.js cr_elements/cr_actionable_row_style.m.js cr_elements/cr_fingerprint/cr_fingerprint_icon.m.js cr_elements/cr_fingerprint/cr_fingerprint_progress_arc.m.js cr_elements/cr_grid/cr_grid.js cr_elements/cr_icons_css.m.js cr_elements/cr_auto_img/cr_auto_img.js cr_elements/cr_input/cr_input_style_css.m.js cr_elements/cr_link_row/cr_link_row.js cr_elements/cr_lottie/cr_lottie.m.js cr_elements/cr_menu_selector/cr_menu_selector.js cr_elements/cr_page_host_style_css.js cr_elements/cr_profile_avatar_selector/cr_profile_avatar_selector_grid.js cr_elements/cr_profile_avatar_selector/cr_profile_avatar_selector.js cr_elements/cr_radio_button/cr_radio_button_style_css.m.js cr_elements/cr_scrollable_behavior.m.js cr_elements/cr_search_field/cr_search_field.js cr_elements/cr_slider/cr_slider.js cr_elements/cr_splitter/cr_splitter.js cr_elements/cr_tabs/cr_tabs.js cr_elements/cr_toolbar/cr_toolbar.js cr_elements/cr_toolbar/cr_toolbar_selection_overlay.js cr_elements/hidden_style_css.m.js cr_elements/icons.m.js cr_elements/md_select_css.m.js cr_elements/mouse_hoverable_mixin.js cr_elements/mwb_shared_style.js cr_elements/mwb_shared_vars.js cr_elements/policy/cr_policy_pref_behavior.m.js cr_elements/policy/cr_policy_pref_indicator.m.js cr_elements/search_highlight_style_css.js cr_elements/shared_style_css.m.js cr_elements/shared_vars_css.m.js js/action_link.js js/assert.m.js js/color_utils.js js/cr/event_target.m.js js/cr.m.js js/cr/ui/drag_wrapper.js js/cr/ui/focus_grid.js js/cr/ui/focus_outline_manager.m.js js/cr/ui/focus_row.m.js js/cr/ui/keyboard_shortcut_list.m.js js/cr/ui/store_client.m.js js/cr/ui/store.m.js js/custom_element.js js/event_tracker.m.js js/icon.m.js js/load_time_data.m.js js/parse_html_subset.m.js js/plural_string_proxy.js js/search_highlight_utils.js js/util.m.js js/cr/ui/focus_without_ink.m.js --path_mappings chrome://resources/polymer/v3_0/\*\|../../../../../../third_party/polymer/v3_0/components-chromium/\* //resources/polymer/v3_0/\*\|../../../../../../third_party/polymer/v3_0/components-chromium/\* chrome://resources/polymer/v3_0/polymer/polymer_bundled.min.js\|../../../../../../third_party/polymer/v3_0/components-chromium/polymer/polymer-element.d.ts //resources/polymer/v3_0/polymer/polymer_bundled.min.js\|../../../../../../third_party/polymer/v3_0/components-chromium/polymer/polymer-element.d.ts
Traceback (most recent call last):
  File "/<<PKGBUILDDIR>>/out/Release/../../tools/typescript/ts_definitions.py", line 114, in <module>
    main(sys.argv[1:])
  File "/<<PKGBUILDDIR>>/out/Release/../../tools/typescript/ts_definitions.py", line 93, in main
    if os.path.dirname(js_file) != os.path.dirname(generated_files[i]):
IndexError: list index out of range
[21050/47738] CXX obj/chrome/browser/media/mojo_bindings_shared_cpp_sources/media_history_store.mojom-shared.o
[21051/47738] CXX obj/chrome/browser/media/mojo_bindings_shared_cpp_sources/media_engagement_score_details.mojom-shared.o
[21052/47738] CXX obj/chrome/browser/cart/mojo_bindings/chrome_cart.mojom.o
ninja: build stopped: subcommand failed.
make[1]: *** [debian/rules:122: override_dh_auto_build-arch] Error 1
make[1]: Leaving directory '/<<PKGBUILDDIR>>'
make: *** [debian/rules:109: binary-arch] Error 2

Tail of log for r-cran-fastcluster on armhf:

Copyright:
  * Until package version 1.1.23: (c) 2011 Daniel Müllner <http://danifold.net>
  * All changes from version 1.1.24 on: (c) Google Inc. <http://google.com>
Seed: 372086177
Dimension: 6
Number of points: 118
Metric: hamming...Method: single...OK.
Metric: jaccard...Method: single...OK.
Metric: yule...Method: single...error: Test failed: <unittest.runner.TextTestResult run=3 errors=0 failures=1>
Seed: 372086177
Seed: 107606428
Seed: 947660282
E: pybuild pybuild:353: test: plugin distutils failed with: exit code=1: python3.9 setup.py test 
dh_auto_test: error: pybuild --test -i python{version} -p 3.9 --dir src/python returned exit code 13
make: *** [debian/rules:14: binary-arch] Error 25

Tail of log for libguestfs on armhf:

rm -f excludefiles-t
touch stamp-libguestfs-make-fixed-appliance.pod
config.status: creating appliance/make.sh-t
chmod +x make.sh-t
cmp -s make.sh make.sh-t || mv make.sh-t make.sh
rm -f make.sh-t
make[4]: Leaving directory '/<<PKGBUILDDIR>>/debian/build-4/appliance'
make[3]: *** [Makefile:2493: all-recursive] Error 1
make[3]: Leaving directory '/<<PKGBUILDDIR>>/debian/build-4'
make[2]: *** [Makefile:2393: all] Error 2
make[2]: Leaving directory '/<<PKGBUILDDIR>>/debian/build-4'
dh_auto_build: error: cd debian/build-4 && make -j4 INSTALLDIRS=vendor LD_RUN_PATH= returned exit code 2
make[1]: *** [debian/rules:113: /<<PKGBUILDDIR>>/debian/build-4/build-stamp] Error 25
make[1]: Leaving directory '/<<PKGBUILDDIR>>'
make: *** [debian/rules:187: build-arch] Error 2