Raspbian Package Auto-Building

Buildd status for fstl (bookworm-staging)

Debian PTSTrackerChangelogBugspackages.d.obuildd.d.o

Package(s): Suite:
Compact mode Co-maintainers

ArchitectureVersionStatusForBuilddStateMiscLogs
Buildd exposure stats armhf  0.9.4-1Build-Attempted30d 2h 40mbm-wb-03out-of-datemisc:optionalold | all (2)

Tail of log for fstl on armhf:

      |                                        ^
In file included from /usr/include/arm-linux-gnueabihf/qt5/QtGui/QMouseEvent:1,
                 from /<<PKGBUILDDIR>>/src/canvas.cpp:1:
/usr/include/arm-linux-gnueabihf/qt5/QtGui/qevent.h:219:16: note: declared here
  219 |     inline int delta() const  { return qt4D; }
      |                ^~~~~
make[3]: *** [CMakeFiles/fstl.dir/build.make:141: CMakeFiles/fstl.dir/src/canvas.cpp.o] Error 1
make[3]: *** Waiting for unfinished jobs....
make[3]: Leaving directory '/<<PKGBUILDDIR>>/obj-arm-linux-gnueabihf'
make[2]: *** [CMakeFiles/Makefile2:99: CMakeFiles/fstl.dir/all] Error 2
make[2]: Leaving directory '/<<PKGBUILDDIR>>/obj-arm-linux-gnueabihf'
make[1]: *** [Makefile:174: all] Error 2
make[1]: Leaving directory '/<<PKGBUILDDIR>>/obj-arm-linux-gnueabihf'
dh_auto_build: error: cd obj-arm-linux-gnueabihf && make -j4 "INSTALL=install --strip-program=true" VERBOSE=1 returned exit code 2
make: *** [debian/rules:9: binary-arch] Error 25