Raspbian Package Auto-Building

Buildd status for freefoam (wheezy-staging)

Debian PTSTrackerChangelogBugspackages.d.obuildd.d.o

Package(s): Suite:
Compact mode Co-maintainers

ArchitectureVersionStatusForBuilddStateMiscLogs
Buildd exposure stats armhf  0.1.0-1Build-Attempted1401d 8h 16mmb-lxc-01uncompiledscience:sourceold | all (5)

Tail of log for freefoam on armhf:

Scanning dependencies of target UserGuide-pdf
make[3]: Leaving directory `/<<PKGBUILDDIR>>/obj-arm-linux-gnueabihf'
/usr/bin/make -f doc/UserGuide/CMakeFiles/UserGuide-pdf.dir/build.make doc/UserGuide/CMakeFiles/UserGuide-pdf.dir/build
make[3]: Entering directory `/<<PKGBUILDDIR>>/obj-arm-linux-gnueabihf'
/usr/bin/cmake -E cmake_progress_report /<<PKGBUILDDIR>>/obj-arm-linux-gnueabihf/CMakeFiles 
[  0%] Creating Asymptote graphics intro_structure.pdf
cd /<<PKGBUILDDIR>>/obj-arm-linux-gnueabihf/doc/UserGuide/CMakeFiles/intro_structure_pdf.dir && /usr/bin/asy -fpdf -tex pdflatex intro_structure
Illegal instruction (core dumped)
make[3]: *** [doc/UserGuide/images/intro_structure.pdf] Error 132
make[3]: Leaving directory `/<<PKGBUILDDIR>>/obj-arm-linux-gnueabihf'
make[2]: *** [doc/UserGuide/CMakeFiles/UserGuide-pdf.dir/all] Error 2
make[2]: Leaving directory `/<<PKGBUILDDIR>>/obj-arm-linux-gnueabihf'
make[1]: *** [all] Error 2
make[1]: Leaving directory `/<<PKGBUILDDIR>>/obj-arm-linux-gnueabihf'
make: *** [debian/stamp-makefile-build] Error 2