Raspbian Package Auto-Building

Buildd status for fpzip (bookworm-staging)

Debian PTSTrackerChangelogBugspackages.d.obuildd.d.o

Package(s): Suite:
Compact mode Co-maintainers

ArchitectureVersionStatusForBuilddStateMiscLogs
Buildd exposure stats armhf  1.3.0-2Build-Attempted30d 15h 49mmb-lxc-01uncompiledmisc:extraold | all (3)

Tail of log for fpzip on armhf:

one or more tests failed


0% tests passed, 1 tests failed out of 1

Total Test time (real) =   0.01 sec

The following tests FAILED:
	  1 - compress-decompress-validate (Failed)
Errors while running CTest
make[1]: *** [Makefile:140: test] Error 8
make[1]: Leaving directory '/<<PKGBUILDDIR>>/obj-arm-linux-gnueabihf'
	rm -fr -- /tmp/dh-xdg-rundir-DQ1SsiQ0
dh_auto_test: error: cd obj-arm-linux-gnueabihf && make -j4 test ARGS\+=--verbose ARGS\+=-j4 returned exit code 2
make: *** [debian/rules:8: build-arch] Error 25