Raspbian Package Auto-Building

Buildd status for flatpak, gammapy, ioapps, kafs-client, rust-kvm-ioctls, slang-slirp, wmmail, nextpnr, mrpt (bullseye-staging)

Bugs

Package(s): Suite:
Compact mode Co-maintainers

Package armhf
Buildd exposure stats
✔ flatpakInstalled
✔ gammapyBuild-Attempted
✔ ioappsBuild-Attempted
✔ kafs-clientBuild-Attempted
✔ rust-kvm-ioctlsBuild-Attempted
✔ slang-slirpBuild-Attempted
✔ wmmailBuild-Attempted
✔ nextpnrBuild-Attempted
✔ mrptInstalled

Tail of log for gammapy on armhf:

FAILED gammapy/maps/tests/test_base.py::test_map_copy[0.1-10.0-hpx-skydir2-axes2-]
FAILED gammapy/maps/tests/test_base.py::test_map_copy[0.1-10.0-hpx-skydir3-axes3-s^2]
FAILED gammapy/maps/tests/test_base.py::test_map_get_image_by_coord[0.1-10.0-hpx-skydir2-axes2-]
FAILED gammapy/maps/tests/test_base.py::test_map_get_image_by_coord[0.1-10.0-hpx-skydir3-axes3-s^2]
FAILED gammapy/maps/tests/test_base.py::test_map_get_image_by_pix[0.1-10.0-hpx-skydir2-axes2-]
FAILED gammapy/maps/tests/test_base.py::test_map_get_image_by_pix[0.1-10.0-hpx-skydir3-axes3-s^2]
FAILED gammapy/maps/tests/test_base.py::test_map_slice_by_idx[0.1-10.0-hpx-skydir2-axes2-]
FAILED gammapy/maps/tests/test_base.py::test_map_slice_by_idx[0.1-10.0-hpx-skydir3-axes3-s^2]
FAILED gammapy/maps/tests/test_base.py::test_map_meta_read_write[hpx] - numpy...
FAILED gammapy/maps/tests/test_hpxmap.py::test_plot - ValueError: negative di...
FAILED gammapy/maps/tests/test_hpxmap.py::test_plot_poly - ValueError: negati...
= 13 failed, 1043 passed, 447 skipped, 3 xfailed, 2 xpassed in 1096.63s (0:18:16) =
E: pybuild pybuild:353: test: plugin distutils failed with: exit code=1: cd /<<PKGBUILDDIR>>/.pybuild/cpython3_3.9_gammapy/build; python3.9 -m pytest 
dh_auto_test: error: pybuild --test --test-pytest -i python{version} -p 3.9 returned exit code 13
make: *** [debian/rules:9: build-arch] Error 25

Tail of log for ioapps on armhf:

dpkg-buildpackage
-----------------

dpkg-buildpackage: info: source package ioapps
dpkg-buildpackage: info: source version 1.4r2-3
dpkg-buildpackage: info: source distribution unstable
 dpkg-source --before-build .
dpkg-buildpackage: info: host architecture armhf
 fakeroot debian/rules clean
dh clean --with python2
dh: warning: Compatibility levels before 10 are deprecated (level 8 in use)
dh: error: unable to load addon python2: Can't locate Debian/Debhelper/Sequence/python2.pm in @INC (you may need to install the Debian::Debhelper::Sequence::python2 module) (@INC contains: /etc/perl /usr/local/lib/arm-linux-gnueabihf/perl/5.32.1 /usr/local/share/perl/5.32.1 /usr/lib/arm-linux-gnueabihf/perl5/5.32 /usr/share/perl5 /usr/lib/arm-linux-gnueabihf/perl-base /usr/lib/arm-linux-gnueabihf/perl/5.32 /usr/share/perl/5.32 /usr/local/lib/site_perl) at (eval 10) line 1.
BEGIN failed--compilation aborted at (eval 10) line 1.

make: *** [debian/rules:14: clean] Error 25

Tail of log for kafs-client on armhf:

cc: error: unrecognized command-line option '-m32'; did you mean '-mbe32'?
make[2]: *** [Makefile:34: lib_cell_lookup.os] Error 1
make[2]: *** Waiting for unfinished jobs....
make[2]: *** [Makefile:34: lib_cellserv.os] Error 1
cc: error: unrecognized command-line option '-m32'; did you mean '-mbe32'?
cc: error: unrecognized command-line option '-m32'; did you mean '-mbe32'?
cc: error: unrecognized command-line option '-m32'; did you mean '-mbe32'?
make[2]: *** [Makefile:34: lib_dns_lookup.os] Error 1
cc: error: unrecognized command-line option '-m32'; did you mean '-mbe32'?
make[2]: *** [Makefile:34: lib_object.os] Error 1
make[2]: Leaving directory '/<<PKGBUILDDIR>>/src'
make[1]: *** [Makefile:43: all] Error 2
make[1]: Leaving directory '/<<PKGBUILDDIR>>'
dh_auto_build: error: make -j4 "INSTALL=install --strip-program=true" returned exit code 2
make: *** [debian/rules:8: binary-arch] Error 25

Tail of log for rust-kvm-ioctls on armhf:

    |                                                     ^^^^^^^^^^ types differ in mutability
    |
    = note: expected mutable reference `&mut [u8]`
                       found reference `&[u8]`

error: aborting due to 151 previous errors; 4 warnings emitted

Some errors have detailed explanations: E0308, E0412, E0422, E0425, E0432.
For more information about an error, try `rustc --explain E0308`.
error: could not compile `kvm-ioctls`.

Caused by:
  process didn't exit successfully: `CARGO=/usr/bin/cargo CARGO_CRATE_NAME=kvm_ioctls CARGO_MANIFEST_DIR=/<<PKGBUILDDIR>> CARGO_PKG_AUTHORS='Amazon Firecracker Team <firecracker-maintainers@amazon.com>' CARGO_PKG_DESCRIPTION='Safe wrappers over KVM ioctls' CARGO_PKG_HOMEPAGE='' CARGO_PKG_LICENSE='Apache-2.0 OR MIT' CARGO_PKG_LICENSE_FILE='' CARGO_PKG_NAME=kvm-ioctls CARGO_PKG_REPOSITORY='https://github.com/rust-vmm/kvm-ioctls' CARGO_PKG_VERSION=0.2.0 CARGO_PKG_VERSION_MAJOR=0 CARGO_PKG_VERSION_MINOR=2 CARGO_PKG_VERSION_PATCH=0 CARGO_PKG_VERSION_PRE='' LD_LIBRARY_PATH='/<<PKGBUILDDIR>>/target/debug/deps:/usr/lib' rustc --crate-name kvm_ioctls src/lib.rs --error-format=json --json=diagnostic-rendered-ansi --crate-type lib --emit=dep-info,metadata,link -Cembed-bitcode=no -C debuginfo=2 -C metadata=ef1b70ca543ca83e -C extra-filename=-ef1b70ca543ca83e --out-dir /<<PKGBUILDDIR>>/target/arm-unknown-linux-gnueabihf/debug/deps --target arm-unknown-linux-gnueabihf -C incremental=/<<PKGBUILDDIR>>/target/arm-unknown-linux-gnueabihf/debug/incremental -L dependency=/<<PKGBUILDDIR>>/target/arm-unknown-linux-gnueabihf/debug/deps -L dependency=/<<PKGBUILDDIR>>/target/debug/deps --extern kvm_bindings=/<<PKGBUILDDIR>>/target/arm-unknown-linux-gnueabihf/debug/deps/libkvm_bindings-b5fddbf1ed0c4e85.rmeta --extern libc=/<<PKGBUILDDIR>>/target/arm-unknown-linux-gnueabihf/debug/deps/liblibc-7ac701aa45c57138.rmeta -C debuginfo=2 --cap-lints warn -C linker=arm-linux-gnueabihf-gcc -C link-arg=-Wl,-z,relro --remap-path-prefix /<<PKGBUILDDIR>>=/usr/share/cargo/registry/kvm-ioctls-0.2.0` (exit code: 1)
dh_auto_test: error: /usr/share/cargo/bin/cargo build returned exit code 101
make: *** [debian/rules:3: build-arch] Error 25

Tail of log for slang-slirp on armhf:

checking for dlfcn.h... yes
checking for dlopen in -ldl... yes
checking for g++... g++
checking whether we are using the GNU C++ compiler... yes
checking whether g++ accepts -g... yes
checking for gfortran... gfortran
checking whether we are using the GNU Fortran compiler... yes
checking whether gfortran accepts -g... yes
checking how to get verbose linking output from gfortran... -v
checking for Fortran libraries of gfortran...  -L/usr/lib/gcc/arm-linux-gnueabihf/10 -L/usr/lib/gcc/arm-linux-gnueabihf/10/../../../arm-linux-gnueabihf -L/usr/lib/gcc/arm-linux-gnueabihf/10/../../.. -L/lib/arm-linux-gnueabihf -L/usr/lib/arm-linux-gnueabihf -lgfortran -lm
checking for dummy main to link with Fortran libraries... none
checking for Fortran name-mangling scheme... lower case, underscore, no extra underscore
checking for the slang library and header files ... no
configure: error: unable to find the slang library and header file slang.h
make: *** [/usr/share/cdbs/1/class/autotools.mk:46: debian/stamp-autotools] Error 1

Tail of log for wmmail on armhf:

/usr/bin/make
make[1]: Entering directory '/<<PKGBUILDDIR>>'
Making all in src
make[2]: Entering directory '/<<PKGBUILDDIR>>/src'
gcc -DPACKAGE=\"WMMail\" -DVERSION=\"0.64\" -DHAVE_LIBNSL=1 -DHAVE_LIBX11=1 -DHAVE_LIBXEXT=1 -DHAVE_LIBXT=1 -DHAVE_LIBXPM=1 -DHAVE_LIBWUTIL=1 -DSTDC_HEADERS=1 -DHAVE_LIMITS_H=1 -DHAVE_STRINGS_H=1 -DHAVE_UNISTD_H=1 -DRETSIGTYPE=int -DHAVE_VPRINTF=1 -DHAVE_SOCKET=1 -DHAVE_STRSTR=1  -I. -I.      -g -O2 -I  -c global.c
In file included from global.c:27:
wmmail.h:32:10: fatal error: WINGs/proplist-compat.h: No such file or directory
   32 | #include <WINGs/proplist-compat.h>
      |          ^~~~~~~~~~~~~~~~~~~~~~~~~
compilation terminated.
make[2]: *** [Makefile:247: global.o] Error 1
make[2]: Leaving directory '/<<PKGBUILDDIR>>/src'
make[1]: *** [Makefile:125: all-recursive] Error 1
make[1]: Leaving directory '/<<PKGBUILDDIR>>'
make: *** [debian/rules:17: build-stamp] Error 2

Tail of log for nextpnr on armhf:

In file included from /<<PKGBUILDDIR>>/debian/build/ice40-qt/generated/gui/ice40/gui_ice40_autogen/4RVOBD3RJM/moc_ImGuiRenderer.cpp:10,
                 from /<<PKGBUILDDIR>>/debian/build/ice40-qt/generated/gui/ice40/gui_ice40_autogen/mocs_compilation.cpp:2:
/<<PKGBUILDDIR>>/debian/build/ice40-qt/generated/gui/ice40/gui_ice40_autogen/4RVOBD3RJM/../../../../../../../../3rdparty/qtimgui/ImGuiRenderer.h:57:5: error: 'QOpenGLFunctions_3_2_Core' does not name a type; did you mean 'QOpenGLFunctionsPrivate'?
   57 |     QOpenGLFunctions_3_2_Core *g_fun = nullptr;
      |     ^~~~~~~~~~~~~~~~~~~~~~~~~
      |     QOpenGLFunctionsPrivate
make[4]: *** [generated/gui/ice40/CMakeFiles/gui_ice40.dir/build.make:125: generated/gui/ice40/CMakeFiles/gui_ice40.dir/gui_ice40_autogen/mocs_compilation.cpp.o] Error 1
make[4]: Leaving directory '/<<PKGBUILDDIR>>/debian/build/ice40-qt'
make[3]: *** [CMakeFiles/Makefile2:500: generated/gui/ice40/CMakeFiles/gui_ice40.dir/all] Error 2
make[3]: Leaving directory '/<<PKGBUILDDIR>>/debian/build/ice40-qt'
make[2]: *** [Makefile:160: all] Error 2
make[2]: Leaving directory '/<<PKGBUILDDIR>>/debian/build/ice40-qt'
make[1]: *** [debian/rules:76: build-ice40-qt] Error 2
make[1]: Leaving directory '/<<PKGBUILDDIR>>'
make: *** [debian/rules:21: binary-arch] Error 2