Raspbian Package Auto-Building

Buildd status for selected packages (bullseye-staging)

Bugs

Package(s): Suite:
Compact mode Co-maintainers

Package armhf
Buildd exposure stats
✔ fermi-liteInstalled
✔ wrkInstalled
✔ libaioInstalled
✔ goxelInstalled
✔ siridb-serverInstalled
✔ libibcmBuild-Attempted
✔ audacious-analog-vumeter-pluginBuild-Attempted
✔ cycloneddsBuild-Attempted
✔ highwayhashInstalled
✔ icu-extBuild-Attempted
✔ libmath-int128-perlBuild-Attempted
✔ libnunc-stansBuild-Attempted
✔ mesBuild-Attempted
✔ open-axiomBuild-Attempted
✔ patatBuild-Attempted
✔ qtjsbackend-opensource-srcBuild-Attempted
✔ rust-generatorBuild-Attempted
✔ tarantoolBuild-Attempted
✔ pyfftwBuild-Attempted
Package armhf
Buildd exposure stats
✔ crowdsecInstalled
✔ libdnfBuild-Attempted

Tail of log for libibcm on armhf:

#define HAVE_STRING_H 1
#define HAVE_MEMORY_H 1
#define HAVE_STRINGS_H 1
#define HAVE_INTTYPES_H 1
#define HAVE_STDINT_H 1
#define HAVE_UNISTD_H 1
#define HAVE_DLFCN_H 1
#define LT_OBJDIR ".libs/"
#define SIZEOF_LONG 4
#define HAVE_LIBIBVERBS 1
#define STDC_HEADERS 1

configure: exit 1
dh_auto_configure: error: ./configure --build=arm-linux-gnueabihf --prefix=/usr --includedir=\${prefix}/include --mandir=\${prefix}/share/man --infodir=\${prefix}/share/info --sysconfdir=/etc --localstatedir=/var --disable-option-checking --disable-silent-rules --libdir=\${prefix}/lib/arm-linux-gnueabihf --libexecdir=\${prefix}/lib/arm-linux-gnueabihf --disable-maintainer-mode --disable-dependency-tracking returned exit code 1
make: *** [debian/rules:7: build-arch] Error 25

Tail of log for audacious-analog-vumeter-plugin on armhf:

make[3]: Entering directory '/<<PKGBUILDDIR>>/src'
/bin/bash ../libtool --tag=CC   --mode=compile gcc -DHAVE_CONFIG_H -I. -I..    -Wall -ggdb  -g -O2 -DSKINDIR=\"/usr/share/audacious\" -g -O2 -c -o plugin_main.lo plugin_main.c
libtool: compile:  gcc -DHAVE_CONFIG_H -I. -I.. -Wall -ggdb -g -O2 -DSKINDIR=\"/usr/share/audacious\" -g -O2 -c plugin_main.c  -fPIC -DPIC -o .libs/plugin_main.o
plugin_main.c:1:10: fatal error: gtk/gtk.h: No such file or directory
    1 | #include <gtk/gtk.h>
      |          ^~~~~~~~~~~
compilation terminated.
make[3]: *** [Makefile:321: plugin_main.lo] Error 1
make[3]: Leaving directory '/<<PKGBUILDDIR>>/src'
make[2]: *** [Makefile:365: all-recursive] Error 1
make[2]: Leaving directory '/<<PKGBUILDDIR>>'
make[1]: *** [Makefile:254: all] Error 2
make[1]: Leaving directory '/<<PKGBUILDDIR>>'
dh_auto_build: error: make -j1 returned exit code 2
make: *** [debian/rules:8: build-arch] Error 25

Tail of log for cyclonedds on armhf:

--- debian/libddsc0.symbols (libddsc0_0.7.0-7_armhf)
+++ dpkg-gensymbolsIOQAoL	2021-05-08 20:32:32.561307267 +0000
@@ -768,7 +768,7 @@
  ddsrt_atomic_cas32@Base 0.7.0
  ddsrt_atomic_cas64@Base 0.7.0
  ddsrt_atomic_casptr@Base 0.7.0
- (arch=i386 armhf)ddsrt_atomic_casvoidp2@Base 0.7.0
+#MISSING: 0.7.0-7# (arch=i386 armhf)ddsrt_atomic_casvoidp2@Base 0.7.0
  ddsrt_atomic_casvoidp@Base 0.7.0
  ddsrt_atomic_dec32@Base 0.7.0
  ddsrt_atomic_dec32_nv@Base 0.7.0
dh_makeshlibs: error: failing due to earlier errors
make[1]: *** [debian/rules:58: override_dh_makeshlibs] Error 25
make[1]: Leaving directory '/<<PKGBUILDDIR>>'
make: *** [debian/rules:16: binary-arch] Error 2

Tail of log for icu-ext on armhf:

-   0 |  
- 200 | you
-   0 |  
- 200 | like
-   0 |  
- 200 | O'Reilly
-   0 |  
- 200 | books
-   0 | ?
-(10 rows)
-
+ERROR:  encoding "SQL_ASCII" not supported by ICU
### End 13 installcheck (FAILED with exit code 1) ###
dh_pgxs_test: error: pg_buildext installcheck . . postgresql-%v-icu-ext returned exit code 1
make: *** [debian/rules:9: binary-arch] Error 25

Tail of log for libmath-int128-perl on armhf:

Checking for strings.h... yes
Checking for inttypes.h... yes
Checking for stdint.h... yes
Checking for unistd.h... yes
Checking for uint64_t... yes
Checking for __int128... no
Checking for uint64_t... (cached) yes
Checking for int __attribute__ ((__mode__ (TI)))... 
  It looks like your compiler doesn't support a 128-bit integer type (one of
  "int __attribute__ ((__mode__ (TI)))" or "__int128"). One of these types is
  necessary to compile the Math::Int128 module.

no
dh_auto_configure: error: perl Makefile.PL INSTALLDIRS=vendor "OPTIMIZE=-g -O2 -ffile-prefix-map=/<<PKGBUILDDIR>>=. -fstack-protector-strong -Wformat -Werror=format-security -Wdate-time -D_FORTIFY_SOURCE=2" "LD=arm-linux-gnueabihf-gcc -g -O2 -ffile-prefix-map=/<<PKGBUILDDIR>>=. -fstack-protector-strong -Wformat -Werror=format-security -Wl,-z,relro -Wl,-z,now" returned exit code 1
make: *** [debian/rules:6: build-arch] Error 25

Tail of log for libnunc-stans on armhf:

mkdir -p bin
mkdir -p obj
gcc -MM -std=c99 -I"src" -I"inc" src/abstraction/abstraction_dcas.c >obj/abstraction_dcas.d
gcc -g -O2 -ffile-prefix-map=/<<PKGBUILDDIR>>=. -fstack-protector-strong -Wformat -Werror=format-security  -c -fpic -Wno-unknown-pragmas -std=c99 -I"src" -I"inc"  -o obj/abstraction_dcas.o src/abstraction/abstraction_dcas.c
/tmp/ccSIsQgA.s: Assembler messages:
/tmp/ccSIsQgA.s:74: Error: selected processor does not support `ldrexd r6,r7,[r0]' in ARM mode
/tmp/ccSIsQgA.s:74: Error: selected processor does not support `strexd lr,r2,r3,[r0]' in ARM mode
make[3]: *** [makefile.linux:79: obj/abstraction_dcas.o] Error 1
make[3]: Leaving directory '/<<PKGBUILDDIR>>/liblfds'
make[2]: *** [Makefile:921: all-recursive] Error 1
make[2]: Leaving directory '/<<PKGBUILDDIR>>'
make[1]: *** [Makefile:646: all] Error 2
make[1]: Leaving directory '/<<PKGBUILDDIR>>'
dh_auto_build: error: make -j1 returned exit code 2
make: *** [debian/rules:21: build-arch] Error 25

Tail of log for mes on armhf:

+ trace 'CCLD       lib/linux/arm-mes-gcc/exit-42.S' /usr/bin/gcc -nostdlib -g lib/linux/arm-mes-gcc/exit-42.S -o exit-42
+ shift
+ echo /usr/bin/gcc -nostdlib -g lib/linux/arm-mes-gcc/exit-42.S -o exit-42
+ eval /usr/bin/gcc -nostdlib -g lib/linux/arm-mes-gcc/exit-42.S -o exit-42
++ /usr/bin/gcc -nostdlib -g lib/linux/arm-mes-gcc/exit-42.S -o exit-42
gcc: error: lib/linux/arm-mes-gcc/exit-42.S: No such file or directory
gcc: fatal error: no input files
compilation terminated.
make[2]: *** [GNUmakefile:95: build] Error 1
make[2]: *** Waiting for unfinished jobs....
make[2]: Leaving directory '/<<PKGBUILDDIR>>'
dh_auto_build: error: make -j4 V=2 returned exit code 2
make[1]: *** [debian/rules:23: override_dh_auto_build] Error 25
make[1]: Leaving directory '/<<PKGBUILDDIR>>'
make: *** [debian/rules:17: binary-arch] Error 2

Tail of log for open-axiom on armhf:

/* confdefs.h */
#define PACKAGE_NAME "OpenAxiom"
#define PACKAGE_TARNAME "openaxiom"
#define PACKAGE_VERSION "1.5.0-2013-06-21"
#define PACKAGE_STRING "OpenAxiom 1.5.0-2013-06-21"
#define PACKAGE_BUGREPORT "open-axiom-bugs@lists.sf.net"
#define PACKAGE_URL ""
#define PACKAGE "openaxiom"
#define VERSION "1.5.0-2013-06-21"
#define OPENAXIOM_BASE_RTS Runtime::sbcl

configure: exit 1
dh_auto_configure: error: cd build-tree && ../configure --build=arm-linux-gnueabihf --prefix=/usr --includedir=\${prefix}/include --mandir=\${prefix}/share/man --infodir=\${prefix}/share/info --sysconfdir=/etc --localstatedir=/var --disable-option-checking --disable-silent-rules --libexecdir=\${prefix}/lib/open-axiom --disable-maintainer-mode --disable-dependency-tracking --with-lisp=sbcl --with-x --disable-gcl returned exit code 1
make: *** [debian/rules:50: configure-stamp] Error 25

Tail of log for patat on armhf:

patat:   -Mgrace=<n>
patat:             The amount of allocation after the program receives a
patat:             HeapOverflow exception before the exception is thrown again, if
patat:             the program is still exceeding the heap limit.
patat: 
patat: RTS options may also be specified using the GHCRTS environment variable.
patat: 
patat: Other RTS options may be available for programs compiled a different way.
patat: The GHC User's Guide has full details.
patat: 
make[2]: *** [Makefile:80: extra/patat.bash-completion] Error 1
make[2]: Leaving directory '/<<PKGBUILDDIR>>'
make[1]: *** [debian/rules:23: override_dh_auto_build] Error 2
make[1]: Leaving directory '/<<PKGBUILDDIR>>'
make: *** [debian/rules:12: build-arch] Error 2

Tail of log for qtjsbackend-opensource-src on armhf:

../3rdparty/v8/src/objects.h:7486:36: error: left operand of shift expression '(-8 << 26)' is negative [-fpermissive]
 7486 |       (~kMaxCachedArrayIndexLength << kArrayIndexHashLengthShift) |
      |       ~~~~~~~~~~~~~~~~~~~~~~~~~~~~~^~~~~~~~~~~~~~~~~~~~~~~~~~~~~~
make[3]: *** [Makefile:924: .obj/accessors.o] Error 1
make[3]: *** Waiting for unfinished jobs....
make[3]: *** [Makefile:1362: .obj/ast.o] Error 1
make[3]: *** [Makefile:1244: .obj/assembler.o] Error 1
make[3]: *** [Makefile:1097: .obj/api.o] Error 1
make[3]: Leaving directory '/<<PKGBUILDDIR>>/src/v8'
make[2]: *** [Makefile:91: sub-v8-make_first-ordered] Error 2
make[2]: Leaving directory '/<<PKGBUILDDIR>>/src'
make[1]: *** [Makefile:48: sub-src-make_first] Error 2
make[1]: Leaving directory '/<<PKGBUILDDIR>>'
dh_auto_build: error: make -j4 returned exit code 2
make: *** [debian/rules:14: build-arch] Error 25

Tail of log for rust-generator on armhf:

  thread 'main' panicked at 'Unsupported architecture: arm-unknown-linux-gnueabihf', build.rs:30:13
  stack backtrace:
     0: rust_begin_unwind
               at /usr/src/rustc-1.48.0/library/std/src/panicking.rs:483
     1: std::panicking::begin_panic_fmt
               at /usr/src/rustc-1.48.0/library/std/src/panicking.rs:437
     2: build_script_build::main
               at ./build.rs:30
     3: core::ops::function::FnOnce::call_once
               at /usr/src/rustc-1.48.0/library/core/src/ops/function.rs:227
  note: Some details are omitted, run with `RUST_BACKTRACE=full` for a verbose backtrace.
dh_auto_test: error: /usr/share/cargo/bin/cargo test --all returned exit code 101
make[1]: *** [debian/rules:6: override_dh_auto_test] Error 25
make[1]: Leaving directory '/<<PKGBUILDDIR>>'
make: *** [debian/rules:3: build-arch] Error 2

Tail of log for tarantool on armhf:

      |    ^~~~~
/<<PKGBUILDDIR>>/third_party/coro/coro.c:480:14: error: 'NUM_SAVED' undeclared (first use in this function)
  480 |   ctx->sp -= NUM_SAVED;
      |              ^~~~~~~~~
/<<PKGBUILDDIR>>/third_party/coro/coro.c:480:14: note: each undeclared identifier is reported only once for each function it appears in
/<<PKGBUILDDIR>>/third_party/coro/coro.c:494:4: error: #error unsupported architecture
  494 |   #error unsupported architecture
      |    ^~~~~
make[3]: *** [CMakeFiles/coro.dir/build.make:85: CMakeFiles/coro.dir/third_party/coro/coro.c.o] Error 1
make[3]: Leaving directory '/<<PKGBUILDDIR>>/obj-arm-linux-gnueabihf'
make[2]: *** [CMakeFiles/Makefile2:1367: CMakeFiles/coro.dir/all] Error 2
make[2]: Leaving directory '/<<PKGBUILDDIR>>/obj-arm-linux-gnueabihf'
make[1]: *** [Makefile:174: all] Error 2
make[1]: Leaving directory '/<<PKGBUILDDIR>>/obj-arm-linux-gnueabihf'
make: *** [/usr/share/cdbs/1/class/makefile.mk:77: debian/stamp-makefile-build] Error 2

Tail of log for pyfftw on armhf:

One run: 32.30 ms (versus 64.96 ms for singled threaded)
One run: 31.93 ms (versus 64.74 ms for singled threaded)
One run: 70.72 ms (versus 89.42 ms for numpy.fft)
One run: 70.77 ms (versus 89.48 ms for numpy.fft)
One run: 28.37 ms (versus 114.13 ms for numpy.fft)
One run: 28.34 ms (versus 114.12 ms for numpy.fft)
One run: 70.88 ms (versus 67.02 ms for numpy.fft)
One run: 70.47 ms (versus 67.04 ms for numpy.fft)
One run: 35.61 ms (versus 82.03 ms for numpy.fft)
One run: 35.79 ms (versus 84.06 ms for numpy.fft)
E: pybuild pybuild:353: test: plugin distutils failed with: exit code=1: cd /<<PKGBUILDDIR>>/.pybuild/cpython3_3.9_pyfftw/build; python3.9 -m unittest discover -v 
dh_auto_test: error: pybuild --test -i python{version} -p 3.9 returned exit code 13
make[1]: *** [debian/rules:35: override_dh_auto_test] Error 1
make[1]: Leaving directory '/<<PKGBUILDDIR>>'
make: *** [debian/rules:14: build-arch] Error 2

Tail of log for libdnf on armhf:

4/4 Test #1: test_cpp .........................   Passed    3.13 sec

75% tests passed, 1 tests failed out of 4

Total Test time (real) =   3.14 sec

The following tests FAILED:
	  3 - test_libdnf_main (Child aborted)
Errors while running CTest
make[2]: *** [Makefile:152: test] Error 8
make[2]: Leaving directory '/<<PKGBUILDDIR>>/build'
dh_auto_test: error: cd build && make -j4 test ARGS=-V ARGS\+=-j4 returned exit code 2
make[1]: *** [debian/rules:48: override_dh_auto_test] Error 25
make[1]: Leaving directory '/<<PKGBUILDDIR>>'
make: *** [debian/rules:11: build-arch] Error 2