Raspbian Package Auto-Building

Buildd status for febootstrap (bookworm-staging)

Debian PTSTrackerChangelogBugspackages.d.obuildd.d.o

Package(s): Suite:
Compact mode Co-maintainers

Buildd exposure stats armhf  3.17-1Build-Attempted29d 17h 32mmb-lxc-02uncompiledadmin:sourceold | all (3)

Tail of log for febootstrap on armhf:

File "febootstrap_utils.ml", line 85, characters 42-46:
85 |   really_input chan data 0 (String.length data);
Error: This expression has type bytes but an expression was expected of type
make[4]: *** [Makefile:1275: febootstrap_utils.cmx] Error 2
make[4]: Leaving directory '/<<PKGBUILDDIR>>/src'
make[3]: *** [Makefile:1058: all-recursive] Error 1
make[3]: Leaving directory '/<<PKGBUILDDIR>>'
make[2]: *** [Makefile:996: all] Error 2
make[2]: Leaving directory '/<<PKGBUILDDIR>>'
dh_auto_build: error: make -j1 returned exit code 2
make[1]: *** [debian/rules:8: override_dh_auto_build] Error 25
make[1]: Leaving directory '/<<PKGBUILDDIR>>'
make: *** [debian/rules:11: build-arch] Error 2