Raspbian Package Auto-Building

Buildd status for fakechroot (bookworm-staging)

Debian PTSTrackerChangelogBugspackages.d.obuildd.d.o

Package(s): Suite:
Compact mode Co-maintainers

ArchitectureVersionStatusForBuilddStateMiscLogs
Buildd exposure stats armhf  2.19-3.5Build-Attempted30d 22h 24mmb-lxc-02out-of-dateutils:sourceold | all (2)

Tail of log for fakechroot on armhf:

Test Summary Report
-------------------
t/fts.t                   (Wstat: 256 Tests: 40 Failed: 2)
  Failed tests:  39-40
  Non-zero exit status: 1
Files=35, Tests=856, 22 wallclock secs ( 0.46 usr  0.08 sys + 30.94 cusr 21.16 csys = 52.64 CPU)
Result: FAIL
make[3]: *** [Makefile:1326: prove] Error 1
make[3]: Leaving directory '/<<PKGBUILDDIR>>/test'
make[2]: *** [Makefile:1329: test] Error 2
make[2]: Leaving directory '/<<PKGBUILDDIR>>/test'
make[1]: *** [Makefile:866: test] Error 2
make[1]: Leaving directory '/<<PKGBUILDDIR>>'
dh_auto_test: error: make -j4 test VERBOSE=1 returned exit code 2
make: *** [debian/rules:11: build-arch] Error 25