Raspbian Package Auto-Building

Buildd status for dulwich (bookworm-staging)

Debian PTSTrackerChangelogBugspackages.d.obuildd.d.o

Package(s): Suite:
Compact mode Co-maintainers

ArchitectureVersionStatusForBuilddStateMiscLogs
Buildd exposure stats armhf  0.20.25-1Build-Attempted63d 7h 28mbm-wb-01out-of-datepython:sourceold | all (3)

Tail of log for dulwich on armhf:

  File "/usr/lib/python3.9/shutil.py", line 684, in _rmtree_safe_fd
    onerror(os.unlink, fullname, sys.exc_info())
  File "/usr/lib/python3.9/shutil.py", line 682, in _rmtree_safe_fd
    os.unlink(entry.name, dir_fd=topfd)
FileNotFoundError: [Errno 2] No such file or directory: 'S.gpg-agent.ssh'

----------------------------------------------------------------------
Ran 1411 tests in 349.073s

FAILED (errors=4, skipped=77, expected failures=1)
make[2]: *** [Makefile:27: check] Error 1
make[2]: Leaving directory '/<<PKGBUILDDIR>>'
make[1]: *** [debian/rules:11: override_dh_auto_test] Error 2
make[1]: Leaving directory '/<<PKGBUILDDIR>>'
make: *** [debian/rules:7: binary-arch] Error 2