Raspbian Package Auto-Building

Buildd status for davs2 (bookworm-staging)

Debian PTSTrackerChangelogBugspackages.d.obuildd.d.o

Package(s): Suite:
Compact mode Co-maintainers

ArchitectureVersionStatusForBuilddStateMiscLogs
Buildd exposure stats armhf  1.6-1Build-Attempted29d 4h 44mmb-lxc-02uncompiledmisc:extraold | all (3)

Tail of log for davs2 on armhf:

g++: error: common/arm/blockcopy8.o: No such file or directory
g++: error: common/arm/cpu-a.o: No such file or directory
g++: error: common/arm/dct-a.o: No such file or directory
g++: error: common/arm/ipfilter8.o: No such file or directory
g++: error: common/arm/mc-a.o: No such file or directory
g++: error: common/arm/pixel-util.o: No such file or directory
g++: error: common/arm/sad-a.o: No such file or directory
g++: error: common/arm/ssd-a.o: No such file or directory
make[1]: *** [Makefile:186: libdavs2.so.16] Error 1
make[1]: *** Waiting for unfinished jobs....
ar: common/arm/blockcopy8.o: No such file or directory
make[1]: *** [Makefile:181: libdavs2.a] Error 1
make[1]: Leaving directory '/<<PKGBUILDDIR>>/build/linux'
dh_auto_build: error: cd build/linux && make -j4 returned exit code 2
make: *** [debian/rules:9: binary-arch] Error 25