Raspbian Package Auto-Building

Buildd status for cvise (bookworm-staging)

Debian PTSTrackerChangelogBugspackages.d.obuildd.d.o

Package(s): Suite:
Compact mode Co-maintainers

ArchitectureVersionStatusForBuilddStateMiscLogs
Buildd exposure stats armhf  2.4.0-2Maybe-Failed64d 9h 47mbm-wb-03out-of-datemisc:extraold | all (1)

Tail of log for cvise on armhf:

      |        ^~~~~~~~~~~~~~~~~
Please submit a full bug report,
with preprocessed source if appropriate.
See <file:///usr/share/doc/gcc-10/README.Bugs> for instructions.
The bug is not reproducible, so it is likely a hardware or OS problem.
make[4]: *** [clang_delta/CMakeFiles/clang_delta.dir/build.make:135: clang_delta/CMakeFiles/clang_delta.dir/ClassTemplateToClass.cpp.o] Error 1
make[4]: Leaving directory '/<<PKGBUILDDIR>>/obj-arm-linux-gnueabihf'
make[3]: *** [CMakeFiles/Makefile2:265: clang_delta/CMakeFiles/clang_delta.dir/all] Error 2
make[3]: Leaving directory '/<<PKGBUILDDIR>>/obj-arm-linux-gnueabihf'
make[2]: *** [Makefile:149: all] Error 2
make[2]: Leaving directory '/<<PKGBUILDDIR>>/obj-arm-linux-gnueabihf'
dh_auto_build: error: cd obj-arm-linux-gnueabihf && make -j4 "INSTALL=install --strip-program=true" VERBOSE=1 returned exit code 2
make[1]: *** [debian/rules:24: override_dh_auto_build] Error 25
make[1]: Leaving directory '/<<PKGBUILDDIR>>'
make: *** [debian/rules:15: build-arch] Error 2