Raspbian Package Auto-Building

Buildd status for selected packages (stretch-staging)

Bugs

Package(s): Suite:
Compact mode Co-maintainers

Package armhf
Buildd exposure stats
✔ criuBuild-Attempted
✔ djbdnsBuild-Attempted
✔ eclipse-titanBuild-Attempted
✔ freefoamBuild-Attempted
✔ grpcBuild-Attempted
✔ haskell-cryptolBuild-Attempted
✔ haskell-type-levelBuild-Attempted
✔ intel-processor-traceBuild-Attempted
✔ ioappsBuild-Attempted
✔ jocamlBuild-Attempted
✔ libmlx5Build-Attempted
✔ libnunc-stansBuild-Attempted
✔ libtangoBuild-Attempted
✔ listallerBuild-Attempted
✔ mensisBuild-Attempted
✔ ne10Build-Attempted
✔ nsd3Build-Attempted
✔ numactlBuild-Attempted
✔ open-axiomBuild-Attempted
Package armhf
Buildd exposure stats
✔ openmpi1.6Build-Attempted
✔ orpieBuild-Attempted
✔ osrmBuild-Attempted
✔ pgloaderBuild-Attempted
✔ poclBuild-Attempted
✔ pyside-mobilityBuild-Attempted
✔ qtjsbackend-opensource-srcBuild-Attempted
✔ qutecsoundBuild-Attempted
✔ rt-appBuild-Attempted
✔ ruby2.1Build-Attempted
✔ sortmernaBuild-Attempted
✔ tlsdateBuild-Attempted
✔ varnish-agentBuild-Attempted
✔ wiredtigerBuild-Attempted
✔ xf86-video-msmBuild-Attempted
✔ yp-toolsBuild-Attempted
✔ 3dldfBuild-Attempted
✔ slic3r-prusaBuild-Attempted
✔ sflphoneBuild-Attempted
✔ firefoxBuild-Attempted
Package armhf
Buildd exposure stats
✔ libsis-jhdf5-javaBuild-Attempted
✘ openjfx  Build-Attempted
✘ liquidsoap  Build-Attempted
✘ libzstd  Build-Attempted
✘ percona-xtrabackup  Build-Attempted

Tail of log for criu on armhf:

  ^~~~~
arch/arm/include/asm/atomic.h: In function 'atomic_add_return':
arch/arm/include/asm/atomic.h:81:2: error: implicit declaration of function 'smp_mb' [-Werror=implicit-function-declaration]
  smp_mb();
  ^~~~~~
cc1: all warnings being treated as errors
scripts/Makefile.build:184: recipe for target 'arch/arm/crtools.o' failed
make[2]: *** [arch/arm/crtools.o] Error 1
make[2]: Leaving directory '/<<PKGBUILDDIR>>'
Makefile:208: recipe for target 'arch/arm' failed
make[1]: *** [arch/arm] Error 2
make[1]: Leaving directory '/<<PKGBUILDDIR>>'
dh_auto_build: make -j4 returned exit code 2
debian/rules:6: recipe for target 'build-arch' failed
make: *** [build-arch] Error 2

Tail of log for djbdns on armhf:

 dpkg-source --before-build djbdns-1.05
dpkg-buildpackage: info: host architecture armhf
 fakeroot debian/rules clean
rm -f `cat TARGETS`
for i in dbndns/*; do test -d $i || rm -f $i; done
test ! -e patch-stamp || \
  for i in `ls -1r debian/diff/*.diff || :`; do patch -p1 -R <$i; done
rm -f configure-stamp patch-stamp build-stamp \
  dbndns/patch-stamp dbndns/build-stamp
rm -rf '/<<PKGBUILDDIR>>/debian/djbdns' '/<<PKGBUILDDIR>>/debian/dbndns' '/<<PKGBUILDDIR>>/debian/dnscache-run'
rm -f debian/files debian/substvars changelog
test ! -r conf-home'{orig}' || mv -f conf-home'{orig}' conf-home
test ! -r conf-cc'{orig}' || mv conf-cc'{orig}' conf-cc
 debian/rules build-arch
make: *** No rule to make target 'build-arch'.  Stop.

Tail of log for eclipse-titan on armhf:

Binary file (standard input) matches

Tail of log for freefoam on armhf:

collect2: error: ld returned 1 exit status
CMakeFiles/cmTC_a5d68.dir/build.make:97: recipe for target 'cmTC_a5d68' failed
make[3]: *** [cmTC_a5d68] Error 1
make[3]: Leaving directory '/<<BUILDDIR>>/freefoam-0.1.0+dfsg+1/obj-arm-linux-gnueabihf/CMakeFiles/CMakeTmp'
Makefile:126: recipe for target 'cmTC_a5d68/fast' failed
make[2]: *** [cmTC_a5d68/fast] Error 2
make[2]: Leaving directory '/<<BUILDDIR>>/freefoam-0.1.0+dfsg+1/obj-arm-linux-gnueabihf/CMakeFiles/CMakeTmp'


dh_auto_configure: cmake .. -DCMAKE_INSTALL_PREFIX=/usr -DCMAKE_VERBOSE_MAKEFILE=ON -DCMAKE_BUILD_TYPE=None -DCMAKE_INSTALL_SYSCONFDIR=/etc -DCMAKE_INSTALL_LOCALSTATEDIR=/var -DFOAM_EXE_PREFIX=freefoam- -DFOAM_ENABLE_METIS=OFF -DFOAM_ENABLE_MGRIDGEN=OFF -DFOAM_USE_MPI=ON -DFOAM_DEFAULT_PSTREAM=mpi -DFOAM_DOUBLE_PRECISION=ON -DFOAM_ENABLE_PARMETIS=OFF -DCMAKE_SKIP_RPATH=OFF -DFOAM_ENABLE_CCMIO=OFF -DBUILD_TESTING=OFF -DFOAM_ENABLE_FULL_TUTORIAL_TEST=OFF -DFOAM_BUILD_PRIVATE_METIS=OFF -DFOAM_BUILD_PRIVATE_PARMETIS=OFF -DFOAM_BUILD_PRIVATE_SCOTCH=OFF -DFOAM_BUILD_PRIVATE_ZLIB=OFF -DFOAM_ENABLE_PDF_GUIDES=OFF -DFOAM_ENABLE_XHTML_GUIDES=OFF -DFOAM_ENABLE_XHTML_HELP=OFF -DFOAM_ENABLE_MATHJAX=OFF -DFOAM_ENABLE_MANPAGE_HELP=OFF -DFOAM_DOCS_FOR_SF=OFF -DFOAM_INSTALL_BIN_PATH=/usr/bin -DFOAM_INSTALL_CMAKE_PATH=/usr/share/freefoam/CMake -DFOAM_INSTALL_CONFIG_PATH=/etc/freefoam -DFOAM_INSTALL_DATA_PATH=/usr/share/freefoam -DFOAM_INSTALL_DOC_PATH=/usr/share/doc/freefoam -DFOAM_INSTALL_HEADER_PATH=/usr/include/freefoam -DFOAM_INSTALL_LIBEXEC_PATH=/usr/bin -DFOAM_INSTALL_LIBRARY_PATH=/usr/lib/freefoam -DFOAM_INSTALL_MAN_PATH=/usr/share/man -DFOAM_INSTALL_PLUGIN_PATH=/usr/lib/freefoam/plugins1 -DFOAM_INSTALL_TUTORIALS_PATH=/usr/share/doc/freefoam -DFOAM_INSTALL_USERDFOAM_PATH=/usr/lib/freefoam/plugins1/ensightReader -DFOAM_ENABLE_DOXYGEN_DOCS=OFF returned exit code 1
debian/rules:68: recipe for target 'override_dh_auto_configure' failed
make[1]: *** [override_dh_auto_configure] Error 255
make[1]: Leaving directory '/<<BUILDDIR>>/freefoam-0.1.0+dfsg+1'
debian/rules:3: recipe for target 'build-arch' failed
make: *** [build-arch] Error 2

Tail of log for grpc on armhf:

[C]       Compiling src/core/security/google_default_credentials.c
[C]       Compiling src/core/security/json_token.c
[C]       Compiling src/core/security/jwt_verifier.c
src/core/security/jwt_verifier.c: In function 'pkey_from_jwk':
src/core/security/jwt_verifier.c:464:10: error: dereferencing pointer to incomplete type 'RSA {aka struct rsa_st}'
       rsa->n = bignum_from_base64(validate_string_field(key_prop, "n"));
          ^~
Makefile:3631: recipe for target '/<<PKGBUILDDIR>>/objs/opt/src/core/security/jwt_verifier.o' failed
make[2]: *** [/<<PKGBUILDDIR>>/objs/opt/src/core/security/jwt_verifier.o] Error 1
make[2]: Leaving directory '/<<PKGBUILDDIR>>'
debian/rules:18: recipe for target 'override_dh_auto_build' failed
make[1]: *** [override_dh_auto_build] Error 2
make[1]: Leaving directory '/<<PKGBUILDDIR>>'
debian/rules:29: recipe for target 'build-arch' failed
make: *** [build-arch] Error 2

Tail of log for haskell-cryptol on armhf:

No uhc found
touch configure-ghc-stamp
. /usr/share/haskell-devscripts/Dh_Haskell.sh && \
build_recipe
Running debian/hlibrary.setup build --builddir=dist-ghc
Building cryptol-2.4.0...
Preprocessing library cryptol-2.4.0...

src/Cryptol/Eval/Arch.hs:25:2: error:
     error: #error unknown max width for gmp on this architecture
     #error unknown max width for gmp on this architecture
      ^~~~~
`gcc' failed in phase `C pre-processor'. (Exit code: 1)
/usr/share/cdbs/1/class/hlibrary.mk:147: recipe for target 'build-ghc-stamp' failed
make: *** [build-ghc-stamp] Error 1

Tail of log for haskell-type-level on armhf:

        The liberal coverage condition fails in class `Div'
          for functional dependency: `x z -> y'
        Reason: lhs types `x', `q' do not jointly determine rhs type `y'
        Un-determined variable: y
    * In the instance declaration for `Div x y q'

src/Data/TypeLevel/Num/Ops.hs:336:10: error:
    * Illegal instance declaration for `Div10 x q'
        The liberal coverage condition fails in class `Div10'
          for functional dependency: `q -> x'
        Reason: lhs type `q' does not determine rhs type `x'
        Un-determined variable: x
    * In the instance declaration for `Div10 x q'
/usr/share/cdbs/1/class/hlibrary.mk:147: recipe for target 'build-ghc-stamp' failed
make: *** [build-ghc-stamp] Error 1

Tail of log for intel-processor-trace on armhf:

                        ^~~~~~~~~
/<<PKGBUILDDIR>>/libipt/src/posix/pt_section_posix.c:114:24: note: each undeclared identifier is reported only once for each function it appears in
libipt/CMakeFiles/libipt.dir/build.make:593: recipe for target 'libipt/CMakeFiles/libipt.dir/src/posix/pt_section_posix.c.o' failed
make[3]: *** [libipt/CMakeFiles/libipt.dir/src/posix/pt_section_posix.c.o] Error 1
make[3]: Leaving directory '/<<PKGBUILDDIR>>/obj-arm-linux-gnueabihf'
CMakeFiles/Makefile2:88: recipe for target 'libipt/CMakeFiles/libipt.dir/all' failed
make[2]: *** [libipt/CMakeFiles/libipt.dir/all] Error 2
make[2]: Leaving directory '/<<PKGBUILDDIR>>/obj-arm-linux-gnueabihf'
Makefile:130: recipe for target 'all' failed
make[1]: *** [all] Error 2
make[1]: Leaving directory '/<<PKGBUILDDIR>>/obj-arm-linux-gnueabihf'
dh_auto_build: make -j1 returned exit code 2
	cd /<<PKGBUILDDIR>>
debian/rules:10: recipe for target 'build-arch' failed
make: *** [build-arch] Error 2

Tail of log for ioapps on armhf:

           ^~~~~~~~~~~~~~~
replicate.c:104:36: warning: 'last_call_orig' may be used uninitialized in this function [-Wmaybe-uninitialized]
      diff_orig = CALL_TIME(x##_it) - last_call_orig; \
                                    ^
replicate.c:1396:11: note: 'last_call_orig' was declared here
  uint64_t last_call_orig; ///< when was the last original call made
           ^~~~~~~~~~~~~~
Makefile:46: recipe for target 'replicate.o' failed
make[2]: *** [replicate.o] Error 1
make[2]: Leaving directory '/<<PKGBUILDDIR>>'
debian/rules:18: recipe for target 'override_dh_auto_build' failed
make[1]: *** [override_dh_auto_build] Error 2
make[1]: Leaving directory '/<<PKGBUILDDIR>>'
debian/rules:14: recipe for target 'build-arch' failed
make: *** [build-arch] Error 2

Tail of log for jocaml on armhf:

| 1 file changed, 5 insertions(+)
|
|diff --git a/tools/ocamlmklib.ml b/tools/ocamlmklib.ml
|index 23a273e..a5e0d34 100644
|--- a/tools/ocamlmklib.ml
|+++ b/tools/ocamlmklib.ml
--------------------------
No file to patch.  Skipping patch.
1 out of 1 hunk ignored
Patch debian/patches/0003-Don-t-use-rpath.patch does not apply (enforce with -f)
debian/rules:18: recipe for target 'override_dh_auto_configure' failed
make[1]: *** [override_dh_auto_configure] Error 1
make[1]: Leaving directory '/<<PKGBUILDDIR>>'
debian/rules:85: recipe for target 'build-arch' failed
make: *** [build-arch] Error 2

Tail of log for libmlx5 on armhf:

Makefile:556: recipe for target 'buf.lo' failed
make[2]: *** [buf.lo] Error 1
cc1: all warnings being treated as errors
Makefile:577: recipe for target 'mlx5.lo' failed
make[2]: *** [mlx5.lo] Error 1
cc1: all warnings being treated as errors
Makefile:563: recipe for target 'cq.lo' failed
make[2]: *** [cq.lo] Error 1
make[2]: Leaving directory '/<<PKGBUILDDIR>>'
Makefile:381: recipe for target 'all' failed
make[1]: *** [all] Error 2
make[1]: Leaving directory '/<<PKGBUILDDIR>>'
dh_auto_build: make -j4 returned exit code 2
debian/rules:6: recipe for target 'build-arch' failed
make: *** [build-arch] Error 2

Tail of log for libnunc-stans on armhf:

/tmp/ccxx6j3c.s: Assembler messages:
/tmp/ccxx6j3c.s:54: Error: selected processor does not support `ldrexd r6,r7,[lr]' in ARM mode
/tmp/ccxx6j3c.s:54: Error: selected processor does not support `strexd r0,r2,r3,[lr]' in ARM mode
makefile.linux:76: recipe for target 'obj/abstraction_dcas.o' failed
make[3]: *** [obj/abstraction_dcas.o] Error 1
make[3]: Leaving directory '/<<PKGBUILDDIR>>/liblfds'
Makefile:921: recipe for target 'all-recursive' failed
make[2]: *** [all-recursive] Error 1
make[2]: Leaving directory '/<<PKGBUILDDIR>>'
Makefile:646: recipe for target 'all' failed
make[1]: *** [all] Error 2
make[1]: Leaving directory '/<<PKGBUILDDIR>>'
dh_auto_build: make -j1 returned exit code 2
debian/rules:21: recipe for target 'build-arch' failed
make: *** [build-arch] Error 2

Tail of log for libtango on armhf:

dpkg-buildpackage: info: host architecture armhf
 fakeroot debian/rules clean
QUILT_PATCHES=debian/patches \
	quilt --quiltrc /dev/null pop -a -R || test $? = 2
No patch removed
rm -rf .pc debian/stamp-patched
dh_testdir
dh_testroot
rm -rf stamps objs
find build -type d -name "objs-*" | xargs rm -rf
rm -f build-stamp-*
dh_clean
dh_clean: Compatibility levels before 9 are deprecated (level 7 in use)
 debian/rules build-arch
make: *** No rule to make target 'build-arch'.  Stop.

Tail of log for listaller on armhf:

cd /<<PKGBUILDDIR>>/obj-arm-linux-gnueabihf/src && /usr/bin/g-ir-compiler --shared-library=listaller-glib --includedir=. /<<PKGBUILDDIR>>/obj-arm-linux-gnueabihf/src/Listaller-0.5.gir -o /<<PKGBUILDDIR>>/obj-arm-linux-gnueabihf/src/Listaller-0.5.typelib
Could not find GIR file 'AppStream-0.7.gir'; check XDG_DATA_DIRS or use --includedir
error parsing file /<<PKGBUILDDIR>>/obj-arm-linux-gnueabihf/src/Listaller-0.5.gir: Failed to parse included gir AppStream-0.7
src/CMakeFiles/gir-compile.dir/build.make:60: recipe for target 'src/CMakeFiles/gir-compile' failed
make[3]: *** [src/CMakeFiles/gir-compile] Error 1
make[3]: Leaving directory '/<<PKGBUILDDIR>>/obj-arm-linux-gnueabihf'
CMakeFiles/Makefile2:194: recipe for target 'src/CMakeFiles/gir-compile.dir/all' failed
make[2]: *** [src/CMakeFiles/gir-compile.dir/all] Error 2
make[2]: Leaving directory '/<<PKGBUILDDIR>>/obj-arm-linux-gnueabihf'
Makefile:141: recipe for target 'all' failed
make[1]: *** [all] Error 2
make[1]: Leaving directory '/<<PKGBUILDDIR>>/obj-arm-linux-gnueabihf'
dh_auto_build: make -j1 returned exit code 2
debian/rules:15: recipe for target 'build-arch' failed
make: *** [build-arch] Error 2

Tail of log for mensis on armhf:

checking for IceConnectionNumber in -lICE... yes
checking for XOpenDevice in -lXi... no
checking for XkbQueryExtension in -lxkbui... no
checking for pthread_create in -lpthread... yes
checking for u_strcpy in -lgdraw... yes
checking fontforge/basics.h usability... no
checking fontforge/basics.h presence... no
checking for fontforge/basics.h... no
You must install the include files for fontforge
before building mensis.
debian/rules:29: recipe for target 'override_dh_auto_configure' failed
make[1]: *** [override_dh_auto_configure] Error 1
make[1]: Leaving directory '/<<PKGBUILDDIR>>'
debian/rules:22: recipe for target 'build-arch' failed
make: *** [build-arch] Error 2

Tail of log for ne10 on armhf:

/<<PKGBUILDDIR>>/modules/dsp/NE10_fft_int16.neonintrinsic.c:479:9: note: in expansion of macro 'RADIX8x4_LOAD'
         RADIX8x4_LOAD
         ^~~~~~~~~~~~~
modules/CMakeFiles/NE10.dir/build.make:473: recipe for target 'modules/CMakeFiles/NE10.dir/dsp/NE10_fft_int16.neonintrinsic.c.o' failed
make[3]: *** [modules/CMakeFiles/NE10.dir/dsp/NE10_fft_int16.neonintrinsic.c.o] Error 1
make[3]: Leaving directory '/<<PKGBUILDDIR>>/obj-arm-linux-gnueabihf'
CMakeFiles/Makefile2:161: recipe for target 'modules/CMakeFiles/NE10.dir/all' failed
make[2]: *** [modules/CMakeFiles/NE10.dir/all] Error 2
make[2]: Leaving directory '/<<PKGBUILDDIR>>/obj-arm-linux-gnueabihf'
Makefile:130: recipe for target 'all' failed
make[1]: *** [all] Error 2
make[1]: Leaving directory '/<<PKGBUILDDIR>>/obj-arm-linux-gnueabihf'
dh_auto_build: make -j4 returned exit code 2
debian/rules:17: recipe for target 'build-arch' failed
make: *** [build-arch] Error 2

Tail of log for nsd3 on armhf:

#define TCP_TIMEOUT 120
#define ROOT_SERVER /**/
#define INET6 /**/
#define BIND8_STATS /**/
#define NDEBUG /**/
#define RATELIMIT /**/
#define HAVE_SSL /**/

configure: exit 1
dh_auto_configure: ./configure --build=arm-linux-gnueabihf --prefix=/usr --includedir=${prefix}/include --mandir=${prefix}/share/man --infodir=${prefix}/share/info --sysconfdir=/etc --localstatedir=/var --disable-silent-rules --libexecdir=${prefix}/lib/nsd3 --disable-maintainer-mode --disable-dependency-tracking --with-configdir=/etc/nsd3 --with-nsd_conf_file=/etc/nsd3/nsd.conf --with-pidfile=/var/run/nsd3/nsd.pid --with-dbfile=/var/lib/nsd3/nsd.db --with-zonesdir=/etc/nsd3 --with-difffile=/var/lib/nsd3/ixfr.db --with-xfrdfile=/var/lib/nsd3/xfrd.state --disable-largefile --enable-root-server --enable-mmap --enable-ratelimit returned exit code 1
debian/rules:29: recipe for target 'override_dh_auto_configure' failed
make[1]: *** [override_dh_auto_configure] Error 25
make[1]: Leaving directory '/<<PKGBUILDDIR>>'
debian/rules:26: recipe for target 'build-arch' failed
make: *** [build-arch] Error 2

Tail of log for numactl on armhf:

syscall.c:209:17: error: '__NR_migrate_pages' undeclared (first use in this function)
  return syscall(__NR_migrate_pages, pid, maxnode, frommask, tomask);
                 ^~~~~~~~~~~~~~~~~~
syscall.c:209:17: note: each undeclared identifier is reported only once for each function it appears in
syscall.c:210:1: warning: control reaches end of non-void function [-Wreturn-type]
 }
 ^
Makefile:1026: recipe for target 'syscall.lo' failed
make[2]: *** [syscall.lo] Error 1
make[2]: Leaving directory '/<<PKGBUILDDIR>>'
Makefile:702: recipe for target 'all' failed
make[1]: *** [all] Error 2
make[1]: Leaving directory '/<<PKGBUILDDIR>>'
/usr/share/cdbs/1/class/makefile.mk:77: recipe for target 'debian/stamp-makefile-build' failed
make: *** [debian/stamp-makefile-build] Error 2

Tail of log for open-axiom on armhf:

#define PACKAGE_NAME "OpenAxiom"
#define PACKAGE_TARNAME "openaxiom"
#define PACKAGE_VERSION "1.5.0-2013-06-21"
#define PACKAGE_STRING "OpenAxiom 1.5.0-2013-06-21"
#define PACKAGE_BUGREPORT "open-axiom-bugs@lists.sf.net"
#define PACKAGE_URL ""
#define PACKAGE "openaxiom"
#define VERSION "1.5.0-2013-06-21"
#define OPENAXIOM_BASE_RTS Runtime::sbcl

configure: exit 1
Died at /usr/share/perl5/Debian/Debhelper/Buildsystem/autoconf.pm line 77.
	cd /<<BUILDDIR>>/open-axiom-1.5.0~svn3056+ds
debian/rules:45: recipe for target 'configure-stamp' failed
make: *** [configure-stamp] Error 25

Tail of log for openmpi1.6 on armhf:

atomic-asm.S:135: Error: selected processor does not support `dmb' in ARM mode
atomic-asm.S:136: Error: selected processor does not support `strexd r1,r6,r7,[r0]' in ARM mode
Makefile:1338: recipe for target 'atomic-asm.lo' failed
make[3]: *** [atomic-asm.lo] Error 1
make[3]: *** Waiting for unfinished jobs....
make[3]: Leaving directory '/<<PKGBUILDDIR>>/opal/asm'
Makefile:2049: recipe for target 'all-recursive' failed
make[2]: *** [all-recursive] Error 1
make[2]: Leaving directory '/<<PKGBUILDDIR>>/opal'
Makefile:1383: recipe for target 'all-recursive' failed
make[1]: *** [all-recursive] Error 1
make[1]: Leaving directory '/<<PKGBUILDDIR>>'
dh_auto_build: make -j4 returned exit code 2
debian/rules:32: recipe for target 'build-arch' failed
make: *** [build-arch] Error 2

Tail of log for orpie on armhf:

 static inline CBLAS_UPLO_t CBLAS_UPLO_val(v)
                            ^~~~~~~~~~~~~~
mlgsl_blas.h: In function 'CBLAS_DIAG_val':
mlgsl_blas.h:23:28: warning: type of 'v' defaults to 'int' [-Wimplicit-int]
 static inline CBLAS_DIAG_t CBLAS_DIAG_val(v)
                            ^~~~~~~~~~~~~~
mlgsl_blas.h: In function 'CBLAS_SIDE_val':
mlgsl_blas.h:29:28: warning: type of 'v' defaults to 'int' [-Wimplicit-int]
 static inline CBLAS_SIDE_t CBLAS_SIDE_val(v)
                            ^~~~~~~~~~~~~~
Makefile:219: recipe for target 'gsl/mlgsl_blas.o' failed
make[1]: *** [gsl/mlgsl_blas.o] Error 2
make[1]: Leaving directory '/<<PKGBUILDDIR>>'
debian/rules:21: recipe for target 'build-stamp' failed
make: *** [build-stamp] Error 2

Tail of log for osrm on armhf:

 sort_blocks(InputBidIterator input_bids,
 ^
/usr/include/c++/6/bits/stl_heap.h: In function '__adjust_heap.constprop':
/usr/include/c++/6/bits/stl_heap.h:209:5: note: parameter passing for argument of type 'struct __normal_iterator' will change in GCC 7.1
     __adjust_heap(_RandomAccessIterator __first, _Distance __holeIndex,
     ^
make[3]: Leaving directory '/<<PKGBUILDDIR>>/obj-arm-linux-gnueabihf'
[ 85%] Built target osrm-extract
make[2]: Leaving directory '/<<PKGBUILDDIR>>/obj-arm-linux-gnueabihf'
Makefile:130: recipe for target 'all' failed
make[1]: *** [all] Error 2
make[1]: Leaving directory '/<<PKGBUILDDIR>>/obj-arm-linux-gnueabihf'
dh_auto_build: make -j4 returned exit code 2
debian/rules:6: recipe for target 'build-arch' failed
make: *** [build-arch] Error 2

Tail of log for pgloader on armhf:

;; loading file #P"/usr/share/common-lisp/source/cl-asdf/build/asdf.lisp"
;; loading system "asdf-finalizers"
;; loading system "asdf-system-connections"
;; loading system "pgloader"
Fatal SIMPLE-ERROR:
  Compilation failed: Constant
                        NIL conflicts with its asserted type
                        (VALUES UNSIGNED-BYTE &OPTIONAL).
See also:
  The SBCL Manual, Node "Handling of Types" in /usr/share/common-lisp/source/lparallel/src/cons-queue.lisp
debian/rules:31: recipe for target 'override_dh_auto_build' failed
make[1]: *** [override_dh_auto_build] Error 1
make[1]: Leaving directory '/<<BUILDDIR>>/pgloader-3.3.2+dfsg'
debian/rules:55: recipe for target 'build-arch' failed
make: *** [build-arch] Error 2

Tail of log for pocl on armhf:

Makefile:481: recipe for target 'all-recursive' failed
make[4]: *** [all-recursive] Error 1
make[4]: Leaving directory '/<<PKGBUILDDIR>>/lib/kernel'
Makefile:465: recipe for target 'all-recursive' failed
make[3]: *** [all-recursive] Error 1
make[3]: Leaving directory '/<<PKGBUILDDIR>>/lib'
Makefile:640: recipe for target 'all-recursive' failed
make[2]: *** [all-recursive] Error 1
make[2]: Leaving directory '/<<PKGBUILDDIR>>'
Makefile:526: recipe for target 'all' failed
make[1]: *** [all] Error 2
make[1]: Leaving directory '/<<PKGBUILDDIR>>'
dh_auto_build: make -j4 returned exit code 2
debian/rules:44: recipe for target 'build-arch' failed
make: *** [build-arch] Error 2

Tail of log for pyside-mobility on armhf:

  (void)argv;
#ifndef Q_WS_MAC
  return ((int*)(&Q_WS_MAC))[argc];
#else
  (void)argc;
  return 0;
#endif
}

dh_auto_configure: cmake .. -DCMAKE_INSTALL_PREFIX=/usr -DCMAKE_VERBOSE_MAKEFILE=ON -DCMAKE_BUILD_TYPE=None -DCMAKE_INSTALL_SYSCONFDIR=/etc -DCMAKE_INSTALL_LOCALSTATEDIR=/var -DCMAKE_VERBOSE_MAKEFILE=ON -DCMAKE_BUILD_TYPE:STRING=Release -DCMAKE_SKIP_RPATH=true -DCMAKE_USE_PYTHON_VERSION=2.7 -DPython_ADDITIONAL_VERSIONS=2.7 -DPythonInterp_FIND_VERSION=2.7 -DPYTHON_BASENAME=-python2.7 -DPYTHON_SUFFIX=-python2.7 returned exit code 1
debian/rules:52: recipe for target 'override_dh_auto_configure-2.7' failed
make[1]: *** [override_dh_auto_configure-2.7] Error 255
make[1]: Leaving directory '/<<BUILDDIR>>/pyside-mobility-0.2.3+git4~8118106'
debian/rules:4: recipe for target 'build-arch' failed
make: *** [build-arch] Error 2

Tail of log for qtjsbackend-opensource-src on armhf:

make[3]: *** Waiting for unfinished jobs....
Makefile:1220: recipe for target '.obj/assembler.o' failed
make[3]: *** [.obj/assembler.o] Error 1
Makefile:1072: recipe for target '.obj/api.o' failed
make[3]: *** [.obj/api.o] Error 1
make[3]: Leaving directory '/<<PKGBUILDDIR>>/src/v8'
Makefile:86: recipe for target 'sub-v8-make_first-ordered' failed
make[2]: *** [sub-v8-make_first-ordered] Error 2
make[2]: Leaving directory '/<<PKGBUILDDIR>>/src'
Makefile:43: recipe for target 'sub-src-make_first' failed
make[1]: *** [sub-src-make_first] Error 2
make[1]: Leaving directory '/<<PKGBUILDDIR>>'
dh_auto_build: make -j4 returned exit code 2
debian/rules:14: recipe for target 'build-arch' failed
make: *** [build-arch] Error 25

Tail of log for qutecsound on armhf:

src/csoundengine.cpp:795:44: error: 'struct CsoundUserData' has no member named 'channelList'
       CsoundChannelListEntry *chnls = *ud->channelList;
                                            ^~~~~~~~~~~
src/csoundengine.cpp:817:49: error: 'csoundSetInputValueCallback' was not declared in this scope
     csoundSetInputValueCallback(ud->csound, NULL);
                                                 ^
src/csoundengine.cpp:818:50: error: 'csoundSetOutputValueCallback' was not declared in this scope
     csoundSetOutputValueCallback(ud->csound, NULL);
                                                  ^
Makefile:785: recipe for target 'build/doubles/release/obj/csoundengine.o' failed
make[1]: *** [build/doubles/release/obj/csoundengine.o] Error 1
make[1]: *** Waiting for unfinished jobs....
make[1]: Leaving directory '/<<PKGBUILDDIR>>'
/usr/share/cdbs/1/class/makefile.mk:77: recipe for target 'debian/stamp-makefile-build' failed
make: *** [debian/stamp-makefile-build] Error 2

Tail of log for rt-app on armhf:

make[3]: *** Waiting for unfinished jobs....
rt-app.c: In function 'main':
rt-app.c:753:3: warning: implicit declaration of function 'sleep' [-Wimplicit-function-declaration]
   sleep(opts.duration);
   ^~~~~
make[3]: Leaving directory '/<<PKGBUILDDIR>>/src'
Makefile:311: recipe for target 'all' failed
make[2]: *** [all] Error 2
make[2]: Leaving directory '/<<PKGBUILDDIR>>/src'
Makefile:391: recipe for target 'all-recursive' failed
make[1]: *** [all-recursive] Error 1
make[1]: Leaving directory '/<<PKGBUILDDIR>>'
dh_auto_build: make -j4 returned exit code 2
debian/rules:7: recipe for target 'build-arch' failed
make: *** [build-arch] Error 2

Tail of log for ruby2.1 on armhf:

gcc -shared -o ../../.ext/arm-linux-gnueabihf/pathname.so pathname.o -L. -L../.. -L. -Wl,-z,relro -L/<<PKGBUILDDIR>>/debian/lib -fstack-protector -rdynamic -Wl,-export-dynamic    -lruby-2.1  -lpthread -lgmp -ldl -lcrypt -lm   -lc
make[4]: Leaving directory '/<<PKGBUILDDIR>>/ext/pathname'
rm -f ../../.ext/arm-linux-gnueabihf/nkf.so
gcc -shared -o ../../.ext/arm-linux-gnueabihf/nkf.so nkf.o -L. -L../.. -L. -Wl,-z,relro -L/<<PKGBUILDDIR>>/debian/lib -fstack-protector -rdynamic -Wl,-export-dynamic    -lruby-2.1  -lpthread -lgmp -ldl -lcrypt -lm   -lc
make[4]: Leaving directory '/<<PKGBUILDDIR>>/ext/nkf'
make[3]: Leaving directory '/<<PKGBUILDDIR>>'
uncommon.mk:180: recipe for target 'build-ext' failed
make[2]: *** [build-ext] Error 2
make[2]: Leaving directory '/<<PKGBUILDDIR>>'
dh_auto_build: make -j4 main V=1 returned exit code 2
debian/rules:67: recipe for target 'override_dh_auto_build-arch' failed
make[1]: *** [override_dh_auto_build-arch] Error 2
make[1]: Leaving directory '/<<PKGBUILDDIR>>'
debian/rules:49: recipe for target 'build-arch' failed
make: *** [build-arch] Error 2

Tail of log for sortmerna on armhf:

touch index/.tobuild
dh_auto_build
	make -j1
make[2]: Entering directory '/<<PKGBUILDDIR>>'
gcc -DHAVE_CONFIG_H -I. -I./include   -Wdate-time -D_FORTIFY_SOURCE=2  -g -O2 -fdebug-prefix-map=/<<PKGBUILDDIR>>=. -fstack-protector-strong -Wformat -Werror=format-security -pipe -funroll-loops -msse2 -Wall -fopenmp -c -o cmph/bdz.o cmph/bdz.c
gcc: error: unrecognized command line option '-msse2'
Makefile:644: recipe for target 'cmph/bdz.o' failed
make[2]: *** [cmph/bdz.o] Error 1
make[2]: Leaving directory '/<<PKGBUILDDIR>>'
dh_auto_build: make -j1 returned exit code 2
debian/rules:25: recipe for target 'override_dh_auto_build' failed
make[1]: *** [override_dh_auto_build] Error 2
make[1]: Leaving directory '/<<PKGBUILDDIR>>'
debian/rules:13: recipe for target 'build-arch' failed
make: *** [build-arch] Error 2

Tail of log for tlsdate on armhf:

/usr/include/openssl/ssl.h:1614:1: note: declared here
 DEPRECATEDIN_1_1_0(__owur const SSL_METHOD *TLSv1_client_method(void)) /* TLSv1.0 */
 ^
src/tlsdate-helper.c:1207:27: error: dereferencing pointer to incomplete type 'SSL {aka struct ssl_st}'
   memcpy(&result_time, ssl->s3->server_random, sizeof (uint32_t));
                           ^~
Makefile:1973: recipe for target 'src/src_tlsdate_helper-tlsdate-helper.o' failed
make[2]: *** [src/src_tlsdate_helper-tlsdate-helper.o] Error 1
make[2]: Leaving directory '/<<PKGBUILDDIR>>'
Makefile:1367: recipe for target 'all' failed
make[1]: *** [all] Error 2
make[1]: Leaving directory '/<<PKGBUILDDIR>>'
dh_auto_build: make -j1 returned exit code 2
debian/rules:25: recipe for target 'build-arch' failed
make: *** [build-arch] Error 2

Tail of log for varnish-agent on armhf:

src/Makefile.am:8: but option 'subdir-objects' is disabled
src/Makefile.am:8: warning: source file 'modules/vban.c' is in a subdirectory,
src/Makefile.am:8: but option 'subdir-objects' is disabled
src/Makefile.am:8: warning: source file 'modules/curl.c' is in a subdirectory,
src/Makefile.am:8: but option 'subdir-objects' is disabled
src/Makefile.am:8: warning: source file 'modules/vdirect.c' is in a subdirectory,
src/Makefile.am:8: but option 'subdir-objects' is disabled
src/Makefile.am:8: warning: source file 'modules/vac_register.c' is in a subdirectory,
src/Makefile.am:8: but option 'subdir-objects' is disabled
src/Makefile.am: installing './depcomp'
parallel-tests: installing './test-driver'
autoreconf: automake failed with exit status: 1
dh_autoreconf: autoreconf -f -i returned exit code 1
debian/rules:46: recipe for target 'build-arch' failed
make: *** [build-arch] Error 2

Tail of log for wiredtiger on armhf:

make[3]: *** Waiting for unfinished jobs....
Makefile:1837: recipe for target 'src/async/async_op.lo' failed
make[3]: *** [src/async/async_op.lo] Error 1
Makefile:1837: recipe for target 'src/async/async_api.lo' failed
make[3]: *** [src/async/async_api.lo] Error 1
make[3]: Leaving directory '/<<BUILDDIR>>/wiredtiger-2.6.1+ds'
Makefile:1997: recipe for target 'all-recursive' failed
make[2]: *** [all-recursive] Error 1
make[2]: Leaving directory '/<<BUILDDIR>>/wiredtiger-2.6.1+ds'
Makefile:921: recipe for target 'all' failed
make[1]: *** [all] Error 2
make[1]: Leaving directory '/<<BUILDDIR>>/wiredtiger-2.6.1+ds'
dh_auto_build: make -j4 returned exit code 2
debian/rules:21: recipe for target 'build-arch' failed
make: *** [build-arch] Error 2

Tail of log for xf86-video-msm on armhf:

/usr/include/xorg/servermd.h:52:2: error: #error xserver code must include dix-config.h before any other headers
 #error xserver code must include dix-config.h before any other headers
  ^~~~~
Makefile:534: recipe for target 'neon_memsets.lo' failed
make[3]: *** [neon_memsets.lo] Error 1
make[3]: Leaving directory '/<<BUILDDIR>>/xf86-video-msm-1.0.1+git20100122.5f7df591/src'
Makefile:426: recipe for target 'all-recursive' failed
make[2]: *** [all-recursive] Error 1
make[2]: Leaving directory '/<<BUILDDIR>>/xf86-video-msm-1.0.1+git20100122.5f7df591'
Makefile:358: recipe for target 'all' failed
make[1]: *** [all] Error 2
make[1]: Leaving directory '/<<BUILDDIR>>/xf86-video-msm-1.0.1+git20100122.5f7df591'
dh_auto_build: make -j1 returned exit code 2
debian/rules:8: recipe for target 'build-arch' failed
make: *** [build-arch] Error 2

Tail of log for yp-tools on armhf:

     status = ypprot_err (((struct ypresp_val *) resp)->status);
                           ^
cc1: all warnings being treated as errors
Makefile:541: recipe for target 'do_ypcall.lo' failed
make[3]: *** [do_ypcall.lo] Error 1
make[3]: Leaving directory '/<<PKGBUILDDIR>>/lib'
Makefile:485: recipe for target 'all-recursive' failed
make[2]: *** [all-recursive] Error 1
make[2]: Leaving directory '/<<PKGBUILDDIR>>'
Makefile:393: recipe for target 'all' failed
make[1]: *** [all] Error 2
make[1]: Leaving directory '/<<PKGBUILDDIR>>'
dh_auto_build: make -j1 returned exit code 2
debian/rules:22: recipe for target 'build-arch' failed
make: *** [build-arch] Error 2

Tail of log for 3dldf on armhf:

terminate called after throwing an instance of 'std::bad_alloc'
  what():  std::bad_alloc
./runit: line 76:  5620 Aborted                 (core dumped) ./3dldf sample2.ldf
Makefile:1678: recipe for target 'sample2.mp' failed
make[3]: *** [sample2.mp] Error 134
make[3]: Leaving directory '/<<BUILDDIR>>/3dldf-2.0.3+dfsg/src'
Makefile:786: recipe for target 'check-am' failed
make[2]: *** [check-am] Error 2
make[2]: Leaving directory '/<<BUILDDIR>>/3dldf-2.0.3+dfsg/src'
Makefile:546: recipe for target 'check-recursive' failed
make[1]: *** [check-recursive] Error 1
make[1]: Leaving directory '/<<BUILDDIR>>/3dldf-2.0.3+dfsg'
dh_auto_test: make -j1 check VERBOSE=1 returned exit code 2
debian/rules:9: recipe for target 'build-arch' failed
make: *** [build-arch] Error 2

Tail of log for slic3r-prusa on armhf:

t/support.t                      (Wstat: 1280 Tests: 24 Failed: 5)
  Failed tests:  14, 17-20
  Non-zero exit status: 5
  Parse errors: Tests out of sequence.  Found (22) but expected (21)
                Tests out of sequence.  Found (25) but expected (22)
                Tests out of sequence.  Found (26) but expected (23)
                Tests out of sequence.  Found (27) but expected (24)
                Bad plan.  You planned 27 tests but ran 24.
Files=53, Tests=900, 235 wallclock secs ( 0.54 usr  0.24 sys + 160.54 cusr 104.96 csys = 266.28 CPU)
Result: FAIL
debian/rules:26: recipe for target 'override_dh_auto_test' failed
make[1]: *** [override_dh_auto_test] Error 1
make[1]: Leaving directory '/<<PKGBUILDDIR>>'
debian/rules:11: recipe for target 'build-arch' failed
make: *** [build-arch] Error 2

Tail of log for sflphone on armhf:

make[5]: Leaving directory '/<<PKGBUILDDIR>>/daemon/src/video'
Makefile:754: recipe for target 'all-recursive' failed
make[4]: *** [all-recursive] Error 1
make[4]: Leaving directory '/<<PKGBUILDDIR>>/daemon/src'
Makefile:514: recipe for target 'all-recursive' failed
make[3]: *** [all-recursive] Error 1
make[3]: Leaving directory '/<<PKGBUILDDIR>>/daemon'
Makefile:445: recipe for target 'all' failed
make[2]: *** [all] Error 2
make[2]: Leaving directory '/<<PKGBUILDDIR>>/daemon'
debian/rules:24: recipe for target 'override_dh_auto_build' failed
make[1]: *** [override_dh_auto_build] Error 2
make[1]: Leaving directory '/<<PKGBUILDDIR>>'
debian/rules:9: recipe for target 'build-arch' failed
make: *** [build-arch] Error 2

Tail of log for firefox on armhf:

DEBUG: configure:21027: /usr/bin/gcc-5 -std=gnu99 -o conftest -fstack-protector-strong -Wformat -Werror=format-security -fno-strict-aliasing -ffunction-sections -fdata-sections -fno-math-errno -pthread -pipe -I/usr/include/freetype2 -Wdate-time -D_FORTIFY_SOURCE=2 -lpthread -Wl,--as-needed -Wl,--reduce-memory-overheads -Wl,--no-keep-memory -Wl,--stats -Wl,-z,noexecstack -Wl,-z,text -Wl,--build-id conftest.c -ldl  -lfreetype 1>&5
DEBUG: /usr/bin/ld: total time in link: 0.056000
DEBUG: /usr/bin/ld: data size 2961408
DEBUG: configure:21065: checking for fontconfig/fcfreetype.h
DEBUG: configure:21078: /usr/bin/gcc-5 -std=gnu99 -c -fstack-protector-strong -Wformat -Werror=format-security -fno-strict-aliasing -ffunction-sections -fdata-sections -fno-math-errno -pthread -pipe -Wdate-time -D_FORTIFY_SOURCE=2 -I/usr/include/freetype2  conftest.c 1>&5
DEBUG: configure:21129: checking for fontconfig >= 2.7.0
DEBUG: configure:21136: checking _FONTCONFIG_CFLAGS
DEBUG: configure:21141: checking _FONTCONFIG_LIBS
DEBUG: configure: error: cannot determine icu version number from uvernum.h header file
ERROR: old-configure failed
debian/rules:215: recipe for target 'stamps/configure-browser' failed
make[1]: *** [stamps/configure-browser] Error 1
make[1]: Leaving directory '/<<PKGBUILDDIR>>'
debian/rules:388: recipe for target 'build-arch' failed
make: *** [build-arch] Error 2

Tail of log for libsis-jhdf5-java on armhf:

[Utils] Attempting to create test-output/junitreports/TEST-ch.systemsx.cisd.hdf5.BitSetConversionTest.xml
[Utils]   Directory test-output/junitreports exists: true
[TestNG] Time taken by org.testng.reporters.JUnitReportReporter@175e721: 14962 ms
[Utils] Attempting to create test-output/testng-failed.xml
[Utils]   Directory test-output exists: true
[Utils] Attempting to create /<<PKGBUILDDIR>>/test-output/All/testng-failed.xml
[Utils]   Directory /<<PKGBUILDDIR>>/test-output/All exists: true
[TestNG] Time taken by [FailedReporter passed=0 failed=0 skipped=0]: 3079 ms
[TestNG] Time taken by org.testng.reporters.XMLReporter@1a4555e: 2756 ms
[TestNG] Time taken by org.testng.reporters.jq.Main@175e2db: 21572 ms
debian/rules:46: recipe for target 'override_dh_auto_test' failed
make[1]: *** [override_dh_auto_test] Error 3
make[1]: Leaving directory '/<<PKGBUILDDIR>>'
debian/rules:16: recipe for target 'build-arch' failed
make: *** [build-arch] Error 2

Tail of log for openjfx on armhf:

	at org.gradle.api.internal.tasks.execution.ExecuteActionsTaskExecuter.executeAction(ExecuteActionsTaskExecuter.java:95)
	at org.gradle.api.internal.tasks.execution.ExecuteActionsTaskExecuter.executeActions(ExecuteActionsTaskExecuter.java:76)
	... 58 more


BUILD FAILED

Total time: 1 hrs 52 mins 13.567 secs
Stopped 0 compiler daemon(s).
dh_auto_build: gradle --info --console plain --offline --stacktrace --no-daemon --refresh-dependencies --gradle-user-home .gradle -Duser.home=. -Duser.name=debian -Ddebian.package=openjfx sdk -x javadoc -x src returned exit code 1
debian/rules:32: recipe for target 'override_dh_auto_build-arch' failed
make[1]: *** [override_dh_auto_build-arch] Error 25
make[1]: Leaving directory '/<<PKGBUILDDIR>>'
debian/rules:26: recipe for target 'build-arch' failed
make: *** [build-arch] Error 2

Tail of log for liquidsoap on armhf:

/usr/bin/ld: cannot find -lpng12
collect2: error: ld returned 1 exit status
File "caml_startup", line 1:
Error: Error during linking
../Makefile.rules:170: recipe for target 'plugins/camlimages.cmxs' failed
make[3]: *** [plugins/camlimages.cmxs] Error 2
make[3]: Leaving directory '/<<PKGBUILDDIR>>/src'
../Makefile.rules:67: recipe for target 'all-auto-ocaml-prog' failed
make[2]: *** [all-auto-ocaml-prog] Error 2
make[2]: Leaving directory '/<<PKGBUILDDIR>>/src'
Makefile.rules:27: recipe for target 'all-subdirs' failed
make[1]: *** [all-subdirs] Error 2
make[1]: Leaving directory '/<<PKGBUILDDIR>>'
/usr/share/cdbs/1/class/makefile.mk:77: recipe for target 'debian/stamp-makefile-build' failed
make: *** [debian/stamp-makefile-build] Error 2

Tail of log for libzstd on armhf:

\nStarting playTests.sh isWindows=false ZSTD=' ../programs/zstd'
\n**** simple tests **** 

test : basic compression 
./playTests.sh: line 49: 22707 Bus error               (core dumped) $ZSTD -f tmp
Makefile:182: recipe for target 'zstd-playTests' failed
make[2]: *** [zstd-playTests] Error 135
make[2]: *** Waiting for unfinished jobs....
make[2]: Leaving directory '/<<PKGBUILDDIR>>/tests'
Makefile:49: recipe for target 'test' failed
make[1]: *** [test] Error 2
make[1]: Leaving directory '/<<PKGBUILDDIR>>'
dh_auto_test: make -j4 test returned exit code 2
debian/rules:12: recipe for target 'build-arch' failed
make: *** [build-arch] Error 2

BinNMU changelog for percona-xtrabackup on armhf:

rebuild due to debcheck failure

Tail of log for percona-xtrabackup on armhf:

[ 82%] Building CXX object libmysqld/CMakeFiles/sql_embedded.dir/__/sql/thr_malloc.cc.o
[ 82%] Building CXX object libmysqld/CMakeFiles/sql_embedded.dir/__/sql/transaction.cc.o
[ 82%] Building CXX object libmysqld/CMakeFiles/sql_embedded.dir/__/sql/tztime.cc.o
[ 82%] Building CXX object libmysqld/CMakeFiles/sql_embedded.dir/__/sql/uniques.cc.o
[ 82%] Building CXX object libmysqld/CMakeFiles/sql_embedded.dir/__/sql/unireg.cc.o
[ 82%] Linking CXX static library libsql_embedded.a
make[3]: Leaving directory '/<<PKGBUILDDIR>>'
[ 82%] Built target sql_embedded
make[2]: Leaving directory '/<<PKGBUILDDIR>>'
Makefile:149: recipe for target 'all' failed
make[1]: *** [all] Error 2
make[1]: Leaving directory '/<<PKGBUILDDIR>>'
dh_auto_build: make -j4 returned exit code 2
debian/rules:36: recipe for target 'build-arch' failed
make: *** [build-arch] Error 2