Raspbian Package Auto-Building

Buildd status for creduce (bookworm-staging)

Debian PTSTrackerChangelogBugspackages.d.obuildd.d.o

Package(s): Suite:
Compact mode Co-maintainers

ArchitectureVersionStatusForBuilddStateMiscLogs
Buildd exposure stats armhf  2.10.0+20201029-3Build-Attempted30d 16h 9mtestwandboardout-of-datemisc:sourceold | all (2)

Tail of log for creduce on armhf:

/usr/lib/llvm-9/include/clang/Frontend/CompilerInvocation.h:154:15: note:   candidate expects 4 arguments, 3 provided
TransformationManager.cpp:140:32: error: 'Language' has not been declared
  140 |                                Language::OpenCL, T, PPOpts);
      |                                ^~~~~~~~
make[4]: *** [Makefile:2043: clang_delta-TransformationManager.o] Error 1
make[4]: *** Waiting for unfinished jobs....
make[4]: Leaving directory '/<<BUILDDIR>>/creduce-2.10.0+20201029/clang_delta'
make[3]: *** [Makefile:448: all-recursive] Error 1
make[3]: Leaving directory '/<<BUILDDIR>>/creduce-2.10.0+20201029'
make[2]: *** [Makefile:380: all] Error 2
make[2]: Leaving directory '/<<BUILDDIR>>/creduce-2.10.0+20201029'
dh_auto_build: error: make -j4 returned exit code 2
make[1]: *** [debian/rules:29: override_dh_auto_build] Error 25
make[1]: Leaving directory '/<<BUILDDIR>>/creduce-2.10.0+20201029'
make: *** [debian/rules:23: build-arch] Error 2