Raspbian Package Auto-Building

Buildd status for cde (wheezy-staging)

Debian PTS – Tracker – Changelog – Bugs – packages.d.o – buildd.d.o

Package(s): Suite:
Compact mode Co-maintainers

ArchitectureVersionStatusForBuilddStateMiscLogs
Buildd exposure stats armhf  ↓0.1-1Build-Attempted3407d 9h 9mbm-wb-02uncompiledutils:sourceold | all (5)

Tail of log for cde on armhf:

defs.h:437:27: error: field 'saved_regs' has incomplete type
strace.c: In function 'main':
strace.c:836:9: warning: unused variable 'pid' [-Wunused-variable]
strace.c: In function 'trace':
strace.c:2792:15: warning: unused variable 'si' [-Wunused-variable]
make[4]: *** [strace.o] Error 1
make[4]: Leaving directory `/<<PKGBUILDDIR>>/strace-4.6'
make[3]: *** [all-recursive] Error 1
make[3]: Leaving directory `/<<PKGBUILDDIR>>/strace-4.6'
make[2]: *** [all] Error 2
make[2]: Leaving directory `/<<PKGBUILDDIR>>/strace-4.6'
make[1]: *** [all] Error 2
make[1]: Leaving directory `/<<PKGBUILDDIR>>'
dh_auto_build: make -j1 returned exit code 2
make: *** [build-arch] Error 2