Raspbian Package Auto-Building

Buildd status for bustools (bookworm-staging)

Debian PTSTrackerChangelogBugspackages.d.obuildd.d.o

Package(s): Suite:
Compact mode Co-maintainers

ArchitectureVersionStatusForBuilddStateMiscLogs
Buildd exposure stats armhf  0.40.0-4Build-Attempted30d 16h 6mmb-lxc-01uncompiledmisc:extraold | all (3)

Tail of log for bustools on armhf:

   73 | inline size_t rndup(size_t v) {
      |               ^~~~~
make[4]: *** [src/CMakeFiles/bustools_core.dir/build.make:98: src/CMakeFiles/bustools_core.dir/Common.cpp.o] Error 1
make[4]: *** Waiting for unfinished jobs....
make[4]: *** [src/CMakeFiles/bustools_core.dir/build.make:111: src/CMakeFiles/bustools_core.dir/bustools_capture.cpp.o] Error 1
make[4]: *** [src/CMakeFiles/bustools_core.dir/build.make:124: src/CMakeFiles/bustools_core.dir/bustools_correct.cpp.o] Error 1
make[4]: Leaving directory '/<<PKGBUILDDIR>>/obj-arm-linux-gnueabihf'
make[3]: *** [CMakeFiles/Makefile2:145: src/CMakeFiles/bustools_core.dir/all] Error 2
make[3]: Leaving directory '/<<PKGBUILDDIR>>/obj-arm-linux-gnueabihf'
make[2]: *** [Makefile:152: all] Error 2
make[2]: Leaving directory '/<<PKGBUILDDIR>>/obj-arm-linux-gnueabihf'
dh_auto_build: error: cd obj-arm-linux-gnueabihf && make -j4 "INSTALL=install --strip-program=true" VERBOSE=1 returned exit code 2
make[1]: *** [debian/rules:17: override_dh_auto_build] Error 25
make[1]: Leaving directory '/<<PKGBUILDDIR>>'
make: *** [debian/rules:9: binary-arch] Error 2