Raspbian Package Auto-Building

Buildd status for bornagain (bullseye-staging)

Debian PTSTrackerChangelogBugspackages.d.obuildd.d.o

Package(s): Suite:
Compact mode Co-maintainers

ArchitectureVersionStatusForBuilddStateMiscLogs
Buildd exposure stats armhf  1.18.0-1Build-Attempted2d 3h 56mbm-wb-03uncompiledmisc:sourceold | all (4)

Tail of log for bornagain on armhf:

gmake[3]: Entering directory '/<<PKGBUILDDIR>>/obj-arm-linux-gnueabihf/CMakeFiles/CMakeTmp'
Building C object CMakeFiles/cmTC_6c144.dir/CheckIncludeFile.c.o
/usr/bin/cc   -g -O2 -ffile-prefix-map=/<<PKGBUILDDIR>>=. -fstack-protector-strong -Wformat -Werror=format-security -Wdate-time -D_FORTIFY_SOURCE=2 -pipe -m32 -Wall -W -fPIC  -std=gnu11 -o CMakeFiles/cmTC_6c144.dir/CheckIncludeFile.c.o -c /<<PKGBUILDDIR>>/obj-arm-linux-gnueabihf/CMakeFiles/CMakeTmp/CheckIncludeFile.c
cc: error: unrecognized command-line option '-m32'; did you mean '-mbe32'?
gmake[3]: *** [CMakeFiles/cmTC_6c144.dir/build.make:85: CMakeFiles/cmTC_6c144.dir/CheckIncludeFile.c.o] Error 1
gmake[3]: Leaving directory '/<<PKGBUILDDIR>>/obj-arm-linux-gnueabihf/CMakeFiles/CMakeTmp'
gmake[2]: *** [Makefile:140: cmTC_6c144/fast] Error 2
gmake[2]: Leaving directory '/<<PKGBUILDDIR>>/obj-arm-linux-gnueabihf/CMakeFiles/CMakeTmp'



dh_auto_configure: error: cd obj-arm-linux-gnueabihf && cmake -DCMAKE_INSTALL_PREFIX=/usr -DCMAKE_BUILD_TYPE=None -DCMAKE_INSTALL_SYSCONFDIR=/etc -DCMAKE_INSTALL_LOCALSTATEDIR=/var -DCMAKE_EXPORT_NO_PACKAGE_REGISTRY=ON -DCMAKE_FIND_PACKAGE_NO_PACKAGE_REGISTRY=ON -DCMAKE_INSTALL_RUNSTATEDIR=/run "-GUnix Makefiles" -DCMAKE_VERBOSE_MAKEFILE=ON -DCMAKE_INSTALL_LIBDIR=lib/arm-linux-gnueabihf -DCMAKE_DEB_HOST_MULTIARCH=arm-linux-gnueabihf -DCONFIGURE_MANPAGE=ON -DBORNAGAIN_MPI=ON -DBORNAGAIN_GENERATE_PYTHON_DOCS=ON -DBORNAGAIN_GENERATE_BINDINGS=ON "-DPython_ADDITIONAL_VERSIONS=3.9 3.8" .. returned exit code 1
make[1]: *** [debian/rules:37: override_dh_auto_configure] Error 25
make[1]: Leaving directory '/<<PKGBUILDDIR>>'
make: *** [debian/rules:34: build-arch] Error 2