Raspbian Package Auto-Building

Buildd status for selected packages (bullseye-staging)

Bugs

Package(s): Suite:
Compact mode Co-maintainers

Package armhf
Buildd exposure stats
✔ blastemBuild-Attempted
✔ dballeBuild-Attempted
✔ ibamBuild-Attempted
✔ libmlx5Build-Attempted
✔ libtangoBuild-Attempted
✔ neuronBuild-Attempted
✔ percona-xtradb-cluster-galera-2.xBuild-Attempted
✔ prboomBuild-Attempted
✔ r-bioc-rsubreadBuild-Attempted
✔ rust-libnotcurses-sysBuild-Attempted
✔ libmaus2Build-Attempted
✔ paraviewBuild-Attempted
✔ emacsInstalled

Tail of log for blastem on armhf:

      |                                                                     ~~~~~~~~~^~~
z80_to_x86.c: In function 'zremove_breakpoint':
z80_to_x86.c:3872:22: warning: assignment to 'code_ptr' {aka 'unsigned int *'} from incompatible pointer type 'uint8_t *' {aka 'unsigned char *'} [-Wincompatible-pointer-types]
 3872 |   opts->gen.code.cur = native;
      |                      ^
z80_to_x86.c:3873:23: warning: assignment to 'code_ptr' {aka 'unsigned int *'} from incompatible pointer type 'uint8_t *' {aka 'unsigned char *'} [-Wincompatible-pointer-types]
 3873 |   opts->gen.code.last = native + 128;
      |                       ^
make[2]: *** [Makefile:356: z80_to_x86.o] Error 1
make[2]: *** Waiting for unfinished jobs....
make[2]: Leaving directory '/<<PKGBUILDDIR>>'
dh_auto_build: error: make -j4 "INSTALL=install --strip-program=true" HOST_ZLIB=1 CONFIG_PATH=/etc/blastem DATA_PATH=/usr/share/games/blastem returned exit code 2
make[1]: *** [debian/rules:10: override_dh_auto_build] Error 25
make[1]: Leaving directory '/<<PKGBUILDDIR>>'
make: *** [debian/rules:7: binary-arch] Error 2

Tail of log for dballe on armhf:

OK
2021-05-08 20:34:18,256 INFO test-csv: /usr/bin/python3 /<<PKGBUILDDIR>>/python/test-csv.py: success
2021-05-08 20:34:18,258 INFO runtest: 13 tests requested, 11 succeeded, 2 failed, 0 did not run.
make[5]: *** [Makefile:1035: check-local] Error 1
make[5]: Leaving directory '/<<PKGBUILDDIR>>/python'
make[4]: *** [Makefile:848: check-am] Error 2
make[4]: Leaving directory '/<<PKGBUILDDIR>>/python'
make[3]: *** [Makefile:850: check] Error 2
make[3]: Leaving directory '/<<PKGBUILDDIR>>/python'
make[2]: *** [Makefile:593: check-recursive] Error 1
make[2]: Leaving directory '/<<PKGBUILDDIR>>'
make[1]: *** [Makefile:891: check] Error 2
make[1]: Leaving directory '/<<PKGBUILDDIR>>'
dh_auto_test: error: make -j4 check VERBOSE=1 returned exit code 2
make: *** [debian/rules:7: build-arch] Error 25

Tail of log for ibam on armhf:

make[1]: Entering directory '/<<PKGBUILDDIR>>'
make[1]: 'ibam-krell.so' is up to date.
make[1]: Leaving directory '/<<PKGBUILDDIR>>'
touch build-stamp
dh_testdir
dh_testroot
dh_clean
dh_clean: warning: Compatibility levels before 10 are deprecated (level 7 in use)
dh_installdirs
dh_installdirs: warning: Compatibility levels before 10 are deprecated (level 7 in use)
# Add here commands to install the package into debian/tmp.
install -m0755 ibam `pwd`/debian/ibam/usr/bin
install -m0644 ibam-krell.so `pwd`/debian/gkrellm-ibam/usr/lib/gkrellm2/plugins
install: cannot create regular file '/<<PKGBUILDDIR>>/debian/gkrellm-ibam/usr/lib/gkrellm2/plugins': No such file or directory
make: *** [debian/rules:58: install] Error 1

Tail of log for libmlx5 on armhf:

#define HAVE_STDLIB_H 1
#define HAVE_STRING_H 1
#define HAVE_MEMORY_H 1
#define HAVE_STRINGS_H 1
#define HAVE_INTTYPES_H 1
#define HAVE_STDINT_H 1
#define HAVE_UNISTD_H 1
#define HAVE_DLFCN_H 1
#define LT_OBJDIR ".libs/"
#define NVALGRIND 1
#define HAVE_LIBIBVERBS 1

configure: exit 1
dh_auto_configure: error: ./configure --build=arm-linux-gnueabihf --prefix=/usr --includedir=\${prefix}/include --mandir=\${prefix}/share/man --infodir=\${prefix}/share/info --sysconfdir=/etc --localstatedir=/var --disable-option-checking --disable-silent-rules --libdir=\${prefix}/lib/arm-linux-gnueabihf --libexecdir=\${prefix}/lib/arm-linux-gnueabihf --disable-maintainer-mode --disable-dependency-tracking returned exit code 1
make: *** [debian/rules:6: build-arch] Error 25

Tail of log for libtango on armhf:

dpkg-buildpackage: info: host architecture armhf
 fakeroot debian/rules clean
QUILT_PATCHES=debian/patches \
	quilt --quiltrc /dev/null pop -a -R || test $? = 2
No patch removed
rm -rf .pc debian/stamp-patched
dh_testdir
dh_testroot
rm -rf stamps objs
find build -type d -name "objs-*" | xargs rm -rf
rm -f build-stamp-*
dh_clean
dh_clean: warning: Compatibility levels before 10 are deprecated (level 7 in use)
 debian/rules build-arch
make: *** No rule to make target 'build-arch'.  Stop.

Tail of log for neuron on armhf:

libtool: link: (cd ".libs" && rm -f "libocxt.so" && ln -s "libocxt.so.0.0.0" "libocxt.so")
libtool: link: ( cd ".libs" && rm -f "libocxt.la" && ln -s "../libocxt.la" "libocxt.la" )
make[6]: Leaving directory '/<<PKGBUILDDIR>>/src/oc'
make[5]: *** [Makefile:562: all] Error 2
make[5]: Leaving directory '/<<PKGBUILDDIR>>/src/oc'
make[4]: *** [Makefile:519: all-recursive] Error 1
make[4]: Leaving directory '/<<PKGBUILDDIR>>/src'
make[3]: *** [Makefile:658: all-recursive] Error 1
make[3]: Leaving directory '/<<PKGBUILDDIR>>'
make[2]: *** [Makefile:516: all] Error 2
make[2]: Leaving directory '/<<PKGBUILDDIR>>'
dh_auto_build: error: make -j4 returned exit code 2
make[1]: *** [debian/rules:32: override_dh_auto_build] Error 25
make[1]: Leaving directory '/<<PKGBUILDDIR>>'
make: *** [debian/rules:15: build-arch] Error 2

Tail of log for percona-xtradb-cluster-galera-2.x on armhf:

   debian/rules override_dh_auto_build
make[1]: Entering directory '/<<PKGBUILDDIR>>'
scons revno=318911d boost_pool=0 garb/garbd libgalera_smm.so 
scons: Reading SConscript files ...
  File "/<<PKGBUILDDIR>>/SConstruct", line 23

    print 'Host: ' + sysname + ' ' + machine

          ^

SyntaxError: Missing parentheses in call to 'print'. Did you mean print('Host: ' + sysname + ' ' + machine)?

make[1]: *** [debian/rules:15: override_dh_auto_build] Error 2
make[1]: Leaving directory '/<<PKGBUILDDIR>>'
make: *** [debian/rules:18: build-arch] Error 2

Tail of log for prboom on armhf:

      |                                png_error_ptr
i_sshot.c:234:32: note: each undeclared identifier is reported only once for each function it appears in
i_sshot.c:282:43: error: ‘png_infopp_NULL’ undeclared (first use in this function); did you mean ‘png_infopp’?
  282 |       png_destroy_write_struct(&png_ptr,  png_infopp_NULL);
      |                                           ^~~~~~~~~~~~~~~
      |                                           png_infopp
make[4]: *** [Makefile:242: i_sshot.o] Error 1
make[4]: Leaving directory '/<<PKGBUILDDIR>>/src/SDL'
make[3]: *** [Makefile:460: all-recursive] Error 1
make[3]: Leaving directory '/<<PKGBUILDDIR>>/src'
make[2]: *** [Makefile:285: all-recursive] Error 1
make[2]: Leaving directory '/<<PKGBUILDDIR>>'
make[1]: *** [Makefile:205: all] Error 2
make[1]: Leaving directory '/<<PKGBUILDDIR>>'
make: *** [debian/rules:28: build-stamp] Error 2

Tail of log for r-bioc-rsubread on armhf:

/usr/include/stdint.h:96:23: error: conflicting types for ‘uintptr_t’
   96 | typedef unsigned int  uintptr_t;
      |                       ^~~~~~~~~
In file included from R_wrapper.c:30:
/usr/share/R/include/Rinterface.h:110:24: note: previous declaration of ‘uintptr_t’ was here
  110 |  typedef unsigned long uintptr_t;
      |                        ^~~~~~~~~
make[1]: *** [/usr/lib/R/etc/Makeconf:172: R_wrapper.o] Error 1
make[1]: Leaving directory '/<<PKGBUILDDIR>>/src'
make[1]: Entering directory '/<<PKGBUILDDIR>>/src'
make[1]: Leaving directory '/<<PKGBUILDDIR>>/src'
ERROR: compilation failed for package ‘Rsubread’
* removing ‘/<<PKGBUILDDIR>>/debian/r-bioc-rsubread/usr/lib/R/site-library/Rsubread’
dh_auto_install: error: R CMD INSTALL -l /<<PKGBUILDDIR>>/debian/r-bioc-rsubread/usr/lib/R/site-library --clean . "--built-timestamp='Fri, 27 Nov 2020 11:36:46 +0100'" returned exit code 1
make: *** [debian/rules:4: binary-arch] Error 25

Tail of log for rust-libnotcurses-sys on armhf:

   |                                         ^^ types differ in mutability
   |
   = note: expected raw pointer `*mut bindings::ffi::notcurses`
                found reference `&bindings::ffi::notcurses`

error: aborting due to 16 previous errors

Some errors have detailed explanations: E0308, E0412, E0425, E0432.
For more information about an error, try `rustc --explain E0308`.
error: could not compile `libnotcurses-sys`.

Caused by:
  process didn't exit successfully: `CARGO=/usr/bin/cargo CARGO_CRATE_NAME=libnotcurses_sys CARGO_MANIFEST_DIR=/<<PKGBUILDDIR>> CARGO_PKG_AUTHORS='nick black <dankamongmen@gmail.com>:José Luis Cruz <joseluis@andamira.net>' CARGO_PKG_DESCRIPTION='Low-level Rust bindings for the notcurses C library.' CARGO_PKG_HOMEPAGE='https://nick-black.com/dankwiki/index.php/Notcurses' CARGO_PKG_LICENSE=Apache-2.0 CARGO_PKG_LICENSE_FILE='' CARGO_PKG_NAME=libnotcurses-sys CARGO_PKG_REPOSITORY='https://github.com/dankamongmen/notcurses' CARGO_PKG_VERSION=2.1.8 CARGO_PKG_VERSION_MAJOR=2 CARGO_PKG_VERSION_MINOR=1 CARGO_PKG_VERSION_PATCH=8 CARGO_PKG_VERSION_PRE='' LD_LIBRARY_PATH='/<<PKGBUILDDIR>>/target/debug/deps:/usr/lib' OUT_DIR=/<<PKGBUILDDIR>>/target/arm-unknown-linux-gnueabihf/debug/build/libnotcurses-sys-6d2a835ad1a90904/out rustc --crate-name libnotcurses_sys --edition=2018 src/lib.rs --error-format=json --json=diagnostic-rendered-ansi --crate-type lib --emit=dep-info,metadata,link -Cembed-bitcode=no -C debuginfo=2 -C metadata=f9dd4e71e191bc5c -C extra-filename=-f9dd4e71e191bc5c --out-dir /<<PKGBUILDDIR>>/target/arm-unknown-linux-gnueabihf/debug/deps --target arm-unknown-linux-gnueabihf -C incremental=/<<PKGBUILDDIR>>/target/arm-unknown-linux-gnueabihf/debug/incremental -L dependency=/<<PKGBUILDDIR>>/target/arm-unknown-linux-gnueabihf/debug/deps -L dependency=/<<PKGBUILDDIR>>/target/debug/deps --extern cty=/<<PKGBUILDDIR>>/target/arm-unknown-linux-gnueabihf/debug/deps/libcty-904649ed5cec472e.rmeta --extern libc=/<<PKGBUILDDIR>>/target/arm-unknown-linux-gnueabihf/debug/deps/liblibc-7ac701aa45c57138.rmeta -C debuginfo=2 --cap-lints warn -C linker=arm-linux-gnueabihf-gcc -C link-arg=-Wl,-z,relro --remap-path-prefix /<<PKGBUILDDIR>>=/usr/share/cargo/registry/libnotcurses-sys-2.1.8 -L native=/usr/lib/arm-linux-gnueabihf -l notcurses -l notcurses-core` (exit code: 1)
dh_auto_test: error: /usr/share/cargo/bin/cargo build returned exit code 101
make: *** [debian/rules:3: binary-arch] Error 25

Tail of log for libmaus2 on armhf:

/usr/include/c++/10/bits/atomic_base.h:326: undefined reference to `__atomic_fetch_add_8'
/usr/bin/ld: test/testThreadPoolBgzfDecompress-testThreadPoolBgzfDecompress.o: in function `std::__atomic_base<unsigned long long>::load(std::memory_order) const':
/usr/include/c++/10/bits/atomic_base.h:426: undefined reference to `__atomic_load_8'
/usr/bin/ld: ./.libs/libmaus2.so: undefined reference to `__atomic_fetch_or_8'
/usr/bin/ld: ./.libs/libmaus2.so: undefined reference to `__atomic_compare_exchange_8'
/usr/bin/ld: ./.libs/libmaus2.so: undefined reference to `__atomic_fetch_and_8'
collect2: error: ld returned 1 exit status
make[3]: *** [Makefile:6842: testThreadPoolBgzfDecompress] Error 1
make[3]: Leaving directory '/<<BUILDDIR>>/libmaus2-2.0.768+dfsg/src'
make[2]: *** [Makefile:679: all-recursive] Error 1
make[2]: Leaving directory '/<<BUILDDIR>>/libmaus2-2.0.768+dfsg'
make[1]: *** [Makefile:563: all] Error 2
make[1]: Leaving directory '/<<BUILDDIR>>/libmaus2-2.0.768+dfsg'
dh_auto_build: error: make -j4 returned exit code 2
make: *** [debian/rules:12: binary-arch] Error 25

Tail of log for paraview on armhf:

make[4]: Leaving directory '/<<PKGBUILDDIR>>/build.python3.9'
[  7%] Built target CommonCore
[  7%] Linking CXX shared library ../../../../../../../lib/arm-linux-gnueabihf/libvtkm_cont-pv5.9.so
cd /<<PKGBUILDDIR>>/build.python3.9/VTK/ThirdParty/vtkm/vtkvtkm/vtk-m/vtkm/cont && /usr/bin/cmake -E cmake_link_script CMakeFiles/vtkm_cont.dir/link.txt --verbose=1
/usr/bin/c++ -fPIC -g -O2 -ffile-prefix-map=/<<PKGBUILDDIR>>=. -fstack-protector-strong -Wformat -Werror=format-security -Wdate-time -D_FORTIFY_SOURCE=2 -Wdate-time -D_FORTIFY_SOURCE=2  -O3 -DNDEBUG  -Wl,-lc -Wl,-z,relro -Wl,--as-needed  -shared -Wl,-soname,libvtkm_cont-pv5.9.so.1 -o ../../../../../../../lib/arm-linux-gnueabihf/libvtkm_cont-pv5.9.so.1 CMakeFiles/vtkm_cont.dir/ArrayHandle.cxx.o CMakeFiles/vtkm_cont.dir/ArrayHandleBasic.cxx.o CMakeFiles/vtkm_cont.dir/ArrayHandleSOA.cxx.o CMakeFiles/vtkm_cont.dir/BitField.cxx.o CMakeFiles/vtkm_cont.dir/ColorTablePresets.cxx.o CMakeFiles/vtkm_cont.dir/DeviceAdapterTag.cxx.o CMakeFiles/vtkm_cont.dir/EnvironmentTracker.cxx.o CMakeFiles/vtkm_cont.dir/ErrorBadDevice.cxx.o CMakeFiles/vtkm_cont.dir/ErrorBadType.cxx.o CMakeFiles/vtkm_cont.dir/internal/Buffer.cxx.o CMakeFiles/vtkm_cont.dir/internal/DeviceAdapterMemoryManager.cxx.o CMakeFiles/vtkm_cont.dir/internal/DeviceAdapterMemoryManagerShared.cxx.o CMakeFiles/vtkm_cont.dir/internal/TransferInfo.cxx.o CMakeFiles/vtkm_cont.dir/internal/VirtualObjectTransfer.cxx.o CMakeFiles/vtkm_cont.dir/Initialize.cxx.o CMakeFiles/vtkm_cont.dir/Logging.cxx.o CMakeFiles/vtkm_cont.dir/RuntimeDeviceTracker.cxx.o CMakeFiles/vtkm_cont.dir/Token.cxx.o CMakeFiles/vtkm_cont.dir/TryExecute.cxx.o CMakeFiles/vtkm_cont.dir/ArrayRangeCompute.cxx.o CMakeFiles/vtkm_cont.dir/AssignerPartitionedDataSet.cxx.o CMakeFiles/vtkm_cont.dir/BoundsCompute.cxx.o CMakeFiles/vtkm_cont.dir/BoundsGlobalCompute.cxx.o CMakeFiles/vtkm_cont.dir/CellLocator.cxx.o CMakeFiles/vtkm_cont.dir/CellLocatorBoundingIntervalHierarchy.cxx.o CMakeFiles/vtkm_cont.dir/CellLocatorGeneral.cxx.o CMakeFiles/vtkm_cont.dir/CellLocatorRectilinearGrid.cxx.o CMakeFiles/vtkm_cont.dir/CellLocatorTwoLevel.cxx.o CMakeFiles/vtkm_cont.dir/CellLocatorUniformGrid.cxx.o CMakeFiles/vtkm_cont.dir/CellSet.cxx.o CMakeFiles/vtkm_cont.dir/CellSetExplicit.cxx.o CMakeFiles/vtkm_cont.dir/CellSetExtrude.cxx.o CMakeFiles/vtkm_cont.dir/CellSetStructured.cxx.o CMakeFiles/vtkm_cont.dir/ColorTable.cxx.o CMakeFiles/vtkm_cont.dir/CoordinateSystem.cxx.o CMakeFiles/vtkm_cont.dir/DataSet.cxx.o CMakeFiles/vtkm_cont.dir/DataSetBuilderExplicit.cxx.o CMakeFiles/vtkm_cont.dir/DataSetBuilderRectilinear.cxx.o CMakeFiles/vtkm_cont.dir/DataSetBuilderUniform.cxx.o CMakeFiles/vtkm_cont.dir/Field.cxx.o CMakeFiles/vtkm_cont.dir/FieldRangeCompute.cxx.o CMakeFiles/vtkm_cont.dir/FieldRangeGlobalCompute.cxx.o CMakeFiles/vtkm_cont.dir/PartitionedDataSet.cxx.o CMakeFiles/vtkm_cont.dir/PointLocator.cxx.o CMakeFiles/vtkm_cont.dir/PointLocatorSparseGrid.cxx.o CMakeFiles/vtkm_cont.dir/RuntimeDeviceInformation.cxx.o CMakeFiles/vtkm_cont.dir/Timer.cxx.o CMakeFiles/vtkm_cont.dir/UnknownArrayHandle.cxx.o CMakeFiles/vtkm_cont.dir/ArrayHandleVirtual.cxx.o CMakeFiles/vtkm_cont.dir/StorageVirtual.cxx.o CMakeFiles/vtkm_cont.dir/serial/internal/DeviceAdapterAlgorithmSerial.cxx.o CMakeFiles/vtkm_cont.dir/serial/internal/DeviceAdapterRuntimeDetectorSerial.cxx.o CMakeFiles/vtkm_cont.dir/tbb/internal/DeviceAdapterRuntimeDetectorTBB.cxx.o CMakeFiles/vtkm_cont.dir/openmp/internal/DeviceAdapterRuntimeDetectorOpenMP.cxx.o CMakeFiles/vtkm_cont.dir/cuda/internal/DeviceAdapterRuntimeDetectorCuda.cxx.o CMakeFiles/vtkm_cont.dir/kokkos/internal/DeviceAdapterRuntimeDetectorKokkos.cxx.o  -Wl,-rpath,/<<PKGBUILDDIR>>/build.python3.9/lib/arm-linux-gnueabihf: ../../../../../../../lib/arm-linux-gnueabihf/libvtkmdiympi_nompi.so -pthread -ldl 
cd /<<PKGBUILDDIR>>/build.python3.9/VTK/ThirdParty/vtkm/vtkvtkm/vtk-m/vtkm/cont && /usr/bin/cmake -E cmake_symlink_library ../../../../../../../lib/arm-linux-gnueabihf/libvtkm_cont-pv5.9.so.1 ../../../../../../../lib/arm-linux-gnueabihf/libvtkm_cont-pv5.9.so.1 ../../../../../../../lib/arm-linux-gnueabihf/libvtkm_cont-pv5.9.so
make[4]: Leaving directory '/<<PKGBUILDDIR>>/build.python3.9'
[  7%] Built target vtkm_cont
make[3]: Leaving directory '/<<PKGBUILDDIR>>/build.python3.9'
make[2]: *** [Makefile:163: all] Error 2
make[2]: Leaving directory '/<<PKGBUILDDIR>>/build.python3.9'
dh_auto_build: error: cd build.python3.9 && make -j4 "INSTALL=install --strip-program=true" VERBOSE=1 returned exit code 2
make[1]: *** [debian/rules:95: my_build_python3.9] Error 25
make[1]: Leaving directory '/<<PKGBUILDDIR>>'
make: *** [debian/rules:8: build-arch] Error 2