Raspbian Package Auto-Building

Buildd status for bird2 (bookworm-staging)

Debian PTSTrackerChangelogBugspackages.d.obuildd.d.o

Package(s): Suite:
Compact mode Co-maintainers

ArchitectureVersionStatusForBuilddStateMiscLogs
Buildd exposure stats armhf  2.0.8-2Build-Attempted30d 22h 55mbm-wb-01out-of-datemisc:extraold | all (2)

Tail of log for bird2 on armhf:

obj/lib/hash_test 0.037452895s                                           [ OK ] 
obj/lib/printf_test 2>/dev/null && touch obj/lib/printf_test.ok
obj/lib/printf_test 0.004036764s                                         [ OK ] 
obj/nest/a-set_test 2>/dev/null && touch obj/nest/a-set_test.ok
obj/nest/a-set_test 0.013099646s                                         [ OK ] 
obj/nest/a-path_test 2>/dev/null && touch obj/nest/a-path_test.ok
obj/lib/bitmap_test: t_hmap_set_clear_fill: Timeout expired
obj/lib/bitmap_test: t_hmap_set_clear_fill 5.002747224s                  [FAIL] 
obj/lib/bitmap_test 6.464109481s                                         [FAIL] 
make[1]: *** [Makefile:180: obj/lib/bitmap_test.ok] Error 1
make[1]: *** Waiting for unfinished jobs....
obj/nest/a-path_test 0.611949291s                                        [ OK ] 
make[1]: Leaving directory '/<<PKGBUILDDIR>>'
dh_auto_test: error: make -j4 test VERBOSE=1 returned exit code 2
make: *** [debian/rules:21: build-arch] Error 25