Raspbian Package Auto-Building

Buildd status for selected packages (bullseye-staging)

Bugs

Package(s): Suite:
Compact mode Co-maintainers

Package armhf
Buildd exposure stats
✔ bind-dyndb-ldapInstalled
✘ tilix  Build-Attempted
✔ suricataInstalled
✔ veyonInstalled
✔ gearyInstalled
✔ ismrmrdBuild-Attempted
✔ mingw32-binutilsBuild-Attempted
✔ asterisk-chan-capiBuild-Attempted
✔ bbhashBuild-Attempted
✔ bornagainBuild-Attempted
✔ fpzipBuild-Attempted
✔ gatb-coreBuild-Attempted
✔ hyperspyBuild-Attempted
✔ librandomxBuild-Attempted
✔ libxsmmBuild-Attempted
✔ micropythonBuild-Attempted
✔ nsd3Build-Attempted
✔ oliveBuild-Attempted
✔ pbseqlibBuild-Attempted
Package armhf
Buildd exposure stats
✔ plink2Build-Attempted
✔ prometheus-libvirt-exporterBuild-Attempted
✔ qwinffBuild-Attempted
✔ ruby2.1Build-Attempted
✔ rust-mach-o-sysBuild-Attempted
✔ rust-pq-sysBuild-Attempted
✔ rust-ucd-generateBuild-Attempted
✔ tiledarrayBuild-Attempted
✔ xf86-video-msmBuild-Attempted
✔ openmsBuild-Attempted
✔ sagemathBuild-Attempted

Tail of log for tilix on armhf:

-------


Summary of Failures:

2/2 tilix_test             FAIL           4.51s (exit status 1)

Ok:                 1   
Expected Fail:      0   
Fail:               1   
Unexpected Pass:    0   
Skipped:            0   
Timeout:            0   
dh_auto_test: error: cd obj-arm-linux-gnueabihf && LC_ALL=C.UTF-8 MESON_TESTTHREADS=4 ninja test returned exit code 1
make: *** [debian/rules:11: build-arch] Error 25

Tail of log for ismrmrd on armhf:

./tests/test_acquisitions.cpp(7): Leaving test suite "AcquisitionsTest"
Test is aborted
Leaving test module "ISMRMRD Unit Tests"

*** 1 failure is detected in the test module "ISMRMRD Unit Tests"
make[4]: *** [tests/CMakeFiles/check.dir/build.make:79: tests/CMakeFiles/check] Error 201
make[4]: Leaving directory '/<<PKGBUILDDIR>>/obj-arm-linux-gnueabihf'
make[3]: *** [CMakeFiles/Makefile2:435: tests/CMakeFiles/check.dir/all] Error 2
make[3]: Leaving directory '/<<PKGBUILDDIR>>/obj-arm-linux-gnueabihf'
make[2]: *** [CMakeFiles/Makefile2:442: tests/CMakeFiles/check.dir/rule] Error 2
make[2]: Leaving directory '/<<PKGBUILDDIR>>/obj-arm-linux-gnueabihf'
make[1]: *** [Makefile:325: check] Error 2
make[1]: Leaving directory '/<<PKGBUILDDIR>>/obj-arm-linux-gnueabihf'
dh_auto_test: error: cd obj-arm-linux-gnueabihf && make -j4 check ARGS\+=-j4 returned exit code 2
make: *** [debian/rules:14: binary-arch] Error 25

Tail of log for mingw32-binutils on armhf:

dpkg-buildpackage
-----------------

dpkg-buildpackage: info: source package mingw32-binutils
dpkg-buildpackage: info: source version 2.20-0.2
dpkg-buildpackage: info: source distribution unstable
 dpkg-source --before-build .
dpkg-buildpackage: info: host architecture armhf
 fakeroot debian/rules clean
dh_testdir
dh_testroot
rm -rf /<<PKGBUILDDIR>>/build_dir *-stamp
dh_clean
dh_clean: error: Compatibility levels before 5 are no longer supported (level 4 requested)
make: *** [debian/rules:123: clean] Error 25

Tail of log for asterisk-chan-capi on armhf:

 9096 |   if (cid_name == 0 && i->owner->cid.cid_name && *i->owner->cid.cid_name) {
      |                                ^~
chan_capi.c:9096:59: error: invalid use of undefined type 'struct ast_channel'
 9096 |   if (cid_name == 0 && i->owner->cid.cid_name && *i->owner->cid.cid_name) {
      |                                                           ^~
In file included from /usr/include/asterisk/asterisk.h:23,
                 from chan_capi.h:20,
                 from chan_capi.c:32:
chan_capi.c:9097:34: error: invalid use of undefined type 'struct ast_channel'
 9097 |   cid_name = ast_strdupa(i->owner->cid.cid_name);
      |                                  ^~
make[1]: *** [Makefile:198: chan_capi.o] Error 1
make[1]: Leaving directory '/<<PKGBUILDDIR>>'
dh_auto_build: error: make -j1 returned exit code 2
make: *** [debian/rules:3: build-arch] Error 25

Tail of log for bbhash on armhf:

BooPHF.h:817:35: error: expected ‘)’ before ‘word’
  817 |   return (uint64_t)(((__uint128_t)word * (__uint128_t)p) >> 64);
      |                     ~             ^~~~
      |                                   )
BooPHF.h:817:64: error: expected ‘)’ before ‘;’ token
  817 |   return (uint64_t)(((__uint128_t)word * (__uint128_t)p) >> 64);
      |                    ~                                           ^
      |                                                                )
make[1]: *** [makefile:25: example_custom_hash] Error 1
make[1]: *** Waiting for unfinished jobs....
make[1]: *** [makefile:22: example] Error 1
make[1]: *** [makefile:29: Bootest] Error 1
make[1]: Leaving directory '/<<PKGBUILDDIR>>'
dh_auto_build: error: make -j4 "INSTALL=install --strip-program=true" returned exit code 2
make: *** [debian/rules:21: binary-arch] Error 25

Tail of log for bornagain on armhf:

gmake[3]: Entering directory '/<<PKGBUILDDIR>>/obj-arm-linux-gnueabihf/CMakeFiles/CMakeTmp'
Building C object CMakeFiles/cmTC_6c144.dir/CheckIncludeFile.c.o
/usr/bin/cc   -g -O2 -ffile-prefix-map=/<<PKGBUILDDIR>>=. -fstack-protector-strong -Wformat -Werror=format-security -Wdate-time -D_FORTIFY_SOURCE=2 -pipe -m32 -Wall -W -fPIC  -std=gnu11 -o CMakeFiles/cmTC_6c144.dir/CheckIncludeFile.c.o -c /<<PKGBUILDDIR>>/obj-arm-linux-gnueabihf/CMakeFiles/CMakeTmp/CheckIncludeFile.c
cc: error: unrecognized command-line option '-m32'; did you mean '-mbe32'?
gmake[3]: *** [CMakeFiles/cmTC_6c144.dir/build.make:85: CMakeFiles/cmTC_6c144.dir/CheckIncludeFile.c.o] Error 1
gmake[3]: Leaving directory '/<<PKGBUILDDIR>>/obj-arm-linux-gnueabihf/CMakeFiles/CMakeTmp'
gmake[2]: *** [Makefile:140: cmTC_6c144/fast] Error 2
gmake[2]: Leaving directory '/<<PKGBUILDDIR>>/obj-arm-linux-gnueabihf/CMakeFiles/CMakeTmp'



dh_auto_configure: error: cd obj-arm-linux-gnueabihf && cmake -DCMAKE_INSTALL_PREFIX=/usr -DCMAKE_BUILD_TYPE=None -DCMAKE_INSTALL_SYSCONFDIR=/etc -DCMAKE_INSTALL_LOCALSTATEDIR=/var -DCMAKE_EXPORT_NO_PACKAGE_REGISTRY=ON -DCMAKE_FIND_PACKAGE_NO_PACKAGE_REGISTRY=ON -DCMAKE_INSTALL_RUNSTATEDIR=/run "-GUnix Makefiles" -DCMAKE_VERBOSE_MAKEFILE=ON -DCMAKE_INSTALL_LIBDIR=lib/arm-linux-gnueabihf -DCMAKE_DEB_HOST_MULTIARCH=arm-linux-gnueabihf -DCONFIGURE_MANPAGE=ON -DBORNAGAIN_MPI=ON -DBORNAGAIN_GENERATE_PYTHON_DOCS=ON -DBORNAGAIN_GENERATE_BINDINGS=ON "-DPython_ADDITIONAL_VERSIONS=3.9 3.8" .. returned exit code 1
make[1]: *** [debian/rules:37: override_dh_auto_configure] Error 25
make[1]: Leaving directory '/<<PKGBUILDDIR>>'
make: *** [debian/rules:34: build-arch] Error 2

Tail of log for fpzip on armhf:

one or more tests failed


0% tests passed, 1 tests failed out of 1

Total Test time (real) =   0.05 sec

The following tests FAILED:
	  1 - compress-decompress-validate (Failed)
Errors while running CTest
make[1]: *** [Makefile:140: test] Error 8
make[1]: Leaving directory '/<<PKGBUILDDIR>>/obj-arm-linux-gnueabihf'
	rm -fr -- /tmp/dh-xdg-rundir-lpLDoepB
dh_auto_test: error: cd obj-arm-linux-gnueabihf && make -j4 test ARGS\+=-j4 returned exit code 2
make: *** [debian/rules:8: build-arch] Error 25

Tail of log for gatb-core on armhf:

/<<PKGBUILDDIR>>/gatb-core/src/gatb/debruijn/impl/GraphUnitigs.cpp:602:1: note: parameter passing for argument of type ‘std::vector<long long unsigned int>::iterator’ changed in GCC 7.1
[ 86%] Linking CXX static library ../lib/None/libgatbcore.a
cd /<<PKGBUILDDIR>>/obj-arm-linux-gnueabihf/src && /usr/bin/cmake -P CMakeFiles/gatbcore-static.dir/cmake_clean_target.cmake
cd /<<PKGBUILDDIR>>/obj-arm-linux-gnueabihf/src && /usr/bin/cmake -E cmake_link_script CMakeFiles/gatbcore-static.dir/link.txt --verbose=1
/usr/bin/ar qc ../lib/None/libgatbcore.a CMakeFiles/gatbcore-static.dir/gatb/bank/impl/Bank.cpp.o CMakeFiles/gatbcore-static.dir/gatb/bank/impl/BankAlbum.cpp.o CMakeFiles/gatbcore-static.dir/gatb/bank/impl/BankBinary.cpp.o CMakeFiles/gatbcore-static.dir/gatb/bank/impl/BankConverterAlgorithm.cpp.o CMakeFiles/gatbcore-static.dir/gatb/bank/impl/BankFasta.cpp.o CMakeFiles/gatbcore-static.dir/gatb/bank/impl/BankHelpers.cpp.o CMakeFiles/gatbcore-static.dir/gatb/bank/impl/BankRandom.cpp.o CMakeFiles/gatbcore-static.dir/gatb/bank/impl/BankSplitter.cpp.o CMakeFiles/gatbcore-static.dir/gatb/bcalm2/bcalm_algo.cpp.o CMakeFiles/gatbcore-static.dir/gatb/bcalm2/bglue_algo.cpp.o CMakeFiles/gatbcore-static.dir/gatb/bcalm2/logging.cpp.o CMakeFiles/gatbcore-static.dir/gatb/bcalm2/ograph.cpp.o CMakeFiles/gatbcore-static.dir/gatb/debruijn/impl/BranchingAlgorithm.cpp.o CMakeFiles/gatbcore-static.dir/gatb/debruijn/impl/Frontline.cpp.o CMakeFiles/gatbcore-static.dir/gatb/debruijn/impl/Graph.cpp.o CMakeFiles/gatbcore-static.dir/gatb/debruijn/impl/GraphUnitigs.cpp.o CMakeFiles/gatbcore-static.dir/gatb/debruijn/impl/IterativeExtensions.cpp.o CMakeFiles/gatbcore-static.dir/gatb/debruijn/impl/LinkTigs.cpp.o CMakeFiles/gatbcore-static.dir/gatb/debruijn/impl/Simplifications.cpp.o CMakeFiles/gatbcore-static.dir/gatb/debruijn/impl/Terminator.cpp.o CMakeFiles/gatbcore-static.dir/gatb/debruijn/impl/Traversal.cpp.o CMakeFiles/gatbcore-static.dir/gatb/debruijn/impl/UnitigsConstructionAlgorithm.cpp.o CMakeFiles/gatbcore-static.dir/gatb/kmer/impl/BloomAlgorithm.cpp.o CMakeFiles/gatbcore-static.dir/gatb/kmer/impl/BloomBuilder.cpp.o CMakeFiles/gatbcore-static.dir/gatb/kmer/impl/Configuration.cpp.o CMakeFiles/gatbcore-static.dir/gatb/kmer/impl/ConfigurationAlgorithm.cpp.o CMakeFiles/gatbcore-static.dir/gatb/kmer/impl/DebloomAlgorithm.cpp.o CMakeFiles/gatbcore-static.dir/gatb/kmer/impl/DebloomMinimizerAlgorithm.cpp.o CMakeFiles/gatbcore-static.dir/gatb/kmer/impl/LinearCounter.cpp.o CMakeFiles/gatbcore-static.dir/gatb/kmer/impl/MPHFAlgorithm.cpp.o CMakeFiles/gatbcore-static.dir/gatb/kmer/impl/Model.cpp.o CMakeFiles/gatbcore-static.dir/gatb/kmer/impl/ModelData.cpp.o CMakeFiles/gatbcore-static.dir/gatb/kmer/impl/PartiInfo.cpp.o CMakeFiles/gatbcore-static.dir/gatb/kmer/impl/PartitionsCommand.cpp.o CMakeFiles/gatbcore-static.dir/gatb/kmer/impl/RepartitionAlgorithm.cpp.o CMakeFiles/gatbcore-static.dir/gatb/kmer/impl/SortingCountAlgorithm.cpp.o CMakeFiles/gatbcore-static.dir/gatb/system/impl/FileSystemCommon.cpp.o CMakeFiles/gatbcore-static.dir/gatb/system/impl/FileSystemLinux.cpp.o CMakeFiles/gatbcore-static.dir/gatb/system/impl/FileSystemMacos.cpp.o CMakeFiles/gatbcore-static.dir/gatb/system/impl/System.cpp.o CMakeFiles/gatbcore-static.dir/gatb/system/impl/SystemInfoCommon.cpp.o CMakeFiles/gatbcore-static.dir/gatb/system/impl/ThreadLinux.cpp.o CMakeFiles/gatbcore-static.dir/gatb/system/impl/ThreadMacos.cpp.o CMakeFiles/gatbcore-static.dir/gatb/tools/collections/impl/Bloom.cpp.o CMakeFiles/gatbcore-static.dir/gatb/tools/compression/DnaCoder.cpp.o CMakeFiles/gatbcore-static.dir/gatb/tools/compression/HeaderCoder.cpp.o CMakeFiles/gatbcore-static.dir/gatb/tools/compression/Leon.cpp.o CMakeFiles/gatbcore-static.dir/gatb/tools/compression/RangeCoder.cpp.o CMakeFiles/gatbcore-static.dir/gatb/tools/designpattern/impl/Command.cpp.o CMakeFiles/gatbcore-static.dir/gatb/tools/designpattern/impl/Observer.cpp.o CMakeFiles/gatbcore-static.dir/gatb/tools/misc/api/Data.cpp.o CMakeFiles/gatbcore-static.dir/gatb/tools/misc/impl/Algorithm.cpp.o CMakeFiles/gatbcore-static.dir/gatb/tools/misc/impl/Histogram.cpp.o CMakeFiles/gatbcore-static.dir/gatb/tools/misc/impl/OptionsParser.cpp.o CMakeFiles/gatbcore-static.dir/gatb/tools/misc/impl/Progress.cpp.o CMakeFiles/gatbcore-static.dir/gatb/tools/misc/impl/Property.cpp.o CMakeFiles/gatbcore-static.dir/gatb/tools/misc/impl/TimeInfo.cpp.o CMakeFiles/gatbcore-static.dir/gatb/tools/misc/impl/Tokenizer.cpp.o CMakeFiles/gatbcore-static.dir/gatb/tools/misc/impl/Tool.cpp.o CMakeFiles/gatbcore-static.dir/gatb/tools/misc/impl/XmlReader.cpp.o CMakeFiles/gatbcore-static.dir/gatb/tools/storage/impl/Storage.cpp.o CMakeFiles/gatbcore-static.dir/gatb/tools/storage/impl/StorageTools.cpp.o CMakeFiles/gatbcore-static.dir/gatb/template/TemplateSpecialization1.cpp.in_128.cpp.o CMakeFiles/gatbcore-static.dir/gatb/template/TemplateSpecialization1.cpp.in_32.cpp.o CMakeFiles/gatbcore-static.dir/gatb/template/TemplateSpecialization1.cpp.in_64.cpp.o CMakeFiles/gatbcore-static.dir/gatb/template/TemplateSpecialization1.cpp.in_96.cpp.o CMakeFiles/gatbcore-static.dir/gatb/template/TemplateSpecialization10.cpp.in_128.cpp.o CMakeFiles/gatbcore-static.dir/gatb/template/TemplateSpecialization10.cpp.in_32.cpp.o CMakeFiles/gatbcore-static.dir/gatb/template/TemplateSpecialization10.cpp.in_64.cpp.o CMakeFiles/gatbcore-static.dir/gatb/template/TemplateSpecialization10.cpp.in_96.cpp.o CMakeFiles/gatbcore-static.dir/gatb/template/TemplateSpecialization2.cpp.in_128.cpp.o CMakeFiles/gatbcore-static.dir/gatb/template/TemplateSpecialization2.cpp.in_32.cpp.o CMakeFiles/gatbcore-static.dir/gatb/template/TemplateSpecialization2.cpp.in_64.cpp.o CMakeFiles/gatbcore-static.dir/gatb/template/TemplateSpecialization2.cpp.in_96.cpp.o CMakeFiles/gatbcore-static.dir/gatb/template/TemplateSpecialization3.cpp.in_128.cpp.o CMakeFiles/gatbcore-static.dir/gatb/template/TemplateSpecialization3.cpp.in_32.cpp.o CMakeFiles/gatbcore-static.dir/gatb/template/TemplateSpecialization3.cpp.in_64.cpp.o CMakeFiles/gatbcore-static.dir/gatb/template/TemplateSpecialization3.cpp.in_96.cpp.o CMakeFiles/gatbcore-static.dir/gatb/template/TemplateSpecialization4.cpp.in_128.cpp.o CMakeFiles/gatbcore-static.dir/gatb/template/TemplateSpecialization4.cpp.in_32.cpp.o CMakeFiles/gatbcore-static.dir/gatb/template/TemplateSpecialization4.cpp.in_64.cpp.o CMakeFiles/gatbcore-static.dir/gatb/template/TemplateSpecialization4.cpp.in_96.cpp.o CMakeFiles/gatbcore-static.dir/gatb/template/TemplateSpecialization5.cpp.in_128.cpp.o CMakeFiles/gatbcore-static.dir/gatb/template/TemplateSpecialization5.cpp.in_32.cpp.o CMakeFiles/gatbcore-static.dir/gatb/template/TemplateSpecialization5.cpp.in_64.cpp.o CMakeFiles/gatbcore-static.dir/gatb/template/TemplateSpecialization5.cpp.in_96.cpp.o CMakeFiles/gatbcore-static.dir/gatb/template/TemplateSpecialization6.cpp.in_128.cpp.o CMakeFiles/gatbcore-static.dir/gatb/template/TemplateSpecialization6.cpp.in_32.cpp.o CMakeFiles/gatbcore-static.dir/gatb/template/TemplateSpecialization6.cpp.in_64.cpp.o CMakeFiles/gatbcore-static.dir/gatb/template/TemplateSpecialization6.cpp.in_96.cpp.o CMakeFiles/gatbcore-static.dir/gatb/template/TemplateSpecialization7.cpp.in_128.cpp.o CMakeFiles/gatbcore-static.dir/gatb/template/TemplateSpecialization7.cpp.in_32.cpp.o CMakeFiles/gatbcore-static.dir/gatb/template/TemplateSpecialization7.cpp.in_64.cpp.o CMakeFiles/gatbcore-static.dir/gatb/template/TemplateSpecialization7.cpp.in_96.cpp.o CMakeFiles/gatbcore-static.dir/gatb/template/TemplateSpecialization8.cpp.in_128.cpp.o CMakeFiles/gatbcore-static.dir/gatb/template/TemplateSpecialization8.cpp.in_32.cpp.o CMakeFiles/gatbcore-static.dir/gatb/template/TemplateSpecialization8.cpp.in_64.cpp.o CMakeFiles/gatbcore-static.dir/gatb/template/TemplateSpecialization8.cpp.in_96.cpp.o CMakeFiles/gatbcore-static.dir/gatb/template/TemplateSpecialization9.cpp.in_128.cpp.o CMakeFiles/gatbcore-static.dir/gatb/template/TemplateSpecialization9.cpp.in_32.cpp.o CMakeFiles/gatbcore-static.dir/gatb/template/TemplateSpecialization9.cpp.in_64.cpp.o CMakeFiles/gatbcore-static.dir/gatb/template/TemplateSpecialization9.cpp.in_96.cpp.o
/usr/bin/ranlib ../lib/None/libgatbcore.a
make[4]: Leaving directory '/<<PKGBUILDDIR>>/obj-arm-linux-gnueabihf'
[ 86%] Built target gatbcore-static
make[3]: Leaving directory '/<<PKGBUILDDIR>>/obj-arm-linux-gnueabihf'
make[2]: *** [Makefile:174: all] Error 2
make[2]: Leaving directory '/<<PKGBUILDDIR>>/obj-arm-linux-gnueabihf'
dh_auto_build: error: cd obj-arm-linux-gnueabihf && make -j4 "INSTALL=install --strip-program=true" VERBOSE=1 returned exit code 2
make[1]: *** [debian/rules:21: override_dh_auto_build-arch] Error 25
make[1]: Leaving directory '/<<PKGBUILDDIR>>'
make: *** [debian/rules:15: binary-arch] Error 2

Tail of log for hyperspy on armhf:

SKIPPED [1] hyperspy/tests/signal/test_signal_operators.py:107: Inplace not supported by LazySignals
SKIPPED [1] hyperspy/tests/signal/test_signal_operators.py:118: Inplace not supported by LazySignals
XFAIL hyperspy/tests/drawing/test_utils.py::test_create_figure
  reason: agg backend does not support on_close event.
XFAIL hyperspy/tests/io/test_hdf5.py::TestLoadingNewSavedMetadata::test_binary_string
  dill is not guaranteed to load across Python versions
XPASS hyperspy/tests/samfire/test_samfire.py::test_multiprocessed Sometimes the number of failed pixels > 3 when using multiprocessing. Unknown reason
FAILED hyperspy/tests/misc/test_date_time_tools.py::test_serial_date_to_ISO_format
FAILED hyperspy/tests/misc/test_date_time_tools.py::test_ISO_format_to_serial_date
FAILED hyperspy/tests/misc/test_hist_tools.py::TestHistogramBinMethodsBadDataset::test_lazy_fd_logger_warning
FAILED hyperspy/tests/misc/test_hist_tools.py::TestHistogramBinMethodsBadDataset::test_lazy_deprecation_warnings[freedman]
= 4 failed, 3719 passed, 75 skipped, 2 xfailed, 1 xpassed, 74 warnings in 1461.26s (0:24:21) =
E: pybuild pybuild:353: test: plugin distutils failed with: exit code=1: cd /<<PKGBUILDDIR>>/.pybuild/cpython3_3.9_hyperspy/build; python3.9 -m pytest 
dh_auto_test: error: pybuild --test --test-pytest -i python{version} -p 3.9 returned exit code 13
make: *** [debian/rules:9: build-arch] Error 25

Tail of log for librandomx on armhf:

collect2: error: ld returned 1 exit status
make[3]: *** [CMakeFiles/randomx-benchmark.dir/build.make:122: randomx-benchmark] Error 1
make[3]: Leaving directory '/<<PKGBUILDDIR>>/obj-arm-linux-gnueabihf'
make[2]: *** [CMakeFiles/Makefile2:104: CMakeFiles/randomx-benchmark.dir/all] Error 2
make[2]: *** Waiting for unfinished jobs....
[100%] Linking CXX executable randomx-tests
/usr/bin/cmake -E cmake_link_script CMakeFiles/randomx-tests.dir/link.txt --verbose=1
/usr/bin/c++ -g -O2 -ffile-prefix-map=/<<PKGBUILDDIR>>=. -fstack-protector-strong -Wformat -Werror=format-security -Wdate-time -D_FORTIFY_SOURCE=2 -Wl,-z,relro -rdynamic CMakeFiles/randomx-tests.dir/src/tests/tests.cpp.o -o randomx-tests  -Wl,-rpath,/<<PKGBUILDDIR>>/obj-arm-linux-gnueabihf librandomx.so.0.0.0 
make[3]: Leaving directory '/<<PKGBUILDDIR>>/obj-arm-linux-gnueabihf'
[100%] Built target randomx-tests
make[2]: Leaving directory '/<<PKGBUILDDIR>>/obj-arm-linux-gnueabihf'
make[1]: *** [Makefile:152: all] Error 2
make[1]: Leaving directory '/<<PKGBUILDDIR>>/obj-arm-linux-gnueabihf'
dh_auto_build: error: cd obj-arm-linux-gnueabihf && make -j4 "INSTALL=install --strip-program=true" VERBOSE=1 returned exit code 2
make: *** [debian/rules:46: binary-arch] Error 25

Tail of log for libxsmm on armhf:

      |   ^~~~~
In file included from include/libxsmm.h:65,
                 from ./src/libxsmm_gemm_diff.h:34,
                 from ./src/libxsmm_main.c:31:
./src/libxsmm_main.c: In function ‘libxsmm_init’:
include/libxsmm_sync.h:70:29: warning: implicit declaration of function ‘__builtin_ia32_pause’; did you mean ‘__builtin_isspace’? [-Wimplicit-function-declaration]
   70 | # define LIBXSMM_SYNC_PAUSE __builtin_ia32_pause()
      |                             ^~~~~~~~~~~~~~~~~~~~
./src/libxsmm_main.c:719:36: note: in expansion of macro ‘LIBXSMM_SYNC_PAUSE’
  719 |       if (0 != once) break; else { LIBXSMM_SYNC_PAUSE; }
      |                                    ^~~~~~~~~~~~~~~~~~
make[1]: *** [Makefile:721: build/intel64/libxsmm_main.o] Error 1
make[1]: Leaving directory '/<<PKGBUILDDIR>>'
dh_auto_build: error: make -j1 returned exit code 2
make: *** [debian/rules:7: build-arch] Error 25

Tail of log for micropython on armhf:

pass  unicode/unicode_subscr.py
skip  unix/extra_coverage.py
pass  unix/ffi_callback.py
pass  unix/ffi_float.py
pass  unix/ffi_float2.py
756 tests performed (20123 individual testcases)
754 tests passed
18 tests skipped: cmd_parsetree btree1 vfs_blockdev vfs_fat_fileio1 vfs_fat_fileio2 vfs_fat_more vfs_fat_oldproto vfs_fat_ramdisk vfs_fat_ramdisklarge vfs_lfs vfs_lfs_corrupt vfs_lfs_error vfs_lfs_file vfs_lfs_mount sys_settrace_features sys_settrace_generator sys_settrace_loop extra_coverage
2 tests failed: urandom_basic import_pkg7
make[2]: *** [Makefile:198: test] Error 1
make[2]: Leaving directory '/<<PKGBUILDDIR>>/ports/unix'
dh_auto_test: error: cd ports/unix && make -j4 test STRIP=true MICROPY_PY_BTREE=0 MICROPY_SSL_AXTLS=0 MICROPY_SSL_MBEDTLS=1 MICROPY_PY_JNI=1 "TESTS_ARGS=-e '(?:ussl_basic|mpy_native)'" returned exit code 2
make[1]: *** [debian/rules:65: override_dh_auto_test-arch] Error 25
make[1]: Leaving directory '/<<PKGBUILDDIR>>'
make: *** [debian/rules:37: binary-arch] Error 2

Tail of log for nsd3 on armhf:

#define FACILITY LOG_DAEMON
#define MAX_INTERFACES 8
#define TCP_TIMEOUT 120
#define ROOT_SERVER /**/
#define INET6 /**/
#define BIND8_STATS /**/
#define NDEBUG /**/
#define RATELIMIT /**/
#define HAVE_SSL /**/

configure: exit 1
dh_auto_configure: error: ./configure --build=arm-linux-gnueabihf --prefix=/usr --includedir=\${prefix}/include --mandir=\${prefix}/share/man --infodir=\${prefix}/share/info --sysconfdir=/etc --localstatedir=/var --disable-option-checking --disable-silent-rules --libexecdir=\${prefix}/lib/nsd3 --disable-maintainer-mode --disable-dependency-tracking --with-configdir=/etc/nsd3 --with-nsd_conf_file=/etc/nsd3/nsd.conf --with-pidfile=/var/run/nsd3/nsd.pid --with-dbfile=/var/lib/nsd3/nsd.db --with-zonesdir=/etc/nsd3 --with-difffile=/var/lib/nsd3/ixfr.db --with-xfrdfile=/var/lib/nsd3/xfrd.state --disable-largefile --enable-root-server --enable-mmap --enable-ratelimit returned exit code 1
make[1]: *** [debian/rules:32: override_dh_auto_configure] Error 25
make[1]: Leaving directory '/<<PKGBUILDDIR>>'
make: *** [debian/rules:26: build-arch] Error 2

Tail of log for olive on armhf:

                 from ./project/effect.h:10,
                 from playback/playback.cpp:11:
/usr/include/arm-linux-gnueabihf/qt5/QtGui/qopengltexture.h:466:24: note: declared here
  466 |     QT_DEPRECATED void setData(int mipLevel,
      |                        ^~~~~~~
playback/playback.cpp:247:13: warning: this 'if' clause does not guard... [-Wmisleading-indentation]
  247 |             if (copied) delete [] data;
      |             ^~
playback/playback.cpp:249:4: note: ...this statement, but the latter is misleadingly indented as if it were guarded by the 'if'
  249 |    glPixelStorei(GL_UNPACK_ROW_LENGTH, 0);
      |    ^~~~~~~~~~~~~
make[1]: *** [Makefile:1392: playback.o] Error 1
make[1]: Leaving directory '/<<PKGBUILDDIR>>'
dh_auto_build: error: make -j4 returned exit code 2
make: *** [debian/rules:17: build-arch] Error 25

Tail of log for pbseqlib on armhf:

                 from ../alignment/algorithms/anchoring/BWTSearch.hpp:6,
                 from ../alignment/algorithms/anchoring/BWTSearch.cpp:1:
../alignment/suffixarray/SuffixArray.hpp: In member function ‘void SuffixArray<T, Sigma, Compare, Tuple>::LarssonBuildSuffixArray(T*, SAIndexLength, Sigma&)’:
../alignment/suffixarray/SuffixArray.hpp:288:44: error: narrowing conversion of ‘4294967295’ from ‘unsigned int’ to ‘long int’ [-Wnarrowing]
  288 |         LarssonSuffixSort<SAIndex, UINT_MAX> sorter;
      |                                            ^
../alignment/suffixarray/SuffixArray.hpp:289:84: error: ‘sorter’ cannot be used as a function
  289 |         sorter(index, p, ((SAIndex)targetLength), ((SAIndex)maxVal + 1), (SAIndex)1);
      |                                                                                    ^
[44/187] c++ -Ilibblasr.so.5.3.4.p -I. -I.. -I/usr/include -I/usr/include/hdf5/serial -fdiagnostics-color=always -pipe -D_FILE_OFFSET_BITS=64 -Wall -Winvalid-pch -Wnon-virtual-dtor -Wextra -Wpedantic -std=c++14 -g -O2 -ffile-prefix-map=/<<BUILDDIR>>/pbseqlib-5.3.4+dfsg=. -fstack-protector-strong -Wformat -Werror=format-security -O3 -std=c++14 -Wdate-time -D_FORTIFY_SOURCE=2 -DHAVE_HDF5_1_10_1 -O3 -fPIC -DBOOST_ALL_NO_LIB -Wno-delete-non-virtual-dtor -Wno-unused-variable -Wno-non-virtual-dtor -MD -MQ libblasr.so.5.3.4.p/alignment_algorithms_anchoring_FindMaxInterval.cpp.o -MF libblasr.so.5.3.4.p/alignment_algorithms_anchoring_FindMaxInterval.cpp.o.d -o libblasr.so.5.3.4.p/alignment_algorithms_anchoring_FindMaxInterval.cpp.o -c ../alignment/algorithms/anchoring/FindMaxInterval.cpp
[45/187] c++ -Ilibblasr.so.5.3.4.p -I. -I.. -I/usr/include -I/usr/include/hdf5/serial -fdiagnostics-color=always -pipe -D_FILE_OFFSET_BITS=64 -Wall -Winvalid-pch -Wnon-virtual-dtor -Wextra -Wpedantic -std=c++14 -g -O2 -ffile-prefix-map=/<<BUILDDIR>>/pbseqlib-5.3.4+dfsg=. -fstack-protector-strong -Wformat -Werror=format-security -O3 -std=c++14 -Wdate-time -D_FORTIFY_SOURCE=2 -DHAVE_HDF5_1_10_1 -O3 -fPIC -DBOOST_ALL_NO_LIB -Wno-delete-non-virtual-dtor -Wno-unused-variable -Wno-non-virtual-dtor -MD -MQ libblasr.so.5.3.4.p/alignment_algorithms_sorting_MultikeyQuicksort.cpp.o -MF libblasr.so.5.3.4.p/alignment_algorithms_sorting_MultikeyQuicksort.cpp.o.d -o libblasr.so.5.3.4.p/alignment_algorithms_sorting_MultikeyQuicksort.cpp.o -c ../alignment/algorithms/sorting/MultikeyQuicksort.cpp
[46/187] c++ -Ilibblasr.so.5.3.4.p -I. -I.. -I/usr/include -I/usr/include/hdf5/serial -fdiagnostics-color=always -pipe -D_FILE_OFFSET_BITS=64 -Wall -Winvalid-pch -Wnon-virtual-dtor -Wextra -Wpedantic -std=c++14 -g -O2 -ffile-prefix-map=/<<BUILDDIR>>/pbseqlib-5.3.4+dfsg=. -fstack-protector-strong -Wformat -Werror=format-security -O3 -std=c++14 -Wdate-time -D_FORTIFY_SOURCE=2 -DHAVE_HDF5_1_10_1 -O3 -fPIC -DBOOST_ALL_NO_LIB -Wno-delete-non-virtual-dtor -Wno-unused-variable -Wno-non-virtual-dtor -MD -MQ libblasr.so.5.3.4.p/alignment_algorithms_sorting_LightweightSuffixArray.cpp.o -MF libblasr.so.5.3.4.p/alignment_algorithms_sorting_LightweightSuffixArray.cpp.o.d -o libblasr.so.5.3.4.p/alignment_algorithms_sorting_LightweightSuffixArray.cpp.o -c ../alignment/algorithms/sorting/LightweightSuffixArray.cpp
ninja: build stopped: subcommand failed.
dh_auto_build: error: cd obj-arm-linux-gnueabihf && LC_ALL=C.UTF-8 ninja -j4 -v returned exit code 1
make: *** [debian/rules:25: binary-arch] Error 25

Tail of log for plink2 on armhf:

g++ -Wdate-time -D_FORTIFY_SOURCE=2 -g -O2 -ffile-prefix-map=/<<BUILDDIR>>/plink2-2.00~a3-210203+dfsg=. -fstack-protector-strong -Wformat -Werror=format-security -DSIMDE_ENABLE_OPENMP -fopenmp-simd -O3 -I/usr/include/simde -std=c++11 -O2 -DZSTD_MULTITHREAD   -Wall -Wextra -Wshadow -Wformat-security -Wold-style-cast -I../simde ../include/plink2_base.cc ../include/plink2_bits.cc ../include/pgenlib_misc.cc ../include/pgenlib_read.cc ../include/pgenlib_write.cc ../include/plink2_bgzf.cc ../include/plink2_stats.cc ../include/plink2_string.cc ../include/plink2_text.cc ../include/plink2_thread.cc ../include/plink2_zstfile.cc ../plink2.cc ../plink2_adjust.cc ../plink2_cmdline.cc ../plink2_common.cc ../plink2_compress_stream.cc ../plink2_data.cc ../plink2_decompress.cc ../plink2_export.cc ../plink2_fasta.cc ../plink2_filter.cc ../plink2_glm.cc ../plink2_help.cc ../plink2_import.cc ../plink2_ld.cc ../plink2_matrix.cc ../plink2_matrix_calc.cc ../plink2_merge.cc ../plink2_misc.cc ../plink2_psam.cc ../plink2_pvar.cc ../plink2_random.cc ../plink2_set.cc -c
../plink2_psam.cc: In function 'plink2::PglErr plink2::LoadPhenos(const char*, const RangeList*, const uintptr_t*, const SampleIdInfo*, uint32_t, uint32_t, int32_t, uint32_t, uint32_t, uint32_t, uint32_t, plink2::PhenoCol**, char**, uint32_t*, uintptr_t*)':
../plink2_psam.cc:1254:105: warning: '*' in boolean context, suggest '&&' instead [-Wint-in-bool-context]
 1254 |       if (unlikely(S_CAST(uintptr_t, tmp_bigstack_end - bigstack_base_copy) < pheno_info_alloc_byte_ct) * (xid_idx_end - xid_idx_start)) {
g++  -Wdate-time -D_FORTIFY_SOURCE=2 ../plink2_cpu.cc -c
g++ SFMT.o plink2_base.o plink2_bits.o pgenlib_misc.o pgenlib_read.o pgenlib_write.o plink2_bgzf.o plink2_stats.o plink2_string.o plink2_text.o plink2_thread.o plink2_zstfile.o plink2.o plink2_adjust.o plink2_cmdline.o plink2_common.o plink2_compress_stream.o plink2_data.o plink2_decompress.o plink2_export.o plink2_fasta.o plink2_filter.o plink2_glm.o plink2_help.o plink2_import.o plink2_ld.o plink2_matrix.o plink2_matrix_calc.o plink2_merge.o plink2_misc.o plink2_psam.o plink2_pvar.o plink2_random.o plink2_set.o plink2_cpu.o  -o plink2"" -llapack -lblas -lcblas -latlas -lm -lpthread  -lz -lzstd -Wl,-z,relro -Wl,-z,now -ldeflate
/usr/bin/ld: plink2_thread.o: in function `plink2::UpdateU64IfSmaller(unsigned long long, unsigned long long*)':
./build_dynamic/../include/plink2_thread.cc:373: undefined reference to `__atomic_compare_exchange_8'
collect2: error: ld returned 1 exit status
make[2]: *** [Makefile:157: plink2""] Error 1
make[2]: Leaving directory '/<<BUILDDIR>>/plink2-2.00~a3-210203+dfsg/build_dynamic'
dh_auto_build: error: cd build_dynamic && make -j4 "INSTALL=install --strip-program=true" returned exit code 2
make[1]: *** [debian/rules:74: override_dh_auto_build-arch] Error 25
make[1]: Leaving directory '/<<BUILDDIR>>/plink2-2.00~a3-210203+dfsg'
make: *** [debian/rules:23: binary-arch] Error 2

Tail of log for prometheus-libvirt-exporter on armhf:

net/http
go/doc
gopkg.in/alecthomas/kingpin.v2
expvar
github.com/prometheus/common/expfmt
github.com/prometheus/client_golang/prometheus
github.com/prometheus/client_golang/prometheus/promhttp
# github.com/libvirt/libvirt-go
src/github.com/libvirt/libvirt-go/connect.go:181:77: constant 2147483648 overflows ConnectGetAllDomainStatsFlags
src/github.com/libvirt/libvirt-go/domain_events.go:332:18: type [1073741824]_Ctype_struct__virDomainEventGraphicsSubjectIdentity larger than address space
src/github.com/libvirt/libvirt-go/domain_events.go:332:18: type [1073741824]_Ctype_struct__virDomainEventGraphicsSubjectIdentity too large
dh_auto_build: error: cd build && go install -trimpath -v -p 4 github.com/kumina/libvirt_exporter github.com/kumina/libvirt_exporter/libvirt_schema returned exit code 2
make[1]: *** [debian/rules:19: override_dh_auto_build] Error 25
make[1]: Leaving directory '/<<PKGBUILDDIR>>'
make: *** [debian/rules:12: binary-arch] Error 2

Tail of log for qwinff on armhf:

src/qmpwidget/qmpwidget.cpp:575:43: warning: 'QTextStream& QTextStreamFunctions::endl(QTextStream&)' is deprecated: Use Qt::endl [-Wdeprecated-declarations]
  575 |     out << keys[i] << " " << "ignored" << endl;
      |                                           ^~~~
In file included from /usr/include/arm-linux-gnueabihf/qt5/QtCore/qdebug.h:49,
                 from /usr/include/arm-linux-gnueabihf/qt5/QtCore/QtDebug:1,
                 from src/qmpwidget/qmpwidget.cpp:27:
/usr/include/arm-linux-gnueabihf/qt5/QtCore/qtextstream.h:293:75: note: declared here
  293 | Q_CORE_EXPORT QT_DEPRECATED_VERSION_X(5, 15, "Use Qt::endl") QTextStream &endl(QTextStream &s);
      |                                                                           ^~~~
make[2]: *** [Makefile:1151: qmpwidget.o] Error 1
make[2]: Leaving directory '/<<BUILDDIR>>/qwinff-0.2.1+git20201215'
dh_auto_build: error: make -j4 "INSTALL=install --strip-program=true" QMAKE=arm-linux-gnueabihf-qmake returned exit code 2
make[1]: *** [debian/rules:28: override_dh_auto_build] Error 25
make[1]: Leaving directory '/<<BUILDDIR>>/qwinff-0.2.1+git20201215'
make: *** [debian/rules:20: binary-arch] Error 2

Tail of log for ruby2.1 on armhf:

 4979 | #define yydestruct(m, t, v) ruby_parser_yydestruct(m, t, v, parser)
      | 
parse.c:10853:63: error: macro "yydestruct" passed 4 arguments, but takes just 3
10853 |      this YYABORT or YYACCEPT.  */
      |                                                               ^
parse.c:4979: note: macro "yydestruct" defined here
 4979 | #define yydestruct(m, t, v) ruby_parser_yydestruct(m, t, v, parser)
      | 
make[2]: *** [Makefile:334: parse.o] Error 1
make[2]: *** Waiting for unfinished jobs....
make[2]: Leaving directory '/<<PKGBUILDDIR>>'
dh_auto_build: error: make -j4 main V=1 returned exit code 2
make[1]: *** [debian/rules:67: override_dh_auto_build-arch] Error 25
make[1]: Leaving directory '/<<PKGBUILDDIR>>'
make: *** [debian/rules:49: build-arch] Error 2

Tail of log for rust-mach-o-sys on armhf:

For more information about this error, try `rustc --explain E0600`.
error: could not compile `mach_o_sys`.

Caused by:
  process didn't exit successfully: `CARGO=/usr/bin/cargo CARGO_CRATE_NAME=mach_o_sys CARGO_MANIFEST_DIR=/<<PKGBUILDDIR>> CARGO_PKG_AUTHORS='Nick Fitzgerald <fitzgen@gmail.com>' CARGO_PKG_DESCRIPTION='Bindings to the OSX mach-o system library' CARGO_PKG_HOMEPAGE='' CARGO_PKG_LICENSE=Apache-2.0/MIT CARGO_PKG_LICENSE_FILE='' CARGO_PKG_NAME=mach_o_sys CARGO_PKG_REPOSITORY='https://github.com/fitzgen/mach_o_sys' CARGO_PKG_VERSION=0.1.1 CARGO_PKG_VERSION_MAJOR=0 CARGO_PKG_VERSION_MINOR=1 CARGO_PKG_VERSION_PATCH=1 CARGO_PKG_VERSION_PRE='' LD_LIBRARY_PATH='/<<PKGBUILDDIR>>/target/debug/deps:/usr/lib' rustc --crate-name mach_o_sys src/lib.rs --error-format=json --json=diagnostic-rendered-ansi --crate-type lib --emit=dep-info,metadata,link -Cembed-bitcode=no -C debuginfo=2 -C metadata=6c4abfb49a04aeb5 -C extra-filename=-6c4abfb49a04aeb5 --out-dir /<<PKGBUILDDIR>>/target/arm-unknown-linux-gnueabihf/debug/deps --target arm-unknown-linux-gnueabihf -C incremental=/<<PKGBUILDDIR>>/target/arm-unknown-linux-gnueabihf/debug/incremental -L dependency=/<<PKGBUILDDIR>>/target/arm-unknown-linux-gnueabihf/debug/deps -L dependency=/<<PKGBUILDDIR>>/target/debug/deps -C debuginfo=2 --cap-lints warn -C linker=arm-linux-gnueabihf-gcc -C link-arg=-Wl,-z,relro --remap-path-prefix /<<PKGBUILDDIR>>=/usr/share/cargo/registry/mach-o-sys-0.1.1` (exit code: 1)
warning: build failed, waiting for other jobs to finish...
error: aborting due to 130 previous errors

For more information about this error, try `rustc --explain E0600`.
error: build failed
dh_auto_test: error: /usr/share/cargo/bin/cargo test --all returned exit code 101
make[1]: *** [debian/rules:6: override_dh_auto_test] Error 25
make[1]: Leaving directory '/<<PKGBUILDDIR>>'
make: *** [debian/rules:3: build-arch] Error 2

Tail of log for rust-pq-sys on armhf:

failures:
    bindgen_test_layout__PQconninfoOption
    bindgen_test_layout__PQprintOpt
    bindgen_test_layout___sFILE
    bindgen_test_layout___sbuf
    bindgen_test_layout_pgNotify
    bindgen_test_layout_pgresAttDesc

test result: FAILED. 2 passed; 6 failed; 0 ignored; 0 measured; 0 filtered out

error: test failed, to rerun pass '--lib'
dh_auto_test: error: /usr/share/cargo/bin/cargo test --all returned exit code 101
make[1]: *** [debian/rules:6: override_dh_auto_test] Error 25
make[1]: Leaving directory '/<<PKGBUILDDIR>>'
make: *** [debian/rules:3: build-arch] Error 2

Tail of log for rust-ucd-generate on armhf:

102 |                 wtr.dense_regex(args.name(), &re)?;
    |                                              ^^^ the trait `StateID` is not implemented for `u64`

error: aborting due to 10 previous errors; 2 warnings emitted

Some errors have detailed explanations: E0277, E0599.
For more information about an error, try `rustc --explain E0277`.
error: could not compile `ucd-generate`.

Caused by:
  process didn't exit successfully: `CARGO=/usr/bin/cargo CARGO_BIN_NAME=ucd-generate CARGO_CRATE_NAME=ucd_generate CARGO_MANIFEST_DIR=/<<PKGBUILDDIR>> CARGO_PKG_AUTHORS='Andrew Gallant <jamslam@gmail.com>' CARGO_PKG_DESCRIPTION='A program for generating packed representations of the Unicode character
  database that can be efficiently searched.
  ' CARGO_PKG_HOMEPAGE='https://github.com/BurntSushi/ucd-generate' CARGO_PKG_LICENSE=MIT/Apache-2.0 CARGO_PKG_LICENSE_FILE='' CARGO_PKG_NAME=ucd-generate CARGO_PKG_REPOSITORY='https://github.com/BurntSushi/ucd-generate' CARGO_PKG_VERSION=0.2.3 CARGO_PKG_VERSION_MAJOR=0 CARGO_PKG_VERSION_MINOR=2 CARGO_PKG_VERSION_PATCH=3 CARGO_PKG_VERSION_PRE='' LD_LIBRARY_PATH='/<<PKGBUILDDIR>>/target/debug/deps:/usr/lib' rustc --crate-name ucd_generate src/main.rs --error-format=json --json=diagnostic-rendered-ansi --crate-type bin --emit=dep-info,link -Cembed-bitcode=no -C debuginfo=2 -C metadata=e3c3390792a31770 -C extra-filename=-e3c3390792a31770 --out-dir /<<PKGBUILDDIR>>/target/arm-unknown-linux-gnueabihf/debug/deps --target arm-unknown-linux-gnueabihf -C incremental=/<<PKGBUILDDIR>>/target/arm-unknown-linux-gnueabihf/debug/incremental -L dependency=/<<PKGBUILDDIR>>/target/arm-unknown-linux-gnueabihf/debug/deps -L dependency=/<<PKGBUILDDIR>>/target/debug/deps --extern byteorder=/<<PKGBUILDDIR>>/target/arm-unknown-linux-gnueabihf/debug/deps/libbyteorder-c5cffb3cfcfe6c4c.rlib --extern clap=/<<PKGBUILDDIR>>/target/arm-unknown-linux-gnueabihf/debug/deps/libclap-2e4acfa8cba0f174.rlib --extern fst=/<<PKGBUILDDIR>>/target/arm-unknown-linux-gnueabihf/debug/deps/libfst-fb620ad0c9592429.rlib --extern regex_automata=/<<PKGBUILDDIR>>/target/arm-unknown-linux-gnueabihf/debug/deps/libregex_automata-918d1711dd2dd3fb.rlib --extern ucd_parse=/<<PKGBUILDDIR>>/target/arm-unknown-linux-gnueabihf/debug/deps/libucd_parse-50a56b5ca8f9cfac.rlib --extern ucd_trie=/<<PKGBUILDDIR>>/target/arm-unknown-linux-gnueabihf/debug/deps/libucd_trie-14b85d0c65fcfd99.rlib --extern ucd_util=/<<PKGBUILDDIR>>/target/arm-unknown-linux-gnueabihf/debug/deps/libucd_util-794f71ccf0285c7c.rlib -C debuginfo=2 --cap-lints warn -C linker=arm-linux-gnueabihf-gcc -C link-arg=-Wl,-z,relro --remap-path-prefix /<<PKGBUILDDIR>>=/usr/share/cargo/registry/ucd-generate-0.2.3` (exit code: 1)
dh_auto_test: error: /usr/share/cargo/bin/cargo build returned exit code 101
make: *** [debian/rules:3: build-arch] Error 25

Tail of log for tiledarray on armhf:

      |       ^~~~~~~~
/<<PKGBUILDDIR>>/src/TiledArray/math/vector_op.h:107:7: note:   template argument deduction/substitution failed:
/<<PKGBUILDDIR>>/src/TiledArray/math/vector_op.h:155:29: note:   candidate expects 2 arguments, 3 provided
  155 |       VecOpUnwindN::for_each(op, result, args...);
      |       ~~~~~~~~~~~~~~~~~~~~~~^~~~~~~~~~~~~~~~~~~~~
make[4]: *** [src/CMakeFiles/tiledarray.dir/build.make:85: src/CMakeFiles/tiledarray.dir/TiledArray/tensor/tensor.cpp.o] Error 1
make[4]: Leaving directory '/<<PKGBUILDDIR>>/obj-arm-linux-gnueabihf'
make[3]: *** [CMakeFiles/Makefile2:448: src/CMakeFiles/tiledarray.dir/all] Error 2
make[3]: Leaving directory '/<<PKGBUILDDIR>>/obj-arm-linux-gnueabihf'
make[2]: *** [Makefile:163: all] Error 2
make[2]: Leaving directory '/<<PKGBUILDDIR>>/obj-arm-linux-gnueabihf'
dh_auto_build: error: cd obj-arm-linux-gnueabihf && make -j1 VERBOSE=1 returned exit code 2
make[1]: *** [debian/rules:52: override_dh_auto_build] Error 25
make[1]: Leaving directory '/<<PKGBUILDDIR>>'
make: *** [debian/rules:40: build-arch] Error 2

Tail of log for xf86-video-msm on armhf:

                 from neon_memsets.c:30:
/usr/include/xorg/servermd.h:51:2: error: #error Drivers must include xorg-server.h before any other xserver headers
   51 | #error Drivers must include xorg-server.h before any other xserver headers
      |  ^~~~~
/usr/include/xorg/servermd.h:52:2: error: #error xserver code must include dix-config.h before any other headers
   52 | #error xserver code must include dix-config.h before any other headers
      |  ^~~~~
make[3]: *** [Makefile:550: neon_memsets.lo] Error 1
make[3]: Leaving directory '/<<BUILDDIR>>/xf86-video-msm-1.0.1+git20100122.5f7df591/src'
make[2]: *** [Makefile:428: all-recursive] Error 1
make[2]: Leaving directory '/<<BUILDDIR>>/xf86-video-msm-1.0.1+git20100122.5f7df591'
make[1]: *** [Makefile:360: all] Error 2
make[1]: Leaving directory '/<<BUILDDIR>>/xf86-video-msm-1.0.1+git20100122.5f7df591'
dh_auto_build: error: make -j1 returned exit code 2
make: *** [debian/rules:8: build-arch] Error 25

Tail of log for openms on armhf:

  101 |         return static_cast< QOpenGLFunctions_2_0*>(this);
      |                                                         ^
      |                                                         )
make[5]: *** [src/openms_gui/CMakeFiles/OpenMS_GUI.dir/build.make:227: src/openms_gui/CMakeFiles/OpenMS_GUI.dir/OpenMS_GUI_autogen/mocs_compilation.cpp.o] Error 1
make[5]: Leaving directory '/<<PKGBUILDDIR>>/obj-arm-linux-gnueabihf'
make[4]: *** [CMakeFiles/Makefile2:1961: src/openms_gui/CMakeFiles/OpenMS_GUI.dir/all] Error 2
make[4]: Leaving directory '/<<PKGBUILDDIR>>/obj-arm-linux-gnueabihf'
make[3]: *** [CMakeFiles/Makefile2:1819: src/openms_gui/CMakeFiles/GUI.dir/rule] Error 2
make[3]: Leaving directory '/<<PKGBUILDDIR>>/obj-arm-linux-gnueabihf'
make[2]: *** [Makefile:626: GUI] Error 2
make[2]: Leaving directory '/<<PKGBUILDDIR>>/obj-arm-linux-gnueabihf'
dh_auto_build: error: cd obj-arm-linux-gnueabihf && make -j1 "INSTALL=install --strip-program=true" OpenMS GUI TOPP UTILS VERBOSE=1 returned exit code 2
make[1]: *** [debian/rules:95: override_dh_auto_build] Error 25
make[1]: Leaving directory '/<<PKGBUILDDIR>>'
make: *** [debian/rules:43: build-arch] Error 2

Tail of log for sagemath on armhf:

sage -t --long --random-seed=0 src/sage/tests/cmdline.py  # 5 doctests failed
sage -t --long --random-seed=0 src/sage/tests/books/computational-mathematics-with-sagemath/linalg_doctest.py  # 1 doctest failed
sage -t --long --random-seed=0 src/sage/tests/books/computational-mathematics-with-sagemath/mpoly_doctest.py  # Timed out
sage -t --long --random-seed=0 src/sage/tests/books/judson-abstract-algebra/galois-sage.py  # 1 doctest failed
----------------------------------------------------------------------
Total time for all tests: 154118.5 seconds
    cpu time: 14264.8 seconds
    cumulative wall time: 16602.1 seconds
make[2]: Entering directory '/<<PKGBUILDDIR>>'
Error: 207 tests failed, up to 200 failures are tolerated
make[2]: *** [debian/rules:165: had-few-failures] Error 1
make[2]: Leaving directory '/<<PKGBUILDDIR>>'
make[1]: *** [debian/rules:202: override_dh_auto_test-arch] Error 2
make[1]: Leaving directory '/<<PKGBUILDDIR>>'
make: *** [debian/rules:40: binary-arch] Error 2