Raspbian Package Auto-Building

Buildd status for selected packages (bullseye-staging)

Bugs

Package(s): Suite:
Compact mode Co-maintainers

Package armhf
Buildd exposure stats
✔ bind-dyndb-ldapInstalled
✔ fermi-liteInstalled
✔ wrkInstalled
✘ fstl  Build-Attempted
✘ scamp  Build-Attempted
✔ libaioInstalled
✔ pulseviewInstalled
✔ solvespaceInstalled
✔ flatpakInstalled
✔ dictdInstalled
✘ swt4-gtk  Build-Attempted
✘ tilix  Build-Attempted
✔ chattyInstalled
✔ gduInstalled
✔ hubInstalled
✔ gpacInstalled
✔ numcodecsInstalled
✔ python-crc32cInstalled
✔ goxelInstalled
Package armhf
Buildd exposure stats
✔ siridb-serverInstalled
✔ suricataInstalled
✔ octave-iso2meshInstalled
✔ veyonInstalled
✔ fakechrootInstalled
✘ python-cassandra-driver  Build-Attempted
✔ sssdInstalled
✔ gearyInstalled
✘ creduce  Build-Attempted
✘ dolfin  Building
✔ crowdsecInstalled
✔ emacsInstalled
✘ wpewebkit  Building
✔ mrptInstalled

Tail of log for fstl on armhf:

      |                                        ^
In file included from /usr/include/arm-linux-gnueabihf/qt5/QtGui/QMouseEvent:1,
                 from /<<PKGBUILDDIR>>/src/canvas.cpp:1:
/usr/include/arm-linux-gnueabihf/qt5/QtGui/qevent.h:219:16: note: declared here
  219 |     inline int delta() const  { return qt4D; }
      |                ^~~~~
make[3]: *** [CMakeFiles/fstl.dir/build.make:141: CMakeFiles/fstl.dir/src/canvas.cpp.o] Error 1
make[3]: *** Waiting for unfinished jobs....
make[3]: Leaving directory '/<<PKGBUILDDIR>>/obj-arm-linux-gnueabihf'
make[2]: *** [CMakeFiles/Makefile2:99: CMakeFiles/fstl.dir/all] Error 2
make[2]: Leaving directory '/<<PKGBUILDDIR>>/obj-arm-linux-gnueabihf'
make[1]: *** [Makefile:174: all] Error 2
make[1]: Leaving directory '/<<PKGBUILDDIR>>/obj-arm-linux-gnueabihf'
dh_auto_build: error: cd obj-arm-linux-gnueabihf && make -j4 "INSTALL=install --strip-program=true" VERBOSE=1 returned exit code 2
make: *** [debian/rules:9: binary-arch] Error 25

Tail of log for scamp on armhf:

# ERROR: 0
============================================================================
See tests/test-suite.log
Please report to astromatic@astromatic.net
============================================================================
make[4]: *** [Makefile:782: test-suite.log] Error 1
make[4]: Leaving directory '/<<PKGBUILDDIR>>/tests'
make[3]: *** [Makefile:890: check-TESTS] Error 2
make[3]: Leaving directory '/<<PKGBUILDDIR>>/tests'
make[2]: *** [Makefile:992: check-am] Error 2
make[2]: Leaving directory '/<<PKGBUILDDIR>>/tests'
make[1]: *** [Makefile:537: check-recursive] Error 1
make[1]: Leaving directory '/<<PKGBUILDDIR>>'
dh_auto_test: error: make -j4 check VERBOSE=1 returned exit code 2
make: *** [debian/rules:7: binary-arch] Error 25

Tail of log for swt4-gtk on armhf:

    [javac]  *     Christoph L??ubrich - Bug 513185
    [javac]                   ^
    [javac] /<<PKGBUILDDIR>>/bundles/org.eclipse.swt/temp.folder/@dot.src/org/eclipse/swt/layout/FillLayout.java:13: error: unmappable character (0xA4) for encoding US-ASCII
    [javac]  *     Christoph L??ubrich - Bug 513185
    [javac]                    ^
    [javac] 2 errors

BUILD FAILED
/<<PKGBUILDDIR>>/bundles/org.eclipse.swt/buildFragment.xml:88: The following error occurred while executing this line:
/<<PKGBUILDDIR>>/bundles/org.eclipse.swt/buildFragment.xml:61: Compile failed; see the compiler error output for details.

Total time: 11 seconds
make[1]: *** [debian/rules:30: override_dh_auto_build] Error 1
make[1]: Leaving directory '/<<PKGBUILDDIR>>'
make: *** [debian/rules:27: binary-arch] Error 2

Tail of log for tilix on armhf:

-------


Summary of Failures:

2/2 tilix_test             FAIL           4.51s (exit status 1)

Ok:                 1   
Expected Fail:      0   
Fail:               1   
Unexpected Pass:    0   
Skipped:            0   
Timeout:            0   
dh_auto_test: error: cd obj-arm-linux-gnueabihf && LC_ALL=C.UTF-8 MESON_TESTTHREADS=4 ninja test returned exit code 1
make: *** [debian/rules:11: build-arch] Error 25

Tail of log for python-cassandra-driver on armhf:

cassandra.connection: DEBUG: Sending initial options message for new connection (3013174096) to 127.0.0.1:9042
cassandra.io.libevreactor: DEBUG: Starting libev event loop
cassandra.io.libevreactor: DEBUG: Closing connection (3013174096) to 127.0.0.1:9042
cassandra.io.libevreactor: DEBUG: Closed socket to 127.0.0.1:9042
--------------------- >> end captured logging << ---------------------

----------------------------------------------------------------------
Ran 594 tests in 583.624s

FAILED (SKIP=18, failures=1)
E: pybuild pybuild:353: test: plugin distutils failed with: exit code=1: cd /<<PKGBUILDDIR>>/.pybuild/cpython3_3.9_dbg_cassandra/build; python3.9-dbg -m nose -v  --ignore-files="test_eventletreactor\.py"
dh_auto_test: error: pybuild --test -i python{version}-dbg -p 3.9 returned exit code 13
make[1]: *** [debian/rules:41: override_dh_auto_test] Error 25
make[1]: Leaving directory '/<<PKGBUILDDIR>>'
make: *** [debian/rules:21: binary-arch] Error 2

Tail of log for creduce on armhf:

/usr/lib/llvm-9/include/clang/Frontend/CompilerInvocation.h:154:15: note:   candidate expects 4 arguments, 3 provided
TransformationManager.cpp:140:32: error: 'Language' has not been declared
  140 |                                Language::OpenCL, T, PPOpts);
      |                                ^~~~~~~~
make[4]: *** [Makefile:2043: clang_delta-TransformationManager.o] Error 1
make[4]: *** Waiting for unfinished jobs....
make[4]: Leaving directory '/<<BUILDDIR>>/creduce-2.10.0+20201029/clang_delta'
make[3]: *** [Makefile:449: all-recursive] Error 1
make[3]: Leaving directory '/<<BUILDDIR>>/creduce-2.10.0+20201029'
make[2]: *** [Makefile:381: all] Error 2
make[2]: Leaving directory '/<<BUILDDIR>>/creduce-2.10.0+20201029'
dh_auto_build: error: make -j4 returned exit code 2
make[1]: *** [debian/rules:29: override_dh_auto_build] Error 25
make[1]: Leaving directory '/<<BUILDDIR>>/creduce-2.10.0+20201029'
make: *** [debian/rules:23: build-arch] Error 2