Raspbian Package Auto-Building

Buildd status for selected packages (bullseye-staging)

Bugs

Package(s): Suite:
Compact mode Co-maintainers

Package armhf
Buildd exposure stats
✔ appstream-generatorBuild-Attempted
✔ haskell-protobufBuild-Attempted
✔ ismrmrdBuild-Attempted
✔ icinga2Build-Attempted
✔ libundeadBuild-Attempted
✔ quorumBuild-Attempted
✔ python-skbioBuild-Attempted
✔ spadesBuild-Attempted
✔ rocksdbBuild-Attempted
✔ gfccoreBuild-Attempted
✔ acoveaBuild-Attempted
✔ tensorpipeBuild-Attempted
✔ mingw32-binutilsBuild-Attempted
✔ libibcmBuild-Attempted
✔ ocamlgslBuild-Attempted
✔ asterisk-chan-capiBuild-Attempted
✔ apfBuild-Attempted
✔ bbhashBuild-Attempted
✔ autofs5Build-Attempted
Package armhf
Buildd exposure stats
✔ badgerBuild-Attempted
✔ bcachefs-toolsBuild-Attempted
✔ bustoolsBuild-Attempted
✔ cclsBuild-Attempted
✔ audacious-analog-vumeter-pluginBuild-Attempted
✔ blastemBuild-Attempted
✔ criuBuild-Attempted
✔ consul-migrateBuild-Attempted
✔ debimanBuild-Attempted
✔ coneBuild-Attempted
✔ bornagainBuild-Attempted
✔ fairy-stockfishBuild-Attempted
✔ fpzipBuild-Attempted
✔ febootstrapBuild-Attempted
✔ dengBuild-Attempted
✔ gjh-asl-jsonBuild-Attempted
✔ garagemqBuild-Attempted
✔ glooBuild-Attempted
✔ golang-android-soongBuild-Attempted
✔ haskell-ghc-lib-parser-exBuild-Attempted
Package armhf
Buildd exposure stats
✔ deepin-movie-rebornBuild-Attempted
✔ ghemicalBuild-Attempted
✔ cycloneddsBuild-Attempted
✔ gatb-coreBuild-Attempted
✔ dballeBuild-Attempted
✔ highwayhashInstalled
✔ gammapyBuild-Attempted
✔ haskell-pretty-simpleBuild-Attempted
✔ haskell-xml-html-qqBuild-Attempted
✔ ivarBuild-Attempted
✔ ioappsBuild-Attempted
✔ haskell-type-levelBuild-Attempted
✔ jocamlBuild-Attempted
✔ kafs-clientBuild-Attempted
✔ libbiodBuild-Attempted
✔ icu-extBuild-Attempted
✔ ibamBuild-Attempted
✔ libmath-int128-perlBuild-Attempted
✔ hyperspyBuild-Attempted
✔ libmlx5Build-Attempted
Package armhf
Buildd exposure stats
✔ librandomxBuild-Attempted
✔ libretro-mupen64plusBuild-Attempted
✔ leela-zeroBuild-Attempted
✔ libnunc-stansBuild-Attempted
✔ libxsmmBuild-Attempted
✔ libtangoBuild-Attempted
✔ haskell-ormoluBuild-Attempted
✔ mariadb-connector-odbcBuild-Attempted
✔ kleborateBuild-Attempted
✔ msrtoolBuild-Attempted
✔ mojoshaderBuild-Attempted
✔ micropythonBuild-Attempted
✔ listallerBuild-Attempted
✔ mrsBuild-Attempted
✔ nsd3Build-Attempted
✔ mesBuild-Attempted
✔ odcBuild-Attempted
✔ open-axiomBuild-Attempted
✔ oliveBuild-Attempted
✔ neuronBuild-Attempted
Package armhf
Buildd exposure stats
✔ octave-tiseanBuild-Attempted
✔ openmmBuild-Attempted
✔ pbseqlibBuild-Attempted
✔ perftestBuild-Attempted
✔ percona-xtradb-cluster-galera-2.xBuild-Attempted
✔ pinfishBuild-Attempted
✔ plink2Build-Attempted
✔ postgresql-numeralBuild-Attempted
✔ nixBuild-Attempted
✔ patatBuild-Attempted
✔ prometheus-libvirt-exporterBuild-Attempted
✔ prboomBuild-Attempted
✔ projectmBuild-Attempted
✔ python-peachpyBuild-Attempted
✔ rpm2htmlBuild-Attempted
✔ qwinffBuild-Attempted
✔ qtjsbackend-opensource-srcBuild-Attempted
✔ r-bioc-rsubreadBuild-Attempted
✔ ruby2.1Build-Attempted
✔ ruby-cborBuild-Attempted
Package armhf
Buildd exposure stats
✔ rust-mach-o-sysBuild-Attempted
✔ r-cran-s2Build-Attempted
✔ rust-pq-sysBuild-Attempted
✔ rust-mysqlclient-sysBuild-Attempted
✔ rust-kvm-ioctlsBuild-Attempted
✔ rust-generatorBuild-Attempted
✔ scanbuttondBuild-Attempted
✔ rust-ucd-generateBuild-Attempted
✔ rust-servo-freetype-sysBuild-Attempted
✔ slang-slirpBuild-Attempted
✔ tiledarrayBuild-Attempted
✔ tinyarrayBuild-Attempted
✔ traildbBuild-Attempted
✔ xf86-video-msmBuild-Attempted
✔ wmmailBuild-Attempted
✔ tarantoolBuild-Attempted
✔ tendermintBuild-Attempted
✔ rust-libnotcurses-sysBuild-Attempted
✔ qtmirBuild-Attempted
✔ rheolefBuild-Attempted
Package armhf
Buildd exposure stats
✔ pyfftwBuild-Attempted
✔ tulipBuild-Attempted
✔ sfcgalBuild-Attempted
✔ agdaBuild-Attempted
✔ libmaus2Build-Attempted
✔ openmsBuild-Attempted
✔ qtwebengine-opensource-srcBuild-Attempted
✔ mlpackBuild-Attempted
✔ paraviewBuild-Attempted
✔ siconosBuild-Attempted
✔ openstructureBuild-Attempted
✔ iem-plugin-suiteBuild-Attempted
✔ kodiBuild-Attempted
✔ nextpnrBuild-Attempted
✔ sagemathBuild-Attempted
✔ libgrokj2kBuild-Attempted
✔ guixBuild-Attempted
✔ libdnfBuild-Attempted

Tail of log for appstream-generator on armhf:

FAILED: src/asgen/appstream-generator.p/datastore.d.o 
gdc -Isrc/asgen/appstream-generator.p -Isrc/asgen -I../src/asgen -Isrc -I../src -Igirepo -I../girepo -I/usr/include/d/glibd-2 -I/usr/include/libmount -I/usr/include/blkid -I/usr/include/glib-2.0 -I/usr/lib/arm-linux-gnueabihf/glib-2.0/include -I/usr/include/appstream -I/usr/include/appstream-compose -I/usr/include/gdk-pixbuf-2.0 -I/usr/include/arm-linux-gnueabihf -Wall -Wdeprecated -g -O2 -ffile-prefix-map=/<<PKGBUILDDIR>>=. -fstack-protector-strong -frelease -pthread -pthread -pthread -J../src/asgen/../../data -MD -MQ src/asgen/appstream-generator.p/datastore.d.o -MF src/asgen/appstream-generator.p/datastore.d.o.deps -o src/asgen/appstream-generator.p/datastore.d.o -c ../src/asgen/datastore.d
../src/asgen/datastore.d:698:38: error: undefined identifier ‘JSONType’
  698 |             if (existingJson.type == JSONType.array) {
      |                                      ^
[54/144] gdc -Isrc/asgen/appstream-generator.p -Isrc/asgen -I../src/asgen -Isrc -I../src -Igirepo -I../girepo -I/usr/include/d/glibd-2 -I/usr/include/libmount -I/usr/include/blkid -I/usr/include/glib-2.0 -I/usr/lib/arm-linux-gnueabihf/glib-2.0/include -I/usr/include/appstream -I/usr/include/appstream-compose -I/usr/include/gdk-pixbuf-2.0 -I/usr/include/arm-linux-gnueabihf -Wall -Wdeprecated -g -O2 -ffile-prefix-map=/<<PKGBUILDDIR>>=. -fstack-protector-strong -frelease -pthread -pthread -pthread -J../src/asgen/../../data -MD -MQ src/asgen/appstream-generator.p/downloader.d.o -MF src/asgen/appstream-generator.p/downloader.d.o.deps -o src/asgen/appstream-generator.p/downloader.d.o -c ../src/asgen/downloader.d
FAILED: src/asgen/appstream-generator.p/downloader.d.o 
gdc -Isrc/asgen/appstream-generator.p -Isrc/asgen -I../src/asgen -Isrc -I../src -Igirepo -I../girepo -I/usr/include/d/glibd-2 -I/usr/include/libmount -I/usr/include/blkid -I/usr/include/glib-2.0 -I/usr/lib/arm-linux-gnueabihf/glib-2.0/include -I/usr/include/appstream -I/usr/include/appstream-compose -I/usr/include/gdk-pixbuf-2.0 -I/usr/include/arm-linux-gnueabihf -Wall -Wdeprecated -g -O2 -ffile-prefix-map=/<<PKGBUILDDIR>>=. -fstack-protector-strong -frelease -pthread -pthread -pthread -J../src/asgen/../../data -MD -MQ src/asgen/appstream-generator.p/downloader.d.o -MF src/asgen/appstream-generator.p/downloader.d.o.deps -o src/asgen/appstream-generator.p/downloader.d.o -c ../src/asgen/downloader.d
../src/asgen/downloader.d:151:47: error: no property 'message' for type 'object.Exception'
  151 |                 throw new DownloadException (e.message.to!string);
      |                                               ^
[55/144] gdc -Isrc/asgen/appstream-generator.p -Isrc/asgen -I../src/asgen -Isrc -I../src -Igirepo -I../girepo -I/usr/include/d/glibd-2 -I/usr/include/libmount -I/usr/include/blkid -I/usr/include/glib-2.0 -I/usr/lib/arm-linux-gnueabihf/glib-2.0/include -I/usr/include/appstream -I/usr/include/appstream-compose -I/usr/include/gdk-pixbuf-2.0 -I/usr/include/arm-linux-gnueabihf -Wall -Wdeprecated -g -O2 -ffile-prefix-map=/<<PKGBUILDDIR>>=. -fstack-protector-strong -frelease -pthread -pthread -pthread -J../src/asgen/../../data -MD -MQ src/asgen/appstream-generator.p/.._app.d.o -MF src/asgen/appstream-generator.p/.._app.d.o.deps -o src/asgen/appstream-generator.p/.._app.d.o -c ../src/app.d
ninja: build stopped: subcommand failed.
dh_auto_build: error: cd obj-arm-linux-gnueabihf && LC_ALL=C.UTF-8 ninja -j4 -v returned exit code 1
make: *** [debian/rules:18: binary-arch] Error 25

Tail of log for haskell-protobuf on armhf:

      +++ OK, passed 100 tests (100% prop_wire :: Signed Int64).
    fixed32:                                     OK
      +++ OK, passed 100 tests (100% prop_wire :: Fixed Word32).
    fixed64:                                     OK
      +++ OK, passed 100 tests (100% prop_wire :: Fixed Word64).
    sfixed32:                                    OK
      +++ OK, passed 100 tests (100% prop_wire :: Fixed Int32).
    sfixed64:                                    OK
      +++ OK, passed 100 tests (100% prop_wire :: Fixed Int64).
    float:                                       OK
protobuf-test: too many pending signals
Test suite protobuf-test: FAIL
Test suite logged to: dist-ghc/test/protobuf-0.2.1.3-protobuf-test.log
0 of 1 test suites (0 of 1 test cases) passed.
make: *** [/usr/share/cdbs/1/class/hlibrary.mk:154: check-ghc-stamp] Error 1

Tail of log for ismrmrd on armhf:

./tests/test_acquisitions.cpp(7): Leaving test suite "AcquisitionsTest"
Test is aborted
Leaving test module "ISMRMRD Unit Tests"

*** 1 failure is detected in the test module "ISMRMRD Unit Tests"
make[4]: *** [tests/CMakeFiles/check.dir/build.make:79: tests/CMakeFiles/check] Error 201
make[4]: Leaving directory '/<<PKGBUILDDIR>>/obj-arm-linux-gnueabihf'
make[3]: *** [CMakeFiles/Makefile2:435: tests/CMakeFiles/check.dir/all] Error 2
make[3]: Leaving directory '/<<PKGBUILDDIR>>/obj-arm-linux-gnueabihf'
make[2]: *** [CMakeFiles/Makefile2:442: tests/CMakeFiles/check.dir/rule] Error 2
make[2]: Leaving directory '/<<PKGBUILDDIR>>/obj-arm-linux-gnueabihf'
make[1]: *** [Makefile:325: check] Error 2
make[1]: Leaving directory '/<<PKGBUILDDIR>>/obj-arm-linux-gnueabihf'
dh_auto_test: error: cd obj-arm-linux-gnueabihf && make -j4 check ARGS\+=-j4 returned exit code 2
make: *** [debian/rules:14: binary-arch] Error 25

Tail of log for icinga2 on armhf:

      |     ^
/<<PKGBUILDDIR>>/lib/icinga/timeperiod.cpp:147:5: note: parameter passing for argument of type 'std::initializer_list<std::pair<const icinga::String, icinga::Value> >' changed in GCC 7.1
  147 |    }));
      |     ^
/<<PKGBUILDDIR>>/lib/icinga/timeperiod.cpp: In member function 'void icinga::TimePeriod::AddSegment(double, double)':
/<<PKGBUILDDIR>>/lib/icinga/timeperiod.cpp:87:3: note: parameter passing for argument of type 'std::initializer_list<std::pair<const icinga::String, icinga::Value> >' changed in GCC 7.1
   87 |  });
      |   ^
make[3]: Leaving directory '/<<PKGBUILDDIR>>/obj-arm-linux-gnueabihf'
[ 56%] Built target icinga
make[2]: Leaving directory '/<<PKGBUILDDIR>>/obj-arm-linux-gnueabihf'
make[1]: *** [Makefile:185: all] Error 2
make[1]: Leaving directory '/<<PKGBUILDDIR>>/obj-arm-linux-gnueabihf'
dh_auto_build: error: cd obj-arm-linux-gnueabihf && make -j4 "INSTALL=install --strip-program=true" VERBOSE=1 returned exit code 2
make: *** [debian/rules:18: build-arch] Error 25

Tail of log for libundead on armhf:

/<<PKGBUILDDIR>>/src/undead/stream.d:1222:16: error: generic thunk code fails for method ‘_DT12_D6undead6stream6Stream6writefMFYC6undead6stream12OutputStream’ which uses ‘...’
 1222 |   OutputStream writef(...) {
      |                ^
/<<PKGBUILDDIR>>/src/undead/stream.d:1207:10: error: generic thunk code fails for method ‘_DT12_D6undead6stream6Stream6printfMFAxaYk’ which uses ‘...’
 1207 |   size_t printf(const(char)[] format, ...) {
      |          ^
/<<PKGBUILDDIR>>/src/undead/stream.d:1069:7: error: generic thunk code fails for method ‘_DT8_D6undead6stream6Stream5readfMFYi’ which uses ‘...’
 1069 |   int readf(...) {
      |       ^
[3/29] gdc -Ilibundead.so.1.0.7.p -I. -I.. -I../src -Wall -Wdeprecated -g -O2 -ffile-prefix-map=/<<PKGBUILDDIR>>=. -fstack-protector-strong -frelease -fPIC -MD -MQ libundead.so.1.0.7.p/src_undead_bitarray.d.o -MF libundead.so.1.0.7.p/src_undead_bitarray.d.o.deps -o libundead.so.1.0.7.p/src_undead_bitarray.d.o -c ../src/undead/bitarray.d
[4/29] gdc -Ilibundead.so.1.0.7.p -I. -I.. -I../src -Wall -Wdeprecated -g -O2 -ffile-prefix-map=/<<PKGBUILDDIR>>=. -fstack-protector-strong -frelease -fPIC -MD -MQ libundead.so.1.0.7.p/src_undead_dateparse.d.o -MF libundead.so.1.0.7.p/src_undead_dateparse.d.o.deps -o libundead.so.1.0.7.p/src_undead_dateparse.d.o -c ../src/undead/dateparse.d
[5/29] gdc -Ilibundead.so.1.0.7.p -I. -I.. -I../src -Wall -Wdeprecated -g -O2 -ffile-prefix-map=/<<PKGBUILDDIR>>=. -fstack-protector-strong -frelease -fPIC -MD -MQ libundead.so.1.0.7.p/src_undead_date.d.o -MF libundead.so.1.0.7.p/src_undead_date.d.o.deps -o libundead.so.1.0.7.p/src_undead_date.d.o -c ../src/undead/date.d
ninja: build stopped: subcommand failed.
dh_auto_build: error: cd obj-arm-linux-gnueabihf && LC_ALL=C.UTF-8 ninja -j4 -v returned exit code 1
make: *** [debian/rules:9: build-arch] Error 25

Tail of log for quorum on armhf:

/usr/include/c++/10/bits/stl_algo.h:3474:5: note: candidate: 'template<class _Tp, class _Compare> _Tp std::min(std::initializer_list<_Tp>, _Compare)'
 3474 |     min(initializer_list<_Tp> __l, _Compare __comp)
      |     ^~~
/usr/include/c++/10/bits/stl_algo.h:3474:5: note:   template argument deduction/substitution failed:
src/histo_mer_database.cc:19:55: note:   mismatched types 'std::initializer_list<_Tp>' and 'long long unsigned int'
   19 |     const uint64_t val = std::min(vals.first, hlen - 1);
      |                                                       ^
make[3]: *** [Makefile:973: src/histo_mer_database.o] Error 1
make[3]: Leaving directory '/<<PKGBUILDDIR>>'
make[2]: *** [Makefile:1445: check-am] Error 2
make[2]: Leaving directory '/<<PKGBUILDDIR>>'
make[1]: *** [Makefile:1448: check] Error 2
make[1]: Leaving directory '/<<PKGBUILDDIR>>'
dh_auto_test: error: make -j1 check VERBOSE=1 returned exit code 2
make: *** [debian/rules:12: binary-arch] Error 25

Tail of log for python-skbio on armhf:

FAILED skbio/stats/distance/tests/test_mantel.py::PairwiseMantelTests::test_many_filepaths_as_input
FAILED skbio/stats/distance/tests/test_mantel.py::PairwiseMantelTests::test_minimal_compatible_input
FAILED skbio/stats/distance/tests/test_mantel.py::PairwiseMantelTests::test_minimal_compatible_input_with_labels
FAILED skbio/stats/distance/tests/test_mantel.py::PairwiseMantelTests::test_na_p_value
FAILED skbio/stats/distance/tests/test_mantel.py::PairwiseMantelTests::test_reordered_distance_matrices
FAILED skbio/stats/distance/tests/test_mantel.py::PairwiseMantelTests::test_strict
FAILED skbio/stats/tests/test_subsample.py::SubsampleCountsTests::test_subsample_counts_nonrandom
FAILED skbio/stats/tests/test_subsample.py::SubsampleCountsTests::test_subsample_counts_without_replacement
FAILED skbio/stats/tests/test_subsample.py::ISubsampleTests::test_isubsample_simple
FAILED skbio/stats/tests/test_subsample.py::ISubsampleTests::test_per_sample_sequences_complex
FAILED skbio/stats/tests/test_subsample.py::ISubsampleTests::test_per_sample_sequences_min_seqs
=== 87 failed, 2235 passed, 30 skipped, 17090 warnings in 239.78s (0:03:59) ====
E: pybuild pybuild:353: test: plugin distutils failed with: exit code=1: cd /<<PKGBUILDDIR>>/.pybuild/cpython3_3.9_skbio/build; python3.9 -m pytest 
dh_auto_test: error: pybuild --test --test-pytest -i python{version} -p 3.9 returned exit code 13
make: *** [debian/rules:13: binary-arch] Error 25

Tail of log for spades on armhf:

-- Looking for stdint.h - found
-- Looking for stddef.h
-- Looking for stddef.h - found
-- Check size of void*
-- Check size of void* - done
CMake Error at /<<PKGBUILDDIR>>/assembler/ext/src/jemalloc/CMakeLists.txt:79 (message):
  Unsupported pointer size


-- Configuring incomplete, errors occurred!
See also "/<<PKGBUILDDIR>>/assembler/build_spades/CMakeFiles/CMakeOutput.log".
See also "/<<PKGBUILDDIR>>/assembler/build_spades/CMakeFiles/CMakeError.log".
make[1]: *** [debian/rules:42: override_dh_auto_build] Error 1
make[1]: Leaving directory '/<<PKGBUILDDIR>>'
make: *** [debian/rules:24: build-arch] Error 2

Tail of log for rocksdb on armhf:

/usr/include/c++/10/bits/vector.tcc: In member function 'void std::vector<_Tp, _Alloc>::_M_realloc_insert(std::vector<_Tp, _Alloc>::iterator, _Args&& ...) [with _Args = {rocksdb::DBOptions, rocksdb::ColumnFamilyOptions&}; _Tp = rocksdb::Options; _Alloc = std::allocator<rocksdb::Options>]':
/usr/include/c++/10/bits/vector.tcc:426:7: note: parameter passing for argument of type 'std::vector<rocksdb::Options>::iterator' changed in GCC 7.1
/usr/include/c++/10/bits/vector.tcc: In member function 'void std::vector<_Tp, _Alloc>::emplace_back(_Args&& ...) [with _Args = {rocksdb::DBOptions, rocksdb::ColumnFamilyOptions&}; _Tp = rocksdb::Options; _Alloc = std::allocator<rocksdb::Options>]':
/usr/include/c++/10/bits/vector.tcc:121:21: note: parameter passing for argument of type '__gnu_cxx::__normal_iterator<rocksdb::Options*, std::vector<rocksdb::Options> >' changed in GCC 7.1
  121 |    _M_realloc_insert(end(), std::forward<_Args>(__args)...);
      |    ~~~~~~~~~~~~~~~~~^~~~~~~~~~~~~~~~~~~~~~~~~~~~~~~~~~~~~~~
/usr/include/c++/10/bits/vector.tcc: In member function 'virtual void rocksdb::DBCompactionTestWithParam_LevelCompactionCFPathUse_Test::TestBody()':
/usr/include/c++/10/bits/vector.tcc:121:21: note: parameter passing for argument of type '__gnu_cxx::__normal_iterator<rocksdb::Options*, std::vector<rocksdb::Options> >' changed in GCC 7.1
  121 |    _M_realloc_insert(end(), std::forward<_Args>(__args)...);
      |    ~~~~~~~~~~~~~~~~~^~~~~~~~~~~~~~~~~~~~~~~~~~~~~~~~~~~~~~~
make[2]: Leaving directory '/<<PKGBUILDDIR>>'
dh_auto_build: error: make -j4 "INSTALL=install --strip-program=true" all returned exit code 2
make[1]: *** [debian/rules:19: override_dh_auto_build] Error 25
make[1]: Leaving directory '/<<PKGBUILDDIR>>'
make: *** [debian/rules:29: build-arch] Error 2

Tail of log for gfccore on armhf:

set -e;    
make[1]: Leaving directory '/<<PKGBUILDDIR>>'
if [ "reverse-patches" = "reverse-patches" ]; then rm -f debian/stamp-patched; fi
patches: 
if [ "reverse-patches" != "reverse-patches" ]; then touch debian/stamp-patched; fi
if [ "reverse-patches" != "reverse-patches" ] ; then \
	/usr/bin/make -f debian/rules update-config ; \
fi
for dir in debian/patches ; do \
    rm -f $dir/*.log ; \
done
set -e;    
dh_clean 
dh_clean: error: Compatibility levels before 5 are no longer supported (level 4 requested)
make: *** [/usr/share/cdbs/1/rules/debhelper.mk:211: clean] Error 25

Tail of log for acovea on armhf:

 fakeroot debian/rules clean
dh_testdir
dh_testroot
rm -f build-stamp 
# Add here commands to clean up after the build process.
/usr/bin/make distclean
make[1]: Entering directory '/<<PKGBUILDDIR>>'
make[1]: *** No rule to make target 'distclean'.  Stop.
make[1]: Leaving directory '/<<PKGBUILDDIR>>'
make: [debian/rules:49: clean] Error 2 (ignored)
cp -f /usr/share/misc/config.sub config.sub
cp -f /usr/share/misc/config.guess config.guess
dh_clean 
dh_clean: error: Compatibility levels before 5 are no longer supported (level 4 requested)
make: *** [debian/rules:52: clean] Error 25

Tail of log for tensorpipe on armhf:

/usr/bin/ld: CMakeFiles/tensorpipe_test.dir/util/ringbuffer/ringbuffer_test.cc.o: in function `std::__atomic_base<unsigned long long>::fetch_add(unsigned long long, std::memory_order)':
/usr/include/c++/10/bits/atomic_base.h:548: undefined reference to `__atomic_fetch_add_8'
/usr/bin/ld: CMakeFiles/tensorpipe_test.dir/util/ringbuffer/ringbuffer_test.cc.o: in function `std::__atomic_base<unsigned long long>::load(std::memory_order) const':
/usr/include/c++/10/bits/atomic_base.h:426: undefined reference to `__atomic_load_8'
/usr/bin/ld: /usr/include/c++/10/bits/atomic_base.h:426: undefined reference to `__atomic_load_8'
/usr/bin/ld: ../libtensorpipe.so.0: undefined reference to `__atomic_fetch_sub_8'
collect2: error: ld returned 1 exit status
make[3]: *** [tensorpipe/test/CMakeFiles/tensorpipe_test.dir/build.make:488: tensorpipe/test/tensorpipe_test] Error 1
make[3]: Leaving directory '/<<PKGBUILDDIR>>/obj-arm-linux-gnueabihf'
make[2]: *** [CMakeFiles/Makefile2:227: tensorpipe/test/CMakeFiles/tensorpipe_test.dir/all] Error 2
make[2]: Leaving directory '/<<PKGBUILDDIR>>/obj-arm-linux-gnueabihf'
make[1]: *** [Makefile:152: all] Error 2
make[1]: Leaving directory '/<<PKGBUILDDIR>>/obj-arm-linux-gnueabihf'
dh_auto_build: error: cd obj-arm-linux-gnueabihf && make -j4 "INSTALL=install --strip-program=true" VERBOSE=1 returned exit code 2
make: *** [debian/rules:9: binary-arch] Error 25

Tail of log for mingw32-binutils on armhf:

dpkg-buildpackage
-----------------

dpkg-buildpackage: info: source package mingw32-binutils
dpkg-buildpackage: info: source version 2.20-0.2
dpkg-buildpackage: info: source distribution unstable
 dpkg-source --before-build .
dpkg-buildpackage: info: host architecture armhf
 fakeroot debian/rules clean
dh_testdir
dh_testroot
rm -rf /<<PKGBUILDDIR>>/build_dir *-stamp
dh_clean
dh_clean: error: Compatibility levels before 5 are no longer supported (level 4 requested)
make: *** [debian/rules:123: clean] Error 25

Tail of log for libibcm on armhf:

#define HAVE_STRING_H 1
#define HAVE_MEMORY_H 1
#define HAVE_STRINGS_H 1
#define HAVE_INTTYPES_H 1
#define HAVE_STDINT_H 1
#define HAVE_UNISTD_H 1
#define HAVE_DLFCN_H 1
#define LT_OBJDIR ".libs/"
#define SIZEOF_LONG 4
#define HAVE_LIBIBVERBS 1
#define STDC_HEADERS 1

configure: exit 1
dh_auto_configure: error: ./configure --build=arm-linux-gnueabihf --prefix=/usr --includedir=\${prefix}/include --mandir=\${prefix}/share/man --infodir=\${prefix}/share/info --sysconfdir=/etc --localstatedir=/var --disable-option-checking --disable-silent-rules --libdir=\${prefix}/lib/arm-linux-gnueabihf --libexecdir=\${prefix}/lib/arm-linux-gnueabihf --disable-maintainer-mode --disable-dependency-tracking returned exit code 1
make: *** [debian/rules:7: build-arch] Error 25

Tail of log for ocamlgsl on armhf:

arm-linux-gnueabihf-gcc src/mlgsl_sf.o (exit 1)
(cd _build/default/src && /usr/bin/arm-linux-gnueabihf-gcc -O2 -fno-strict-aliasing -fwrapv -fPIC -D_FILE_OFFSET_BITS=64 -D_REENTRANT -O2 -fno-strict-aliasing -fwrapv -fPIC -fPIC -DPIC -Wno-unused-parameter -g -I /usr/lib/ocaml -o mlgsl_sf.o -c mlgsl_sf.c)
In file included from mlgsl_sf.c:14:
wrappers.h:13:2: error: #error "Architectures with double-word alignment for doubles are not supported"
   13 | #error "Architectures with double-word alignment for doubles are not supported"
      |  ^~~~~
arm-linux-gnueabihf-gcc src/mlgsl_cdf.o (exit 1)
(cd _build/default/src && /usr/bin/arm-linux-gnueabihf-gcc -O2 -fno-strict-aliasing -fwrapv -fPIC -D_FILE_OFFSET_BITS=64 -D_REENTRANT -O2 -fno-strict-aliasing -fwrapv -fPIC -fPIC -DPIC -Wno-unused-parameter -g -I /usr/lib/ocaml -o mlgsl_cdf.o -c mlgsl_cdf.c)
In file included from mlgsl_cdf.c:2:
wrappers.h:13:2: error: #error "Architectures with double-word alignment for doubles are not supported"
   13 | #error "Architectures with double-word alignment for doubles are not supported"
      |  ^~~~~
make[1]: *** [debian/rules:11: override_dh_auto_build] Error 1
make[1]: Leaving directory '/<<PKGBUILDDIR>>'
make: *** [debian/rules:8: binary-arch] Error 2

Tail of log for asterisk-chan-capi on armhf:

 9096 |   if (cid_name == 0 && i->owner->cid.cid_name && *i->owner->cid.cid_name) {
      |                                ^~
chan_capi.c:9096:59: error: invalid use of undefined type 'struct ast_channel'
 9096 |   if (cid_name == 0 && i->owner->cid.cid_name && *i->owner->cid.cid_name) {
      |                                                           ^~
In file included from /usr/include/asterisk/asterisk.h:23,
                 from chan_capi.h:20,
                 from chan_capi.c:32:
chan_capi.c:9097:34: error: invalid use of undefined type 'struct ast_channel'
 9097 |   cid_name = ast_strdupa(i->owner->cid.cid_name);
      |                                  ^~
make[1]: *** [Makefile:198: chan_capi.o] Error 1
make[1]: Leaving directory '/<<PKGBUILDDIR>>'
dh_auto_build: error: make -j1 returned exit code 2
make: *** [debian/rules:3: build-arch] Error 25

Tail of log for apf on armhf:

checking for suffix of executables... 
checking for suffix of object files... o
checking whether we are using the GNU C compiler... yes
checking whether arm-linux-gnueabihf-gcc accepts -g... yes
checking for arm-linux-gnueabihf-gcc option to accept ISO C89... none needed
checking for style of include used by make... GNU
checking dependency style of arm-linux-gnueabihf-gcc... gcc3
checking how to run the C preprocessor... arm-linux-gnueabihf-gcc -E
checking for grep that handles long lines and -e... /bin/grep
checking for egrep... /bin/grep -E
checking whether arm-linux-gnueabihf-gcc needs -traditional... no
checking for openssl... no
checking for SSL_library_init in -lssl... no
configure: error: "lib ssl not found!"
make: *** [debian/rules:29: config.status] Error 1

Tail of log for bbhash on armhf:

BooPHF.h:817:35: error: expected ‘)’ before ‘word’
  817 |   return (uint64_t)(((__uint128_t)word * (__uint128_t)p) >> 64);
      |                     ~             ^~~~
      |                                   )
BooPHF.h:817:64: error: expected ‘)’ before ‘;’ token
  817 |   return (uint64_t)(((__uint128_t)word * (__uint128_t)p) >> 64);
      |                    ~                                           ^
      |                                                                )
make[1]: *** [makefile:25: example_custom_hash] Error 1
make[1]: *** Waiting for unfinished jobs....
make[1]: *** [makefile:22: example] Error 1
make[1]: *** [makefile:29: Bootest] Error 1
make[1]: Leaving directory '/<<PKGBUILDDIR>>'
dh_auto_build: error: make -j4 "INSTALL=install --strip-program=true" returned exit code 2
make: *** [debian/rules:21: binary-arch] Error 25

Tail of log for autofs5 on armhf:

/usr/bin/ld: ../lib/autofs.a(master.o): in function `master_submount_list_empty':
master.c:(.text+0x1950): undefined reference to `dump_core'
/usr/bin/ld: master.c:(.text+0x1970): undefined reference to `dump_core'
/usr/bin/ld: ../lib/autofs.a(master.o):master.c:(.text+0x1bdc): more undefined references to `dump_core' follow
/usr/bin/ld: ../lib/autofs.a(master.o): in function `master_mount_mounts':
master.c:(.text+0x2264): undefined reference to `pthread_create'
/usr/bin/ld: master.c:(.text+0x23dc): undefined reference to `dump_core'
/usr/bin/ld: ../lib/autofs.a(master.o): in function `master_done':
master.c:(.text+0x2544): undefined reference to `pthread_join'
collect2: error: ld returned 1 exit status
make[2]: *** [Makefile:28: automount] Error 1
make[2]: Leaving directory '/<<PKGBUILDDIR>>/daemon'
make[1]: *** [Makefile:14: daemon] Error 2
make[1]: Leaving directory '/<<PKGBUILDDIR>>'
make: *** [debian/rules:23: build.stamp] Error 2

Tail of log for badger on armhf:

runtime/pprof
net/http
runtime/trace
github.com/spf13/cobra
expvar
net/http/pprof
golang.org/x/net/trace
github.com/dgraph-io/badger/y
github.com/dgraph-io/badger/skl
github.com/dgraph-io/badger/table
github.com/dgraph-io/badger
# github.com/dgraph-io/badger
src/github.com/dgraph-io/badger/value.go:50:5: constant 4294967295 overflows int
dh_auto_build: error: cd obj-arm-linux-gnueabihf && go install -trimpath -v -p 4 github.com/dgraph-io/badger/badger github.com/dgraph-io/badger/badger/cmd github.com/dgraph-io/badger/integration/testgc github.com/dgraph-io/badger/options github.com/dgraph-io/badger/pb github.com/dgraph-io/badger/skl github.com/dgraph-io/badger/table github.com/dgraph-io/badger/trie github.com/dgraph-io/badger/y returned exit code 2
make: *** [debian/rules:7: binary-arch] Error 25

Tail of log for bcachefs-tools on armhf:

include/linux/slab.h:24:22: note: in expansion of macro ‘min’
   24 |   size_t alignment = min(rounddown_pow_of_two(size), (size_t)PAGE_SIZE);
      |                      ^~~
include/linux/kernel.h:78:17: warning: comparison of distinct pointer types lacks a cast
   78 |  (void) (&_min1 == &_min2);  \
      |                 ^~
include/linux/slab.h:24:22: note: in expansion of macro ‘min’
   24 |   size_t alignment = min(rounddown_pow_of_two(size), (size_t)PAGE_SIZE);
      |                      ^~~
make[1]: *** [<builtin>: cmd_assemble.o] Error 1
make[1]: *** [<builtin>: cmd_data.o] Error 1
make[1]: *** [<builtin>: cmd_attr.o] Error 1
make[1]: Leaving directory '/<<PKGBUILDDIR>>'
dh_auto_build: error: make -j4 "INSTALL=install --strip-program=true" returned exit code 2
make: *** [debian/rules:7: binary-arch] Error 25

Tail of log for bustools on armhf:

   73 | inline size_t rndup(size_t v) {
      |               ^~~~~
make[4]: *** [src/CMakeFiles/bustools_core.dir/build.make:98: src/CMakeFiles/bustools_core.dir/Common.cpp.o] Error 1
make[4]: *** Waiting for unfinished jobs....
make[4]: *** [src/CMakeFiles/bustools_core.dir/build.make:111: src/CMakeFiles/bustools_core.dir/bustools_capture.cpp.o] Error 1
make[4]: *** [src/CMakeFiles/bustools_core.dir/build.make:124: src/CMakeFiles/bustools_core.dir/bustools_correct.cpp.o] Error 1
make[4]: Leaving directory '/<<PKGBUILDDIR>>/obj-arm-linux-gnueabihf'
make[3]: *** [CMakeFiles/Makefile2:145: src/CMakeFiles/bustools_core.dir/all] Error 2
make[3]: Leaving directory '/<<PKGBUILDDIR>>/obj-arm-linux-gnueabihf'
make[2]: *** [Makefile:152: all] Error 2
make[2]: Leaving directory '/<<PKGBUILDDIR>>/obj-arm-linux-gnueabihf'
dh_auto_build: error: cd obj-arm-linux-gnueabihf && make -j4 "INSTALL=install --strip-program=true" VERBOSE=1 returned exit code 2
make[1]: *** [debian/rules:17: override_dh_auto_build] Error 25
make[1]: Leaving directory '/<<PKGBUILDDIR>>'
make: *** [debian/rules:9: binary-arch] Error 2

Tail of log for ccls on armhf:

      |  ~~~~~~~~~~~~~~~~~~~~~^~~~~~~~~~~~~~~~~~~~~~~~~
[100%] Linking CXX executable ccls
/usr/bin/cmake -E cmake_link_script CMakeFiles/ccls.dir/link.txt --verbose=1
/usr/bin/c++ -g -O2 -ffile-prefix-map=/<<PKGBUILDDIR>>=. -fstack-protector-strong -Wformat -Werror=format-security -Wdate-time -D_FORTIFY_SOURCE=2 -Wl,-z,relro -Wl,-z,now CMakeFiles/ccls.dir/third_party/siphash.cc.o CMakeFiles/ccls.dir/src/clang_tu.cc.o CMakeFiles/ccls.dir/src/config.cc.o CMakeFiles/ccls.dir/src/filesystem.cc.o CMakeFiles/ccls.dir/src/fuzzy_match.cc.o CMakeFiles/ccls.dir/src/main.cc.o CMakeFiles/ccls.dir/src/include_complete.cc.o CMakeFiles/ccls.dir/src/indexer.cc.o CMakeFiles/ccls.dir/src/log.cc.o CMakeFiles/ccls.dir/src/lsp.cc.o CMakeFiles/ccls.dir/src/message_handler.cc.o CMakeFiles/ccls.dir/src/pipeline.cc.o CMakeFiles/ccls.dir/src/platform_posix.cc.o CMakeFiles/ccls.dir/src/platform_win.cc.o CMakeFiles/ccls.dir/src/position.cc.o CMakeFiles/ccls.dir/src/project.cc.o CMakeFiles/ccls.dir/src/query.cc.o CMakeFiles/ccls.dir/src/sema_manager.cc.o CMakeFiles/ccls.dir/src/serializer.cc.o CMakeFiles/ccls.dir/src/test.cc.o CMakeFiles/ccls.dir/src/utils.cc.o CMakeFiles/ccls.dir/src/working_files.cc.o CMakeFiles/ccls.dir/src/messages/ccls_call.cc.o CMakeFiles/ccls.dir/src/messages/ccls_info.cc.o CMakeFiles/ccls.dir/src/messages/ccls_inheritance.cc.o CMakeFiles/ccls.dir/src/messages/ccls_member.cc.o CMakeFiles/ccls.dir/src/messages/ccls_navigate.cc.o CMakeFiles/ccls.dir/src/messages/ccls_reload.cc.o CMakeFiles/ccls.dir/src/messages/ccls_vars.cc.o CMakeFiles/ccls.dir/src/messages/initialize.cc.o CMakeFiles/ccls.dir/src/messages/textDocument_code.cc.o CMakeFiles/ccls.dir/src/messages/textDocument_completion.cc.o CMakeFiles/ccls.dir/src/messages/textDocument_definition.cc.o CMakeFiles/ccls.dir/src/messages/textDocument_did.cc.o CMakeFiles/ccls.dir/src/messages/textDocument_foldingRange.cc.o CMakeFiles/ccls.dir/src/messages/textDocument_formatting.cc.o CMakeFiles/ccls.dir/src/messages/textDocument_document.cc.o CMakeFiles/ccls.dir/src/messages/textDocument_hover.cc.o CMakeFiles/ccls.dir/src/messages/textDocument_references.cc.o CMakeFiles/ccls.dir/src/messages/textDocument_rename.cc.o CMakeFiles/ccls.dir/src/messages/textDocument_signatureHelp.cc.o CMakeFiles/ccls.dir/src/messages/workspace.cc.o -o ccls  -Wl,-rpath,/usr/lib/llvm-11/lib: /usr/lib/llvm-11/lib/libclang-cpp.so.11 /usr/lib/llvm-11/lib/libLLVM-11.so.1 -pthread 
/usr/bin/ld: CMakeFiles/ccls.dir/src/pipeline.cc.o: undefined reference to symbol '__atomic_load_8@@LIBATOMIC_1.0'
/usr/bin/ld: /usr/lib/arm-linux-gnueabihf/libatomic.so.1: error adding symbols: DSO missing from command line
collect2: error: ld returned 1 exit status
make[3]: *** [CMakeFiles/ccls.dir/build.make:723: ccls] Error 1
make[3]: Leaving directory '/<<PKGBUILDDIR>>/obj-arm-linux-gnueabihf'
make[2]: *** [CMakeFiles/Makefile2:210: CMakeFiles/ccls.dir/all] Error 2
make[2]: Leaving directory '/<<PKGBUILDDIR>>/obj-arm-linux-gnueabihf'
make[1]: *** [Makefile:152: all] Error 2
make[1]: Leaving directory '/<<PKGBUILDDIR>>/obj-arm-linux-gnueabihf'
dh_auto_build: error: cd obj-arm-linux-gnueabihf && make -j4 "INSTALL=install --strip-program=true" VERBOSE=1 returned exit code 2
make: *** [debian/rules:15: binary-arch] Error 25

Tail of log for audacious-analog-vumeter-plugin on armhf:

make[3]: Entering directory '/<<PKGBUILDDIR>>/src'
/bin/bash ../libtool --tag=CC   --mode=compile gcc -DHAVE_CONFIG_H -I. -I..    -Wall -ggdb  -g -O2 -DSKINDIR=\"/usr/share/audacious\" -g -O2 -c -o plugin_main.lo plugin_main.c
libtool: compile:  gcc -DHAVE_CONFIG_H -I. -I.. -Wall -ggdb -g -O2 -DSKINDIR=\"/usr/share/audacious\" -g -O2 -c plugin_main.c  -fPIC -DPIC -o .libs/plugin_main.o
plugin_main.c:1:10: fatal error: gtk/gtk.h: No such file or directory
    1 | #include <gtk/gtk.h>
      |          ^~~~~~~~~~~
compilation terminated.
make[3]: *** [Makefile:321: plugin_main.lo] Error 1
make[3]: Leaving directory '/<<PKGBUILDDIR>>/src'
make[2]: *** [Makefile:365: all-recursive] Error 1
make[2]: Leaving directory '/<<PKGBUILDDIR>>'
make[1]: *** [Makefile:254: all] Error 2
make[1]: Leaving directory '/<<PKGBUILDDIR>>'
dh_auto_build: error: make -j1 returned exit code 2
make: *** [debian/rules:8: build-arch] Error 25

Tail of log for blastem on armhf:

      |                                                                     ~~~~~~~~~^~~
z80_to_x86.c: In function 'zremove_breakpoint':
z80_to_x86.c:3872:22: warning: assignment to 'code_ptr' {aka 'unsigned int *'} from incompatible pointer type 'uint8_t *' {aka 'unsigned char *'} [-Wincompatible-pointer-types]
 3872 |   opts->gen.code.cur = native;
      |                      ^
z80_to_x86.c:3873:23: warning: assignment to 'code_ptr' {aka 'unsigned int *'} from incompatible pointer type 'uint8_t *' {aka 'unsigned char *'} [-Wincompatible-pointer-types]
 3873 |   opts->gen.code.last = native + 128;
      |                       ^
make[2]: *** [Makefile:356: z80_to_x86.o] Error 1
make[2]: *** Waiting for unfinished jobs....
make[2]: Leaving directory '/<<PKGBUILDDIR>>'
dh_auto_build: error: make -j4 "INSTALL=install --strip-program=true" HOST_ZLIB=1 CONFIG_PATH=/etc/blastem DATA_PATH=/usr/share/games/blastem returned exit code 2
make[1]: *** [debian/rules:10: override_dh_auto_build] Error 25
make[1]: Leaving directory '/<<PKGBUILDDIR>>'
make: *** [debian/rules:7: binary-arch] Error 2

Tail of log for criu on armhf:

arch/arm/include/asm/atomic.h: At top level:
arch/arm/include/asm/atomic.h:60:2: error: #error ARM architecture version (CONFIG_ARMV*) not set or unsupported.
   60 | #error ARM architecture version (CONFIG_ARMV*) not set or unsupported.
      |  ^~~~~
arch/arm/include/asm/atomic.h: In function 'atomic_add_return':
arch/arm/include/asm/atomic.h:81:2: error: implicit declaration of function 'smp_mb' [-Werror=implicit-function-declaration]
   81 |  smp_mb();
      |  ^~~~~~
cc1: all warnings being treated as errors
make[2]: *** [scripts/Makefile.build:185: arch/arm/crtools.o] Error 1
make[2]: Leaving directory '/<<PKGBUILDDIR>>'
make[1]: *** [Makefile:208: arch/arm] Error 2
make[1]: Leaving directory '/<<PKGBUILDDIR>>'
dh_auto_build: error: make -j4 returned exit code 2
make: *** [debian/rules:6: build-arch] Error 25

Tail of log for consul-migrate on armhf:

--- FAIL: TestMigrator_data (0.01s)
=== RUN   TestMigrator_new
--- PASS: TestMigrator_new (0.00s)
=== RUN   TestMigrator_migrate
    migrator_test.go:130: err: Failed to connect MDB: MDB_INVALID: File is not an LMDB file %!s(MISSING)
--- FAIL: TestMigrator_migrate (0.01s)
=== RUN   TestMigrator_migrate_fails
--- PASS: TestMigrator_migrate_fails (0.36s)
=== RUN   TestMigrator_migrate_noop
--- PASS: TestMigrator_migrate_noop (0.00s)
FAIL
FAIL	github.com/hashicorp/consul-migrate/migrator	0.412s
FAIL
dh_auto_test: error: cd obj-arm-linux-gnueabihf && go test -vet=off -v -p 1 github.com/hashicorp/consul-migrate github.com/hashicorp/consul-migrate/migrator returned exit code 1
make: *** [debian/rules:7: build-arch] Error 25

Tail of log for debiman on armhf:

--- PASS: TestCronSection (0.00s)
    --- PASS: TestCronSection/cron (0.00s)
PASS
ok  	github.com/Debian/debiman/internal/redirect	0.020s
=== RUN   TestSitemap
--- PASS: TestSitemap (0.00s)
=== RUN   TestSitemapIndex
--- PASS: TestSitemapIndex (0.00s)
PASS
ok  	github.com/Debian/debiman/internal/sitemap	0.006s
?   	github.com/Debian/debiman/internal/tag	[no test files]
?   	github.com/Debian/debiman/internal/write	[no test files]
FAIL
dh_auto_test: error: cd obj-arm-linux-gnueabihf && go test -vet=off -v -p 4 github.com/Debian/debiman github.com/Debian/debiman/cmd/debiman github.com/Debian/debiman/cmd/debiman-auxserver github.com/Debian/debiman/cmd/debiman-idx2rwmap github.com/Debian/debiman/cmd/debiman-minisrv github.com/Debian/debiman/internal/auxserver github.com/Debian/debiman/internal/bundled github.com/Debian/debiman/internal/commontmpl github.com/Debian/debiman/internal/convert github.com/Debian/debiman/internal/manpage github.com/Debian/debiman/internal/proto github.com/Debian/debiman/internal/recode github.com/Debian/debiman/internal/redirect github.com/Debian/debiman/internal/sitemap github.com/Debian/debiman/internal/tag github.com/Debian/debiman/internal/write returned exit code 1
make: *** [debian/rules:4: binary-arch] Error 25

Tail of log for cone on armhf:

myserverremoteconfig.C: In member function ‘mail::account* myServer::remoteConfig::login2()’:
myserverremoteconfig.C:145:11: error: cannot convert ‘bool’ to ‘mail::account*’ in return
  145 |    return false;
      |           ^~~~~
make[5]: *** [Makefile:849: myserverremoteconfig.o] Error 1
make[5]: Leaving directory '/<<PKGBUILDDIR>>/cone'
make[4]: *** [Makefile:970: all-recursive] Error 1
make[4]: Leaving directory '/<<PKGBUILDDIR>>/cone'
make[3]: *** [Makefile:617: all] Error 2
make[3]: Leaving directory '/<<PKGBUILDDIR>>/cone'
make[2]: *** [Makefile:370: all-recursive] Error 1
make[2]: Leaving directory '/<<PKGBUILDDIR>>'
make[1]: *** [Makefile:275: all] Error 2
make[1]: Leaving directory '/<<PKGBUILDDIR>>'
make: *** [/usr/share/cdbs/1/class/makefile.mk:77: debian/stamp-makefile-build] Error 2

Tail of log for bornagain on armhf:

gmake[3]: Entering directory '/<<PKGBUILDDIR>>/obj-arm-linux-gnueabihf/CMakeFiles/CMakeTmp'
Building C object CMakeFiles/cmTC_18b8a.dir/CheckIncludeFile.c.o
/usr/bin/cc   -g -O2 -ffile-prefix-map=/<<PKGBUILDDIR>>=. -fstack-protector-strong -Wformat -Werror=format-security -Wdate-time -D_FORTIFY_SOURCE=2 -pipe -m32 -Wall -W -fPIC  -std=gnu11 -o CMakeFiles/cmTC_18b8a.dir/CheckIncludeFile.c.o -c /<<PKGBUILDDIR>>/obj-arm-linux-gnueabihf/CMakeFiles/CMakeTmp/CheckIncludeFile.c
cc: error: unrecognized command-line option '-m32'; did you mean '-mbe32'?
gmake[3]: *** [CMakeFiles/cmTC_18b8a.dir/build.make:85: CMakeFiles/cmTC_18b8a.dir/CheckIncludeFile.c.o] Error 1
gmake[3]: Leaving directory '/<<PKGBUILDDIR>>/obj-arm-linux-gnueabihf/CMakeFiles/CMakeTmp'
gmake[2]: *** [Makefile:140: cmTC_18b8a/fast] Error 2
gmake[2]: Leaving directory '/<<PKGBUILDDIR>>/obj-arm-linux-gnueabihf/CMakeFiles/CMakeTmp'



dh_auto_configure: error: cd obj-arm-linux-gnueabihf && cmake -DCMAKE_INSTALL_PREFIX=/usr -DCMAKE_BUILD_TYPE=None -DCMAKE_INSTALL_SYSCONFDIR=/etc -DCMAKE_INSTALL_LOCALSTATEDIR=/var -DCMAKE_EXPORT_NO_PACKAGE_REGISTRY=ON -DCMAKE_FIND_PACKAGE_NO_PACKAGE_REGISTRY=ON -DCMAKE_INSTALL_RUNSTATEDIR=/run "-GUnix Makefiles" -DCMAKE_VERBOSE_MAKEFILE=ON -DCMAKE_INSTALL_LIBDIR=lib/arm-linux-gnueabihf -DCMAKE_DEB_HOST_MULTIARCH=arm-linux-gnueabihf -DCONFIGURE_MANPAGE=ON -DBORNAGAIN_MPI=ON -DBORNAGAIN_GENERATE_PYTHON_DOCS=ON -DBORNAGAIN_GENERATE_BINDINGS=ON "-DPython_ADDITIONAL_VERSIONS=3.9 3.8" .. returned exit code 1
make[1]: *** [debian/rules:37: override_dh_auto_configure] Error 25
make[1]: Leaving directory '/<<PKGBUILDDIR>>'
make: *** [debian/rules:34: build-arch] Error 2

Tail of log for fairy-stockfish on armhf:

/usr/bin/ld: /usr/include/c++/10/bits/atomic_base.h:426: undefined reference to `__atomic_load_8'
/usr/bin/ld: /tmp/stockfish.N5okO2.ltrans6.ltrans.o: in function `UCI::loop(int, char**)':
/usr/include/c++/10/bits/atomic_base.h:426: undefined reference to `__atomic_load_8'
/usr/bin/ld: /tmp/stockfish.N5okO2.ltrans9.ltrans.o: in function `ThreadPool::start_thinking(Position&, std::unique_ptr<std::deque<StateInfo, std::allocator<StateInfo> >, std::default_delete<std::deque<StateInfo, std::allocator<StateInfo> > > >&, Search::LimitsType const&, bool) [clone .constprop.0]':
/usr/include/c++/10/bits/atomic_base.h:404: undefined reference to `__atomic_store_8'
/usr/bin/ld: /usr/include/c++/10/bits/atomic_base.h:404: undefined reference to `__atomic_store_8'
collect2: error: ld returned 1 exit status
make[3]: *** [Makefile:516: stockfish] Error 1
make[3]: Leaving directory '/<<PKGBUILDDIR>>/src'
make[2]: *** [Makefile:433: build] Error 2
make[2]: Leaving directory '/<<PKGBUILDDIR>>/src'
dh_auto_build: error: cd src && make -j4 build ARCH=general-32 returned exit code 2
make[1]: *** [debian/rules:105: override_dh_auto_build] Error 25
make[1]: Leaving directory '/<<PKGBUILDDIR>>'
make: *** [debian/rules:99: build-arch] Error 2

Tail of log for fpzip on armhf:

one or more tests failed


0% tests passed, 1 tests failed out of 1

Total Test time (real) =   0.01 sec

The following tests FAILED:
	  1 - compress-decompress-validate (Failed)
Errors while running CTest
make[1]: *** [Makefile:140: test] Error 8
make[1]: Leaving directory '/<<PKGBUILDDIR>>/obj-arm-linux-gnueabihf'
	rm -fr -- /tmp/dh-xdg-rundir-9GsY2HYb
dh_auto_test: error: cd obj-arm-linux-gnueabihf && make -j4 test ARGS\+=-j4 returned exit code 2
make: *** [debian/rules:8: build-arch] Error 25

Tail of log for febootstrap on armhf:

File "febootstrap_utils.ml", line 85, characters 42-46:
85 |   really_input chan data 0 (String.length data);
                                               ^^^^
Error: This expression has type bytes but an expression was expected of type
         string
make[4]: *** [Makefile:1275: febootstrap_utils.cmx] Error 2
make[4]: Leaving directory '/<<PKGBUILDDIR>>/src'
make[3]: *** [Makefile:1058: all-recursive] Error 1
make[3]: Leaving directory '/<<PKGBUILDDIR>>'
make[2]: *** [Makefile:996: all] Error 2
make[2]: Leaving directory '/<<PKGBUILDDIR>>'
dh_auto_build: error: make -j1 returned exit code 2
make[1]: *** [debian/rules:8: override_dh_auto_build] Error 25
make[1]: Leaving directory '/<<PKGBUILDDIR>>'
make: *** [debian/rules:11: build-arch] Error 2

Tail of log for deng on armhf:

  175 |                                         pixel[1] = png_info->palette[rows[i][off]].green;
      |                                                            ^~
/<<BUILDDIR>>/deng-1.9.0-beta6.9+dfsg1/doomsday/engine/portable/src/gl_png.c:176:60: error: invalid use of incomplete typedef 'png_info' {aka 'struct png_info_def'}
  176 |                                         pixel[2] = png_info->palette[rows[i][off]].blue;
      |                                                            ^~
/<<BUILDDIR>>/deng-1.9.0-beta6.9+dfsg1/doomsday/engine/portable/src/gl_png.c:183:48: error: invalid use of incomplete typedef 'png_info' {aka 'struct png_info_def'}
  183 |                                     if(png_info->channels == 2) // Alpha data.
      |                                                ^~
make[3]: *** [CMakeFiles/doomsday.dir/build.make:745: CMakeFiles/doomsday.dir/engine/portable/src/gl_png.o] Error 1
make[3]: Leaving directory '/<<BUILDDIR>>/deng-1.9.0-beta6.9+dfsg1/doomsdaybuild'
make[2]: *** [CMakeFiles/Makefile2:228: CMakeFiles/doomsday.dir/all] Error 2
make[2]: Leaving directory '/<<BUILDDIR>>/deng-1.9.0-beta6.9+dfsg1/doomsdaybuild'
make[1]: *** [Makefile:171: all] Error 2
make[1]: Leaving directory '/<<BUILDDIR>>/deng-1.9.0-beta6.9+dfsg1/doomsdaybuild'
make: *** [debian/rules:25: build-stamp] Error 2

Tail of log for gjh-asl-json on armhf:

  280 | #define conval(x,r,ne)  (*((ASL*)asl)->p.Conval)((ASL*)asl,x,r,ne)
      |                                                                ^~
src/AmplInterface.cpp: In member function ‘void AmplInterface::eval_jac_c(const double*, double*) const’:
src/AmplInterface.cpp:920:37: error: invalid conversion from ‘int*’ to ‘fint*’ {aka ‘long int*’} [-fpermissive]
  920 |    jacval((double*)x, jac_c_values, &nerror);
      |                                     ^~~~~~~
      |                                     |
      |                                     int*
/usr/include/ampl-netlib-solvers/asl.h:281:64: note: in definition of macro ‘jacval’
  281 | #define jacval(x,j,ne)  (*((ASL*)asl)->p.Jacval)((ASL*)asl,x,j,ne)
      |                                                                ^~
make[1]: *** [Makefile:25: src/AmplInterface.o] Error 1
make[1]: Leaving directory '/<<BUILDDIR>>/gjh-asl-json-0.0+git20180428.eb8720e'
dh_auto_build: error: make -j4 "INSTALL=install --strip-program=true" returned exit code 2
make: *** [debian/rules:21: binary-arch] Error 25

Tail of log for garagemq on armhf:

expvar
golang.org/x/net/trace
runtime/trace
net/http/pprof
encoding/xml
github.com/spf13/viper
github.com/dgraph-io/badger/y
github.com/dgraph-io/badger/skl
github.com/dgraph-io/badger/table
github.com/valinurovam/garagemq/protocol
github.com/dgraph-io/badger
# github.com/dgraph-io/badger
src/github.com/dgraph-io/badger/value.go:50:5: constant 4294967295 overflows int
dh_auto_build: error: cd obj-arm-linux-gnueabihf && go install -trimpath -v -p 4 github.com/valinurovam/garagemq github.com/valinurovam/garagemq/admin github.com/valinurovam/garagemq/amqp github.com/valinurovam/garagemq/auth github.com/valinurovam/garagemq/binding github.com/valinurovam/garagemq/config github.com/valinurovam/garagemq/consumer github.com/valinurovam/garagemq/exchange github.com/valinurovam/garagemq/interfaces github.com/valinurovam/garagemq/metrics github.com/valinurovam/garagemq/msgstorage github.com/valinurovam/garagemq/pool github.com/valinurovam/garagemq/protocol github.com/valinurovam/garagemq/qos github.com/valinurovam/garagemq/queue github.com/valinurovam/garagemq/safequeue github.com/valinurovam/garagemq/server github.com/valinurovam/garagemq/srvstorage github.com/valinurovam/garagemq/storage returned exit code 2
make: *** [debian/rules:4: build-arch] Error 25

Tail of log for gloo on armhf:

    arg [/usr/lib/gcc/arm-linux-gnueabihf/10/../../../arm-linux-gnueabihf/crtn.o] ==> ignore
  collapse library dir [/usr/lib/gcc/arm-linux-gnueabihf/10] ==> [/usr/lib/gcc/arm-linux-gnueabihf/10]
  collapse library dir [/usr/lib/gcc/arm-linux-gnueabihf/10/../../../arm-linux-gnueabihf] ==> [/usr/lib/arm-linux-gnueabihf]
  collapse library dir [/usr/lib/gcc/arm-linux-gnueabihf/10/../../..] ==> [/usr/lib]
  collapse library dir [/lib/arm-linux-gnueabihf] ==> [/lib/arm-linux-gnueabihf]
  collapse library dir [/usr/lib/arm-linux-gnueabihf] ==> [/usr/lib/arm-linux-gnueabihf]
  implicit libs: [gcc;gcc_s;c;gcc;gcc_s]
  implicit dirs: [/usr/lib/gcc/arm-linux-gnueabihf/10;/usr/lib/arm-linux-gnueabihf;/usr/lib;/lib/arm-linux-gnueabihf]
  implicit fwks: []


dh_auto_configure: error: cd obj-arm-linux-gnueabihf && cmake -DCMAKE_INSTALL_PREFIX=/usr -DCMAKE_BUILD_TYPE=None -DCMAKE_INSTALL_SYSCONFDIR=/etc -DCMAKE_INSTALL_LOCALSTATEDIR=/var -DCMAKE_EXPORT_NO_PACKAGE_REGISTRY=ON -DCMAKE_FIND_PACKAGE_NO_PACKAGE_REGISTRY=ON -DCMAKE_INSTALL_RUNSTATEDIR=/run -DCMAKE_SKIP_INSTALL_ALL_DEPENDENCY=ON "-GUnix Makefiles" -DCMAKE_VERBOSE_MAKEFILE=ON -DCMAKE_INSTALL_LIBDIR=lib/arm-linux-gnueabihf -DCMAKE_BUILD_TYPE=RelWithDebInfo -DUSE_REDIS=ON -DUSE_IBVERBS=ON -DUSE_MPI=OFF -DUSE_LIBUV=OFF -DUSE_CUDA=OFF -DUSE_NCCL=OFF -DBUILD_TEST=OFF -DBUILD_BENCHMARK=OFF -DBUILD_SHARED_LIBS=ON .. returned exit code 1
make[1]: *** [debian/rules:13: override_dh_auto_configure] Error 2
make[1]: Leaving directory '/<<PKGBUILDDIR>>'
make: *** [debian/rules:8: binary-arch] Error 2

Tail of log for golang-android-soong on armhf:

android/soong/partner/bpfix
android/soong/phony
android/soong/rust/config
android/soong/scripts
android/soong/symbol_inject/cmd
android/soong/xml
android/soong/zip/cmd
android/soong/sh
android/soong/rust
android/soong/java
android/soong/sysprop
android/soong/apex
android/soong/sdk
dh_auto_build: error: cd _build && go install -trimpath -v -p 4 android/soong android/soong/android android/soong/android/soongconfig android/soong/androidmk/androidmk android/soong/androidmk/cmd android/soong/androidmk/parser android/soong/apex android/soong/bpf android/soong/bpfix/bpfix android/soong/bpfix/cmd android/soong/bpfix/cmd_lib android/soong/cc android/soong/cc/config android/soong/cmd/dep_fixer android/soong/cmd/diff_target_files android/soong/cmd/extract_apks android/soong/cmd/extract_apks/bundle_proto android/soong/cmd/extract_jar_packages android/soong/cmd/extract_linker android/soong/cmd/fileslist android/soong/cmd/host_bionic_inject android/soong/cmd/javac_wrapper android/soong/cmd/merge_zips android/soong/cmd/multiproduct_kati android/soong/cmd/path_interposer android/soong/cmd/pom2bp android/soong/cmd/pom2mk android/soong/cmd/sbox android/soong/cmd/soong_build android/soong/cmd/soong_env android/soong/cmd/soong_ui android/soong/cmd/zip2zip android/soong/cmd/zipsync android/soong/cuj android/soong/dexpreopt android/soong/dexpreopt/dexpreopt_gen android/soong/env android/soong/etc android/soong/finder android/soong/finder/cmd android/soong/finder/fs android/soong/genrule android/soong/jar android/soong/java android/soong/java/config android/soong/makedeps android/soong/partner/androidmk android/soong/partner/bpfix android/soong/partner/bpfix/extensions android/soong/phony android/soong/python android/soong/remoteexec android/soong/rust android/soong/rust/config android/soong/scripts android/soong/sdk android/soong/sh android/soong/shared android/soong/symbol_inject android/soong/symbol_inject/cmd android/soong/sysprop android/soong/third_party/zip android/soong/tradefed android/soong/ui/build android/soong/ui/build/paths android/soong/ui/logger android/soong/ui/metrics android/soong/ui/metrics/metrics_proto android/soong/ui/metrics/upload_proto android/soong/ui/status android/soong/ui/status/build_error_proto android/soong/ui/status/build_progress_proto android/soong/ui/status/ninja_frontend android/soong/ui/terminal android/soong/ui/tracer android/soong/xml android/soong/zip android/soong/zip/cmd returned exit code 2
make: *** [debian/rules:6: binary-arch] Error 25

Tail of log for haskell-ghc-lib-parser-ex on armhf:

ghc-lib-parser-ex-test:   -Mgrace=<n>
ghc-lib-parser-ex-test:             The amount of allocation after the program receives a
ghc-lib-parser-ex-test:             HeapOverflow exception before the exception is thrown again, if
ghc-lib-parser-ex-test:             the program is still exceeding the heap limit.
ghc-lib-parser-ex-test: 
ghc-lib-parser-ex-test: RTS options may also be specified using the GHCRTS environment variable.
ghc-lib-parser-ex-test: 
ghc-lib-parser-ex-test: Other RTS options may be available for programs compiled a different way.
ghc-lib-parser-ex-test: The GHC User's Guide has full details.
ghc-lib-parser-ex-test: 
Test suite ghc-lib-parser-ex-test: FAIL
Test suite logged to:
dist-ghc/test/ghc-lib-parser-ex-8.10.0.16-ghc-lib-parser-ex-test.log
0 of 1 test suites (0 of 1 test cases) passed.
make: *** [/usr/share/cdbs/1/class/hlibrary.mk:154: check-ghc-stamp] Error 1

Tail of log for deepin-movie-reborn on armhf:

                 from /usr/include/arm-linux-gnueabihf/qt5/QtWidgets/QtWidgetsDepends:4,
                 from /usr/include/arm-linux-gnueabihf/qt5/QtWidgets/QtWidgets:3,
                 from /<<PKGBUILDDIR>>/src/libdmr/player_backend.h:33,
                 from /<<PKGBUILDDIR>>/src/backends/mpv/mpv_proxy.h:36,
                 from /<<PKGBUILDDIR>>/src/backends/mpv/mpv_proxy.cpp:32:
/usr/include/arm-linux-gnueabihf/qt5/QtGui/qpixmap.h:134:13: note: declared here
  134 |     QPixmap transformed(const QMatrix &, Qt::TransformationMode mode = Qt::FastTransformation) const;
      |             ^~~~~~~~~~~
make[3]: Leaving directory '/<<PKGBUILDDIR>>/obj-arm-linux-gnueabihf'
make[2]: *** [CMakeFiles/Makefile2:160: src/CMakeFiles/deepin-movie.dir/all] Error 2
make[2]: Leaving directory '/<<PKGBUILDDIR>>/obj-arm-linux-gnueabihf'
make[1]: *** [Makefile:152: all] Error 2
make[1]: Leaving directory '/<<PKGBUILDDIR>>/obj-arm-linux-gnueabihf'
dh_auto_build: error: cd obj-arm-linux-gnueabihf && make -j4 "INSTALL=install --strip-program=true" VERBOSE=1 returned exit code 2
make: *** [debian/rules:14: binary-arch] Error 25

Tail of log for ghemical on armhf:

/usr/bin/ld: /usr/lib/gcc/arm-linux-gnueabihf/10/../../../arm-linux-gnueabihf/libghemical.so: undefined reference to `sc::KeyVal::exists(char const*)'
/usr/bin/ld: /usr/lib/gcc/arm-linux-gnueabihf/10/../../../arm-linux-gnueabihf/libghemical.so: undefined reference to `sc::Appearance::Appearance(sc::Ref<sc::KeyVal> const&)'
/usr/bin/ld: /usr/lib/gcc/arm-linux-gnueabihf/10/../../../arm-linux-gnueabihf/libghemical.so: undefined reference to `sc::PrefixKeyVal::PrefixKeyVal(sc::Ref<sc::KeyVal> const&, char const*)'
/usr/bin/ld: /usr/lib/gcc/arm-linux-gnueabihf/10/../../../arm-linux-gnueabihf/libghemical.so: undefined reference to `sc::RenderedBallMolecule::RenderedBallMolecule(sc::Ref<sc::KeyVal> const&)'
collect2: error: ld returned 1 exit status
make[4]: *** [Makefile:595: ghemical] Error 1
make[4]: Leaving directory '/<<PKGBUILDDIR>>/src'
make[3]: *** [Makefile:682: all-recursive] Error 1
make[3]: Leaving directory '/<<PKGBUILDDIR>>/src'
make[2]: *** [Makefile:495: all] Error 2
make[2]: Leaving directory '/<<PKGBUILDDIR>>/src'
make[1]: *** [Makefile:427: all-recursive] Error 1
make[1]: Leaving directory '/<<PKGBUILDDIR>>'
dh_auto_build: error: make -j4 returned exit code 2
make: *** [debian/rules:13: build-arch] Error 25

Tail of log for cyclonedds on armhf:

--- debian/libddsc0.symbols (libddsc0_0.7.0-7_armhf)
+++ dpkg-gensymbolsCoCGVF	2021-03-19 03:36:16.002657371 +0000
@@ -768,7 +768,7 @@
  ddsrt_atomic_cas32@Base 0.7.0
  ddsrt_atomic_cas64@Base 0.7.0
  ddsrt_atomic_casptr@Base 0.7.0
- (arch=i386 armhf)ddsrt_atomic_casvoidp2@Base 0.7.0
+#MISSING: 0.7.0-7# (arch=i386 armhf)ddsrt_atomic_casvoidp2@Base 0.7.0
  ddsrt_atomic_casvoidp@Base 0.7.0
  ddsrt_atomic_dec32@Base 0.7.0
  ddsrt_atomic_dec32_nv@Base 0.7.0
dh_makeshlibs: error: failing due to earlier errors
make[1]: *** [debian/rules:58: override_dh_makeshlibs] Error 25
make[1]: Leaving directory '/<<PKGBUILDDIR>>'
make: *** [debian/rules:16: binary-arch] Error 2

Tail of log for gatb-core on armhf:

/usr/bin/ld: /usr/include/c++/10/bits/atomic_base.h:426: undefined reference to `__atomic_load_8'
/usr/bin/ld: /usr/include/c++/10/bits/atomic_base.h:426: undefined reference to `__atomic_load_8'
/usr/bin/ld: CMakeFiles/gatb-core-cppunit.dir/src/bcalm/TestBcalm.cpp.o: in function `std::__atomic_base<unsigned long long>::compare_exchange_weak(unsigned long long&, unsigned long long, std::memory_order, std::memory_order)':
/usr/include/c++/10/bits/atomic_base.h:464: undefined reference to `__atomic_compare_exchange_8'
collect2: error: ld returned 1 exit status
make[4]: *** [test/unit/CMakeFiles/gatb-core-cppunit.dir/build.make:459: bin/None/gatb-core-cppunit] Error 1
make[4]: Leaving directory '/<<BUILDDIR>>/gatb-core-1.4.2+dfsg/obj-arm-linux-gnueabihf'
make[3]: *** [CMakeFiles/Makefile2:418: test/unit/CMakeFiles/gatb-core-cppunit.dir/all] Error 2
make[3]: Leaving directory '/<<BUILDDIR>>/gatb-core-1.4.2+dfsg/obj-arm-linux-gnueabihf'
make[2]: *** [Makefile:174: all] Error 2
make[2]: Leaving directory '/<<BUILDDIR>>/gatb-core-1.4.2+dfsg/obj-arm-linux-gnueabihf'
dh_auto_build: error: cd obj-arm-linux-gnueabihf && make -j4 "INSTALL=install --strip-program=true" VERBOSE=1 returned exit code 2
make[1]: *** [debian/rules:21: override_dh_auto_build-arch] Error 25
make[1]: Leaving directory '/<<BUILDDIR>>/gatb-core-1.4.2+dfsg'
make: *** [debian/rules:15: binary-arch] Error 2

Tail of log for dballe on armhf:

OK
2021-03-19 03:39:30,918 INFO test-csv: /usr/bin/python3 /<<PKGBUILDDIR>>/python/test-csv.py: success
2021-03-19 03:39:30,921 INFO runtest: 13 tests requested, 11 succeeded, 2 failed, 0 did not run.
make[5]: *** [Makefile:1035: check-local] Error 1
make[5]: Leaving directory '/<<PKGBUILDDIR>>/python'
make[4]: *** [Makefile:848: check-am] Error 2
make[4]: Leaving directory '/<<PKGBUILDDIR>>/python'
make[3]: *** [Makefile:850: check] Error 2
make[3]: Leaving directory '/<<PKGBUILDDIR>>/python'
make[2]: *** [Makefile:593: check-recursive] Error 1
make[2]: Leaving directory '/<<PKGBUILDDIR>>'
make[1]: *** [Makefile:891: check] Error 2
make[1]: Leaving directory '/<<PKGBUILDDIR>>'
dh_auto_test: error: make -j4 check VERBOSE=1 returned exit code 2
make: *** [debian/rules:7: build-arch] Error 25

Tail of log for gammapy on armhf:

FAILED gammapy/maps/tests/test_base.py::test_map_copy[0.1-10.0-hpx-skydir2-axes2-]
FAILED gammapy/maps/tests/test_base.py::test_map_copy[0.1-10.0-hpx-skydir3-axes3-s^2]
FAILED gammapy/maps/tests/test_base.py::test_map_get_image_by_coord[0.1-10.0-hpx-skydir2-axes2-]
FAILED gammapy/maps/tests/test_base.py::test_map_get_image_by_coord[0.1-10.0-hpx-skydir3-axes3-s^2]
FAILED gammapy/maps/tests/test_base.py::test_map_get_image_by_pix[0.1-10.0-hpx-skydir2-axes2-]
FAILED gammapy/maps/tests/test_base.py::test_map_get_image_by_pix[0.1-10.0-hpx-skydir3-axes3-s^2]
FAILED gammapy/maps/tests/test_base.py::test_map_slice_by_idx[0.1-10.0-hpx-skydir2-axes2-]
FAILED gammapy/maps/tests/test_base.py::test_map_slice_by_idx[0.1-10.0-hpx-skydir3-axes3-s^2]
FAILED gammapy/maps/tests/test_base.py::test_map_meta_read_write[hpx] - numpy...
FAILED gammapy/maps/tests/test_hpxmap.py::test_plot - ValueError: negative di...
FAILED gammapy/maps/tests/test_hpxmap.py::test_plot_poly - ValueError: negati...
= 13 failed, 1043 passed, 447 skipped, 3 xfailed, 2 xpassed in 1128.87s (0:18:48) =
E: pybuild pybuild:353: test: plugin distutils failed with: exit code=1: cd /<<PKGBUILDDIR>>/.pybuild/cpython3_3.9_gammapy/build; python3.9 -m pytest 
dh_auto_test: error: pybuild --test --test-pytest -i python{version} -p 3.9 returned exit code 13
make: *** [debian/rules:9: build-arch] Error 25

Tail of log for haskell-pretty-simple on armhf:

[7 of 9] Compiling Text.Pretty.Simple.Internal ( src/Text/Pretty/Simple/Internal.hs, dist-ghc/build/Text/Pretty/Simple/Internal.p_o )
[8 of 9] Compiling Text.Pretty.Simple ( src/Text/Pretty/Simple.hs, dist-ghc/build/Text/Pretty/Simple.p_o )
[9 of 9] Compiling Debug.Pretty.Simple ( src/Debug/Pretty/Simple.hs, dist-ghc/build/Debug/Pretty/Simple.p_o )
touch build-ghc-stamp
. /usr/share/haskell-devscripts/Dh_Haskell.sh && \
check_recipe
Running debian/hlibrary.setup test --builddir=dist-ghc --show-details=direct
Running 1 test suites...
Test suite pretty-simple-doctest: RUNNING...
pretty-simple-doctest: fd:13: hGetLine: end of file
Test suite pretty-simple-doctest: FAIL
Test suite logged to:
dist-ghc/test/pretty-simple-3.2.3.0-pretty-simple-doctest.log
0 of 1 test suites (0 of 1 test cases) passed.
make: *** [/usr/share/cdbs/1/class/hlibrary.mk:154: check-ghc-stamp] Error 1

Tail of log for haskell-xml-html-qq on armhf:

xml-html-qq-test: 
xml-html-qq-test:   -Mgrace=<n>
xml-html-qq-test:             The amount of allocation after the program receives a
xml-html-qq-test:             HeapOverflow exception before the exception is thrown again, if
xml-html-qq-test:             the program is still exceeding the heap limit.
xml-html-qq-test: 
xml-html-qq-test: RTS options may also be specified using the GHCRTS environment variable.
xml-html-qq-test: 
xml-html-qq-test: Other RTS options may be available for programs compiled a different way.
xml-html-qq-test: The GHC User's Guide has full details.
xml-html-qq-test: 
Test suite xml-html-qq-test: FAIL
Test suite logged to: dist-ghc/test/xml-html-qq-0.1.0.1-xml-html-qq-test.log
0 of 2 test suites (0 of 2 test cases) passed.
make: *** [/usr/share/cdbs/1/class/hlibrary.mk:154: check-ghc-stamp] Error 1

Tail of log for ivar on armhf:

See tests/test-suite.log
Please report to gkarthik@scripps.edu
============================================================================
make[5]: *** [Makefile:904: test-suite.log] Error 1
make[5]: Leaving directory '/<<BUILDDIR>>/ivar-1.3+dfsg/tests'
make[4]: *** [Makefile:1012: check-TESTS] Error 2
make[4]: Leaving directory '/<<BUILDDIR>>/ivar-1.3+dfsg/tests'
make[3]: *** [Makefile:1205: check-am] Error 2
make[3]: Leaving directory '/<<BUILDDIR>>/ivar-1.3+dfsg/tests'
make[2]: *** [Makefile:362: check-recursive] Error 1
make[2]: Leaving directory '/<<BUILDDIR>>/ivar-1.3+dfsg'
dh_auto_test: error: make -j1 check VERBOSE=1 returned exit code 2
make[1]: *** [debian/rules:12: override_dh_auto_test] Error 25
make[1]: Leaving directory '/<<BUILDDIR>>/ivar-1.3+dfsg'
make: *** [debian/rules:9: binary-arch] Error 2

Tail of log for ioapps on armhf:

dpkg-buildpackage
-----------------

dpkg-buildpackage: info: source package ioapps
dpkg-buildpackage: info: source version 1.4r2-3
dpkg-buildpackage: info: source distribution unstable
 dpkg-source --before-build .
dpkg-buildpackage: info: host architecture armhf
 fakeroot debian/rules clean
dh clean --with python2
dh: warning: Compatibility levels before 10 are deprecated (level 8 in use)
dh: error: unable to load addon python2: Can't locate Debian/Debhelper/Sequence/python2.pm in @INC (you may need to install the Debian::Debhelper::Sequence::python2 module) (@INC contains: /etc/perl /usr/local/lib/arm-linux-gnueabihf/perl/5.32.1 /usr/local/share/perl/5.32.1 /usr/lib/arm-linux-gnueabihf/perl5/5.32 /usr/share/perl5 /usr/lib/arm-linux-gnueabihf/perl-base /usr/lib/arm-linux-gnueabihf/perl/5.32 /usr/share/perl/5.32 /usr/local/lib/site_perl) at (eval 10) line 1.
BEGIN failed--compilation aborted at (eval 10) line 1.

make: *** [debian/rules:14: clean] Error 25

Tail of log for haskell-type-level on armhf:

    |
266 | instance (DivMod x y q r) => Div x y q
    |          ^^^^^^^^^^^^^^^^^^^^^^^^^^^^^

src/Data/TypeLevel/Num/Ops.hs:336:10: error:
    * Illegal instance declaration for `Div10 x q'
        The liberal coverage condition fails in class `Div10'
          for functional dependency: `q -> x'
        Reason: lhs type `q' does not determine rhs type `x'
        Un-determined variable: x
    * In the instance declaration for `Div10 x q'
    |
336 | instance DivMod10 x q r => Div10 x q
    |          ^^^^^^^^^^^^^^^^^^^^^^^^^^^
make: *** [/usr/share/cdbs/1/class/hlibrary.mk:147: build-ghc-stamp] Error 1

Tail of log for jocaml on armhf:

|---
| tools/ocamlmklib.ml | 5 +++++
| 1 file changed, 5 insertions(+)
|
|diff --git a/tools/ocamlmklib.ml b/tools/ocamlmklib.ml
|index d5bb84c..ab3ca2b 100644
|--- a/tools/ocamlmklib.ml
|+++ b/tools/ocamlmklib.ml
--------------------------
No file to patch.  Skipping patch.
1 out of 1 hunk ignored
Patch debian/patches/0001-Don-t-use-rpath.patch does not apply (enforce with -f)
make[1]: *** [debian/rules:22: override_dh_auto_configure] Error 1
make[1]: Leaving directory '/<<PKGBUILDDIR>>'
make: *** [debian/rules:85: build-arch] Error 2

Tail of log for kafs-client on armhf:

cc: error: unrecognized command-line option '-m32'; did you mean '-mbe32'?
cc: error: unrecognized command-line option '-m32'; did you mean '-mbe32'?
make[2]: *** [Makefile:34: lib_dns_lookup.os] Error 1
make[2]: *** Waiting for unfinished jobs....
make[2]: *** [Makefile:34: lib_cell_lookup.os] Error 1
cc: error: unrecognized command-line option '-m32'; did you mean '-mbe32'?
make[2]: *** [Makefile:34: lib_cellserv.os] Error 1
cc: error: unrecognized command-line option '-m32'; did you mean '-mbe32'?
cc: error: unrecognized command-line option '-m32'; did you mean '-mbe32'?
make[2]: *** [Makefile:34: lib_object.os] Error 1
make[2]: Leaving directory '/<<PKGBUILDDIR>>/src'
make[1]: *** [Makefile:43: all] Error 2
make[1]: Leaving directory '/<<PKGBUILDDIR>>'
dh_auto_build: error: make -j4 "INSTALL=install --strip-program=true" returned exit code 2
make: *** [debian/rules:8: binary-arch] Error 25

Tail of log for libbiod on armhf:

gdc: error: unrecognized command-line option ‘-release’; did you mean ‘-frelease’?
gdc: error: unrecognized command-line option ‘-boundscheck=off’; did you mean ‘-fbounds-check=off’?
[3/199] gdc -Ilibbiod.so.0.2.3.p -I. -I.. -Wall -Wdeprecated -g -O2 -ffile-prefix-map=/<<BUILDDIR>>/libbiod-0.2.3+git20191120.b8eecef=. -fstack-protector-strong -frelease -fPIC -O3 -release -enable-inlining -boundscheck=off -MD -MQ libbiod.so.0.2.3.p/contrib_undead_internal_file.d.o -MF libbiod.so.0.2.3.p/contrib_undead_internal_file.d.o.deps -o libbiod.so.0.2.3.p/contrib_undead_internal_file.d.o -c ../contrib/undead/internal/file.d
FAILED: libbiod.so.0.2.3.p/contrib_undead_internal_file.d.o 
gdc -Ilibbiod.so.0.2.3.p -I. -I.. -Wall -Wdeprecated -g -O2 -ffile-prefix-map=/<<BUILDDIR>>/libbiod-0.2.3+git20191120.b8eecef=. -fstack-protector-strong -frelease -fPIC -O3 -release -enable-inlining -boundscheck=off -MD -MQ libbiod.so.0.2.3.p/contrib_undead_internal_file.d.o -MF libbiod.so.0.2.3.p/contrib_undead_internal_file.d.o.deps -o libbiod.so.0.2.3.p/contrib_undead_internal_file.d.o -c ../contrib/undead/internal/file.d
gdc: error: unrecognized command-line option ‘-release’; did you mean ‘-frelease’?
gdc: error: unrecognized command-line option ‘-boundscheck=off’; did you mean ‘-fbounds-check=off’?
[4/199] gdc -Ilibbiod.so.0.2.3.p -I. -I.. -Wall -Wdeprecated -g -O2 -ffile-prefix-map=/<<BUILDDIR>>/libbiod-0.2.3+git20191120.b8eecef=. -fstack-protector-strong -frelease -fPIC -O3 -release -enable-inlining -boundscheck=off -MD -MQ libbiod.so.0.2.3.p/contrib_undead_doformat.d.o -MF libbiod.so.0.2.3.p/contrib_undead_doformat.d.o.deps -o libbiod.so.0.2.3.p/contrib_undead_doformat.d.o -c ../contrib/undead/doformat.d
FAILED: libbiod.so.0.2.3.p/contrib_undead_doformat.d.o 
gdc -Ilibbiod.so.0.2.3.p -I. -I.. -Wall -Wdeprecated -g -O2 -ffile-prefix-map=/<<BUILDDIR>>/libbiod-0.2.3+git20191120.b8eecef=. -fstack-protector-strong -frelease -fPIC -O3 -release -enable-inlining -boundscheck=off -MD -MQ libbiod.so.0.2.3.p/contrib_undead_doformat.d.o -MF libbiod.so.0.2.3.p/contrib_undead_doformat.d.o.deps -o libbiod.so.0.2.3.p/contrib_undead_doformat.d.o -c ../contrib/undead/doformat.d
gdc: error: unrecognized command-line option ‘-release’; did you mean ‘-frelease’?
gdc: error: unrecognized command-line option ‘-boundscheck=off’; did you mean ‘-fbounds-check=off’?
ninja: build stopped: subcommand failed.
dh_auto_build: error: cd obj-arm-linux-gnueabihf && LC_ALL=C.UTF-8 ninja -j4 -v returned exit code 1
make: *** [debian/rules:7: build-arch] Error 25

Tail of log for icu-ext on armhf:

-   0 |  
- 200 | you
-   0 |  
- 200 | like
-   0 |  
- 200 | O'Reilly
-   0 |  
- 200 | books
-   0 | ?
-(10 rows)
-
+ERROR:  encoding "SQL_ASCII" not supported by ICU
### End 13 installcheck (FAILED with exit code 1) ###
dh_pgxs_test: error: pg_buildext installcheck . . postgresql-%v-icu-ext returned exit code 1
make: *** [debian/rules:9: binary-arch] Error 25

Tail of log for ibam on armhf:

make[1]: Entering directory '/<<PKGBUILDDIR>>'
make[1]: 'ibam-krell.so' is up to date.
make[1]: Leaving directory '/<<PKGBUILDDIR>>'
touch build-stamp
dh_testdir
dh_testroot
dh_clean
dh_clean: warning: Compatibility levels before 10 are deprecated (level 7 in use)
dh_installdirs
dh_installdirs: warning: Compatibility levels before 10 are deprecated (level 7 in use)
# Add here commands to install the package into debian/tmp.
install -m0755 ibam `pwd`/debian/ibam/usr/bin
install -m0644 ibam-krell.so `pwd`/debian/gkrellm-ibam/usr/lib/gkrellm2/plugins
install: cannot create regular file '/<<PKGBUILDDIR>>/debian/gkrellm-ibam/usr/lib/gkrellm2/plugins': No such file or directory
make: *** [debian/rules:58: install] Error 1

Tail of log for libmath-int128-perl on armhf:

Checking for strings.h... yes
Checking for inttypes.h... yes
Checking for stdint.h... yes
Checking for unistd.h... yes
Checking for uint64_t... yes
Checking for __int128... no
Checking for uint64_t... (cached) yes
Checking for int __attribute__ ((__mode__ (TI)))... 
  It looks like your compiler doesn't support a 128-bit integer type (one of
  "int __attribute__ ((__mode__ (TI)))" or "__int128"). One of these types is
  necessary to compile the Math::Int128 module.

no
dh_auto_configure: error: perl Makefile.PL INSTALLDIRS=vendor "OPTIMIZE=-g -O2 -ffile-prefix-map=/<<PKGBUILDDIR>>=. -fstack-protector-strong -Wformat -Werror=format-security -Wdate-time -D_FORTIFY_SOURCE=2" "LD=arm-linux-gnueabihf-gcc -g -O2 -ffile-prefix-map=/<<PKGBUILDDIR>>=. -fstack-protector-strong -Wformat -Werror=format-security -Wl,-z,relro -Wl,-z,now" returned exit code 1
make: *** [debian/rules:6: build-arch] Error 25

Tail of log for hyperspy on armhf:

SKIPPED [1] hyperspy/tests/signal/test_transpose.py:119: LazySignal optimization is tested in test_lazy_tranpose_rechunk
SKIPPED [1] hyperspy/tests/signal/test_tools.py:207: LazySignals do not support masked arrays
SKIPPED [1] hyperspy/tests/signal/test_tools.py:241: LazySignals do not support masked arrays
SKIPPED [1] hyperspy/tests/signal/test_tools.py:261: LazySignals do not support masked arrays
XFAIL hyperspy/tests/drawing/test_utils.py::test_create_figure
  reason: agg backend does not support on_close event.
XFAIL hyperspy/tests/io/test_hdf5.py::TestLoadingNewSavedMetadata::test_binary_string
  dill is not guaranteed to load across Python versions
XPASS hyperspy/tests/samfire/test_samfire.py::test_multiprocessed Sometimes the number of failed pixels > 3 when using multiprocessing. Unknown reason
FAILED hyperspy/tests/misc/test_date_time_tools.py::test_serial_date_to_ISO_format
FAILED hyperspy/tests/misc/test_date_time_tools.py::test_ISO_format_to_serial_date
= 2 failed, 3721 passed, 75 skipped, 2 xfailed, 1 xpassed, 67 warnings in 522.49s (0:08:42) =
E: pybuild pybuild:353: test: plugin distutils failed with: exit code=1: cd /<<PKGBUILDDIR>>/.pybuild/cpython3_3.9_hyperspy/build; python3.9 -m pytest 
dh_auto_test: error: pybuild --test --test-pytest -i python{version} -p 3.9 returned exit code 13
make: *** [debian/rules:9: build-arch] Error 25

Tail of log for libmlx5 on armhf:

#define HAVE_STDLIB_H 1
#define HAVE_STRING_H 1
#define HAVE_MEMORY_H 1
#define HAVE_STRINGS_H 1
#define HAVE_INTTYPES_H 1
#define HAVE_STDINT_H 1
#define HAVE_UNISTD_H 1
#define HAVE_DLFCN_H 1
#define LT_OBJDIR ".libs/"
#define NVALGRIND 1
#define HAVE_LIBIBVERBS 1

configure: exit 1
dh_auto_configure: error: ./configure --build=arm-linux-gnueabihf --prefix=/usr --includedir=\${prefix}/include --mandir=\${prefix}/share/man --infodir=\${prefix}/share/info --sysconfdir=/etc --localstatedir=/var --disable-option-checking --disable-silent-rules --libdir=\${prefix}/lib/arm-linux-gnueabihf --libexecdir=\${prefix}/lib/arm-linux-gnueabihf --disable-maintainer-mode --disable-dependency-tracking returned exit code 1
make: *** [debian/rules:6: build-arch] Error 25

Tail of log for librandomx on armhf:

collect2: error: ld returned 1 exit status
make[3]: *** [CMakeFiles/randomx-benchmark.dir/build.make:122: randomx-benchmark] Error 1
make[3]: Leaving directory '/<<PKGBUILDDIR>>/obj-arm-linux-gnueabihf'
make[2]: *** [CMakeFiles/Makefile2:104: CMakeFiles/randomx-benchmark.dir/all] Error 2
make[2]: *** Waiting for unfinished jobs....
[100%] Linking CXX executable randomx-tests
/usr/bin/cmake -E cmake_link_script CMakeFiles/randomx-tests.dir/link.txt --verbose=1
/usr/bin/c++ -g -O2 -ffile-prefix-map=/<<PKGBUILDDIR>>=. -fstack-protector-strong -Wformat -Werror=format-security -Wdate-time -D_FORTIFY_SOURCE=2 -Wl,-z,relro -rdynamic CMakeFiles/randomx-tests.dir/src/tests/tests.cpp.o -o randomx-tests  -Wl,-rpath,/<<PKGBUILDDIR>>/obj-arm-linux-gnueabihf librandomx.so.0.0.0 
make[3]: Leaving directory '/<<PKGBUILDDIR>>/obj-arm-linux-gnueabihf'
[100%] Built target randomx-tests
make[2]: Leaving directory '/<<PKGBUILDDIR>>/obj-arm-linux-gnueabihf'
make[1]: *** [Makefile:152: all] Error 2
make[1]: Leaving directory '/<<PKGBUILDDIR>>/obj-arm-linux-gnueabihf'
dh_auto_build: error: cd obj-arm-linux-gnueabihf && make -j4 "INSTALL=install --strip-program=true" VERBOSE=1 returned exit code 2
make: *** [debian/rules:46: binary-arch] Error 25

Tail of log for libretro-mupen64plus on armhf:

                 from ./libretro-common/include/glsym/rglgen.h:30,
                 from ./libretro/opengl_state_machine.h:4,
                 from ./libretro/SDL_opengles2.h:29,
                 from gles2rice/src/osal_opengl.h:33,
                 from gles2rice/src/DeviceBuilder.cpp:21:
/usr/include/GLES2/gl2ext.h:3092:16: note: previous declaration as 'typedef double GLdouble'
 3092 | typedef double GLdouble;
      |                ^~~~~~~~
make[2]: *** [Makefile:408: gles2rice/src/DeviceBuilder.o] Error 1
make[2]: *** Waiting for unfinished jobs....
make[2]: Leaving directory '/<<BUILDDIR>>/libretro-mupen64plus-2.0+git20160207+dfsg2'
dh_auto_build: error: make -j4 "platform=armv gles neon hardfloat" returned exit code 2
make[1]: *** [debian/rules:19: override_dh_auto_build] Error 25
make[1]: Leaving directory '/<<BUILDDIR>>/libretro-mupen64plus-2.0+git20160207+dfsg2'
make: *** [debian/rules:16: build-arch] Error 2

Tail of log for leela-zero on armhf:

/usr/include/c++/10/bits/atomic_base.h:426: undefined reference to `__atomic_load_8'
/usr/bin/ld: /usr/include/c++/10/bits/atomic_base.h:426: undefined reference to `__atomic_load_8'
/usr/bin/ld: /usr/include/c++/10/bits/atomic_base.h:426: undefined reference to `__atomic_load_8'
/usr/bin/ld: /usr/include/c++/10/bits/atomic_base.h:426: undefined reference to `__atomic_load_8'
/usr/bin/ld: /usr/include/c++/10/bits/atomic_base.h:426: undefined reference to `__atomic_load_8'
/usr/bin/ld: CMakeFiles/objs.dir/src/UCTNodePointer.cpp.o:/usr/include/c++/10/bits/atomic_base.h:426: more undefined references to `__atomic_load_8' follow
collect2: error: ld returned 1 exit status
make[3]: *** [CMakeFiles/tests.dir/build.make:177: tests] Error 1
make[3]: Leaving directory '/<<PKGBUILDDIR>>/obj-arm-linux-gnueabihf'
make[2]: *** [CMakeFiles/Makefile2:208: CMakeFiles/tests.dir/all] Error 2
make[2]: Leaving directory '/<<PKGBUILDDIR>>/obj-arm-linux-gnueabihf'
make[1]: *** [Makefile:174: all] Error 2
make[1]: Leaving directory '/<<PKGBUILDDIR>>/obj-arm-linux-gnueabihf'
dh_auto_build: error: cd obj-arm-linux-gnueabihf && make -j4 "INSTALL=install --strip-program=true" VERBOSE=1 returned exit code 2
make: *** [debian/rules:15: build-arch] Error 25

Tail of log for libnunc-stans on armhf:

mkdir -p bin
mkdir -p obj
gcc -MM -std=c99 -I"src" -I"inc" src/abstraction/abstraction_dcas.c >obj/abstraction_dcas.d
gcc -g -O2 -ffile-prefix-map=/<<PKGBUILDDIR>>=. -fstack-protector-strong -Wformat -Werror=format-security  -c -fpic -Wno-unknown-pragmas -std=c99 -I"src" -I"inc"  -o obj/abstraction_dcas.o src/abstraction/abstraction_dcas.c
/tmp/cchutR75.s: Assembler messages:
/tmp/cchutR75.s:74: Error: selected processor does not support `ldrexd r6,r7,[r0]' in ARM mode
/tmp/cchutR75.s:74: Error: selected processor does not support `strexd lr,r2,r3,[r0]' in ARM mode
make[3]: *** [makefile.linux:79: obj/abstraction_dcas.o] Error 1
make[3]: Leaving directory '/<<PKGBUILDDIR>>/liblfds'
make[2]: *** [Makefile:921: all-recursive] Error 1
make[2]: Leaving directory '/<<PKGBUILDDIR>>'
make[1]: *** [Makefile:646: all] Error 2
make[1]: Leaving directory '/<<PKGBUILDDIR>>'
dh_auto_build: error: make -j1 returned exit code 2
make: *** [debian/rules:21: build-arch] Error 25

Tail of log for libxsmm on armhf:

      |   ^~~~~
In file included from include/libxsmm.h:65,
                 from ./src/libxsmm_gemm_diff.h:34,
                 from ./src/libxsmm_main.c:31:
./src/libxsmm_main.c: In function 'libxsmm_init':
include/libxsmm_sync.h:70:29: warning: implicit declaration of function '__builtin_ia32_pause'; did you mean '__builtin_isspace'? [-Wimplicit-function-declaration]
   70 | # define LIBXSMM_SYNC_PAUSE __builtin_ia32_pause()
      |                             ^~~~~~~~~~~~~~~~~~~~
./src/libxsmm_main.c:719:36: note: in expansion of macro 'LIBXSMM_SYNC_PAUSE'
  719 |       if (0 != once) break; else { LIBXSMM_SYNC_PAUSE; }
      |                                    ^~~~~~~~~~~~~~~~~~
make[1]: *** [Makefile:721: build/intel64/libxsmm_main.o] Error 1
make[1]: Leaving directory '/<<PKGBUILDDIR>>'
dh_auto_build: error: make -j1 returned exit code 2
make: *** [debian/rules:7: build-arch] Error 25

Tail of log for libtango on armhf:

dpkg-buildpackage: info: host architecture armhf
 fakeroot debian/rules clean
QUILT_PATCHES=debian/patches \
	quilt --quiltrc /dev/null pop -a -R || test $? = 2
No patch removed
rm -rf .pc debian/stamp-patched
dh_testdir
dh_testroot
rm -rf stamps objs
find build -type d -name "objs-*" | xargs rm -rf
rm -f build-stamp-*
dh_clean
dh_clean: warning: Compatibility levels before 10 are deprecated (level 7 in use)
 debian/rules build-arch
make: *** No rule to make target 'build-arch'.  Stop.

Tail of log for haskell-ormolu on armhf:

  tests/Ormolu/PrinterSpec.hs:25:25: 
  4) Ormolu.Printer module-header/leading-empty-line.hs works
       uncaught exception: IOException of type InvalidArgument
       data/examples/module-header/leading-empty-line.hs: hGetContents: invalid argument (invalid byte sequence)

  To rerun use: --match "/Ormolu.Printer/module-header/leading-empty-line.hs works/"

Randomized with seed 149604613

Finished in 7.0796 seconds
367 examples, 4 failures
Test suite tests: FAIL
Test suite logged to: dist-ghc/test/ormolu-0.1.2.0-tests.log
0 of 1 test suites (0 of 1 test cases) passed.
make: *** [/usr/share/cdbs/1/class/hlibrary.mk:154: check-ghc-stamp] Error 1

Tail of log for mariadb-connector-odbc on armhf:

/usr/bin/cc -g -O2 -ffile-prefix-map=/<<PKGBUILDDIR>>=. -fstack-protector-strong -Wformat -Werror=format-security -I/usr/include/mariadb -Wdate-time -D_FORTIFY_SOURCE=2 -DCHECK_FUNCTION_EXISTS=floor -Wl,-z,relro  -rdynamic CMakeFiles/cmTC_a5141.dir/CheckFunctionExists.c.o -o cmTC_a5141 
/usr/bin/ld: CMakeFiles/cmTC_a5141.dir/CheckFunctionExists.c.o: in function `main':
/usr/share/cmake-3.18/Modules/CheckFunctionExists.c:17: undefined reference to `floor'
collect2: error: ld returned 1 exit status
gmake[3]: *** [CMakeFiles/cmTC_a5141.dir/build.make:106: cmTC_a5141] Error 1
gmake[3]: Leaving directory '/<<PKGBUILDDIR>>/obj-arm-linux-gnueabihf/CMakeFiles/CMakeTmp'
gmake[2]: *** [Makefile:140: cmTC_a5141/fast] Error 2
gmake[2]: Leaving directory '/<<PKGBUILDDIR>>/obj-arm-linux-gnueabihf/CMakeFiles/CMakeTmp'



dh_auto_configure: error: cd obj-arm-linux-gnueabihf && cmake -DCMAKE_INSTALL_PREFIX=/usr -DCMAKE_BUILD_TYPE=None -DCMAKE_INSTALL_SYSCONFDIR=/etc -DCMAKE_INSTALL_LOCALSTATEDIR=/var -DCMAKE_EXPORT_NO_PACKAGE_REGISTRY=ON -DCMAKE_FIND_PACKAGE_NO_PACKAGE_REGISTRY=ON -DCMAKE_INSTALL_RUNSTATEDIR=/run "-GUnix Makefiles" -DCMAKE_VERBOSE_MAKEFILE=ON -DCMAKE_INSTALL_LIBDIR=lib/arm-linux-gnueabihf -DMARIADB_LINK_DYNAMIC=yes -DINSTALL_LIBDIR=lib/arm-linux-gnueabihf/odbc .. returned exit code 1
make[1]: *** [debian/rules:11: override_dh_auto_configure] Error 25
make[1]: Leaving directory '/<<PKGBUILDDIR>>'
make: *** [debian/rules:8: build-arch] Error 2

Tail of log for kleborate on armhf:

======================================================================
FAIL: test_salmonella (test.test_species.TestSpecies)
----------------------------------------------------------------------
Traceback (most recent call last):
  File "/<<PKGBUILDDIR>>/.pybuild/cpython3_3.9/build/test/test_species.py", line 113, in test_salmonella
    self.assertTrue('Salmonella' in species)
AssertionError: False is not true

----------------------------------------------------------------------
Ran 190 tests in 1140.498s

FAILED (failures=19)
E: pybuild pybuild:353: test: plugin distutils failed with: exit code=1: cd /<<PKGBUILDDIR>>/.pybuild/cpython3_3.9/build; python3.9 -m unittest discover -v 
dh_auto_test: error: pybuild --test -i python{version} -p 3.9 returned exit code 13
make: *** [debian/rules:6: binary-arch] Error 25

Tail of log for msrtool on armhf:

gcc -g -O2 -ffile-prefix-map=/<<PKGBUILDDIR>>=. -fstack-protector-strong -Wformat -Werror=format-security -Os -Wall -Werror   -c -o msrutils.o msrutils.c
gcc -g -O2 -ffile-prefix-map=/<<PKGBUILDDIR>>=. -fstack-protector-strong -Wformat -Werror=format-security -Os -Wall -Werror   -c -o sys.o sys.c
sys.c: In function 'cpuid':
sys.c:40:2: error: unknown register name '%edx' in 'asm'
   40 |  asm ("cpuid" : "=b" (outebx) : "a" (0) : "%ecx", "%edx");
      |  ^~~
sys.c:40:2: error: unknown register name '%ecx' in 'asm'
sys.c:54:2: error: unknown register name '%edx' in 'asm'
   54 |  asm ("cpuid" : "=a" (outeax) : "a" (1) : "%ebx", "%ecx", "%edx");
      |  ^~~
sys.c:54:2: error: unknown register name '%ecx' in 'asm'
sys.c:54:2: error: unknown register name '%ebx' in 'asm'
make[1]: *** [<builtin>: sys.o] Error 1
make[1]: Leaving directory '/<<PKGBUILDDIR>>'
make: *** [/usr/share/cdbs/1/class/makefile.mk:77: debian/stamp-makefile-build] Error 2

Tail of log for mojoshader on armhf:

[  6%] Built target lemon
make  -f CMakeFiles/mojoshader.dir/build.make CMakeFiles/mojoshader.dir/depend
make[3]: Entering directory '/<<BUILDDIR>>/mojoshader-0.0~hg1314+dfsg/obj-arm-linux-gnueabihf'
[  9%] Generating ../mojoshader_parser_hlsl.h
./lemon -q -T/<<BUILDDIR>>/mojoshader-0.0~hg1314+dfsg/misc/lempar.c /<<BUILDDIR>>/mojoshader-0.0~hg1314+dfsg/mojoshader_parser_hlsl.lemon
Segmentation fault
make[3]: *** [CMakeFiles/mojoshader.dir/build.make:86: ../mojoshader_parser_hlsl.h] Error 139
make[3]: *** Deleting file '../mojoshader_parser_hlsl.h'
make[3]: Leaving directory '/<<BUILDDIR>>/mojoshader-0.0~hg1314+dfsg/obj-arm-linux-gnueabihf'
make[2]: *** [CMakeFiles/Makefile2:139: CMakeFiles/mojoshader.dir/all] Error 2
make[2]: Leaving directory '/<<BUILDDIR>>/mojoshader-0.0~hg1314+dfsg/obj-arm-linux-gnueabihf'
make[1]: *** [Makefile:152: all] Error 2
make[1]: Leaving directory '/<<BUILDDIR>>/mojoshader-0.0~hg1314+dfsg/obj-arm-linux-gnueabihf'
dh_auto_build: error: cd obj-arm-linux-gnueabihf && make -j4 "INSTALL=install --strip-program=true" VERBOSE=1 returned exit code 2
make: *** [debian/rules:12: binary-arch] Error 25

Tail of log for micropython on armhf:

pass  unicode/unicode_subscr.py
skip  unix/extra_coverage.py
pass  unix/ffi_callback.py
pass  unix/ffi_float.py
pass  unix/ffi_float2.py
756 tests performed (20123 individual testcases)
754 tests passed
18 tests skipped: cmd_parsetree btree1 vfs_blockdev vfs_fat_fileio1 vfs_fat_fileio2 vfs_fat_more vfs_fat_oldproto vfs_fat_ramdisk vfs_fat_ramdisklarge vfs_lfs vfs_lfs_corrupt vfs_lfs_error vfs_lfs_file vfs_lfs_mount sys_settrace_features sys_settrace_generator sys_settrace_loop extra_coverage
2 tests failed: urandom_basic import_pkg7
make[2]: *** [Makefile:198: test] Error 1
make[2]: Leaving directory '/<<PKGBUILDDIR>>/ports/unix'
dh_auto_test: error: cd ports/unix && make -j4 test STRIP=true MICROPY_PY_BTREE=0 MICROPY_SSL_AXTLS=0 MICROPY_SSL_MBEDTLS=1 MICROPY_PY_JNI=1 "TESTS_ARGS=-e '(?:ussl_basic|mpy_native)'" returned exit code 2
make[1]: *** [debian/rules:65: override_dh_auto_test-arch] Error 25
make[1]: Leaving directory '/<<PKGBUILDDIR>>'
make: *** [debian/rules:37: binary-arch] Error 2

Tail of log for listaller on armhf:

  Command-line option `--thread` is deprecated and will be ignored

  Compilation failed: 7 error(s), 12 warning(s)



make[3]: *** [src/CMakeFiles/listaller-glib_precompile.dir/build.make:126: src/CMakeFiles/listaller-glib_precompile.dir/precompile.stamp] Error 1
make[3]: Leaving directory '/<<PKGBUILDDIR>>/obj-arm-linux-gnueabihf'
make[2]: *** [CMakeFiles/Makefile2:711: src/CMakeFiles/listaller-glib_precompile.dir/all] Error 2
make[2]: Leaving directory '/<<PKGBUILDDIR>>/obj-arm-linux-gnueabihf'
make[1]: *** [Makefile:163: all] Error 2
make[1]: Leaving directory '/<<PKGBUILDDIR>>/obj-arm-linux-gnueabihf'
dh_auto_build: error: cd obj-arm-linux-gnueabihf && make -j1 VERBOSE=1 returned exit code 2
make: *** [debian/rules:15: build-arch] Error 25

Tail of log for mrs on armhf:

   debian/rules override_dh_auto_configure
make[1]: Entering directory '/<<PKGBUILDDIR>>'
./configure --prefix=/usr --config-dir=/etc/mrs/ \
	--man-dir=/usr/share/man --mrs-user=mrs-dba \
	--data-dir=/var/lib/mrs --log-dir=/var/log/mrs
length() used on @boost_version (did you mean "scalar(@boost_version)"?) at ./configure line 289.
Using perl /usr/bin/perl
Checking for a compiler... OK
Checking for libboost... OK
Checking for libzeep...libzeep is not installed, either install the package libzeep-dev
or download libzeep from ftp://ftp.cmbi.ru.nl/pub/software/libzeep
and run configure again.
make[1]: *** [debian/rules:15: override_dh_auto_configure] Error 2
make[1]: Leaving directory '/<<PKGBUILDDIR>>'
make: *** [debian/rules:12: binary-arch] Error 2

Tail of log for nsd3 on armhf:

#define FACILITY LOG_DAEMON
#define MAX_INTERFACES 8
#define TCP_TIMEOUT 120
#define ROOT_SERVER /**/
#define INET6 /**/
#define BIND8_STATS /**/
#define NDEBUG /**/
#define RATELIMIT /**/
#define HAVE_SSL /**/

configure: exit 1
dh_auto_configure: error: ./configure --build=arm-linux-gnueabihf --prefix=/usr --includedir=\${prefix}/include --mandir=\${prefix}/share/man --infodir=\${prefix}/share/info --sysconfdir=/etc --localstatedir=/var --disable-option-checking --disable-silent-rules --libexecdir=\${prefix}/lib/nsd3 --disable-maintainer-mode --disable-dependency-tracking --with-configdir=/etc/nsd3 --with-nsd_conf_file=/etc/nsd3/nsd.conf --with-pidfile=/var/run/nsd3/nsd.pid --with-dbfile=/var/lib/nsd3/nsd.db --with-zonesdir=/etc/nsd3 --with-difffile=/var/lib/nsd3/ixfr.db --with-xfrdfile=/var/lib/nsd3/xfrd.state --disable-largefile --enable-root-server --enable-mmap --enable-ratelimit returned exit code 1
make[1]: *** [debian/rules:32: override_dh_auto_configure] Error 25
make[1]: Leaving directory '/<<PKGBUILDDIR>>'
make: *** [debian/rules:26: build-arch] Error 2

Tail of log for mes on armhf:

+ trace 'CCLD       lib/linux/arm-mes-gcc/exit-42.S' /usr/bin/gcc -nostdlib -g lib/linux/arm-mes-gcc/exit-42.S -o exit-42
+ shift
+ echo /usr/bin/gcc -nostdlib -g lib/linux/arm-mes-gcc/exit-42.S -o exit-42
+ eval /usr/bin/gcc -nostdlib -g lib/linux/arm-mes-gcc/exit-42.S -o exit-42
++ /usr/bin/gcc -nostdlib -g lib/linux/arm-mes-gcc/exit-42.S -o exit-42
gcc: error: lib/linux/arm-mes-gcc/exit-42.S: No such file or directory
gcc: fatal error: no input files
compilation terminated.
make[2]: *** [GNUmakefile:95: build] Error 1
make[2]: *** Waiting for unfinished jobs....
make[2]: Leaving directory '/<<PKGBUILDDIR>>'
dh_auto_build: error: make -j4 V=2 returned exit code 2
make[1]: *** [debian/rules:23: override_dh_auto_build] Error 25
make[1]: Leaving directory '/<<PKGBUILDDIR>>'
make: *** [debian/rules:17: binary-arch] Error 2

Tail of log for odc on armhf:

/<<PKGBUILDDIR>>/src/odc/codec/Integer.h:84:41: error: static assertion failed: unsafe casting check
/<<PKGBUILDDIR>>/src/odc/codec/Integer.h: In instantiation of ‘void odc::codec::CodecIntegerOffset<ByteOrder, ValueType, InternalValueType, DerivedCodec>::decode(double*) [with ByteOrder = odc::core::OtherByteOrder; ValueType = long long int; InternalValueType = short unsigned int; DerivedCodec = odc::codec::CodecInt16<odc::core::OtherByteOrder, long long int>]’:
/<<PKGBUILDDIR>>/src/odc/codec/Integer.h:83:10:   required from here
/<<PKGBUILDDIR>>/src/odc/codec/Integer.h:84:41: error: static assertion failed: unsafe casting check
/<<PKGBUILDDIR>>/src/odc/codec/Integer.h: In instantiation of ‘void odc::codec::CodecIntegerOffset<ByteOrder, ValueType, InternalValueType, DerivedCodec>::decode(double*) [with ByteOrder = odc::core::SameByteOrder; ValueType = long long int; InternalValueType = short unsigned int; DerivedCodec = odc::codec::CodecInt16<odc::core::SameByteOrder, long long int>]’:
/<<PKGBUILDDIR>>/src/odc/codec/Integer.h:83:10:   required from here
/<<PKGBUILDDIR>>/src/odc/codec/Integer.h:84:41: error: static assertion failed: unsafe casting check
make[3]: *** [src/odc/CMakeFiles/odccore.dir/build.make:631: src/odc/CMakeFiles/odccore.dir/codec/String.cc.o] Error 1
make[3]: Leaving directory '/<<PKGBUILDDIR>>/obj-arm-linux-gnueabihf'
make[2]: *** [CMakeFiles/Makefile2:1319: src/odc/CMakeFiles/odccore.dir/all] Error 2
make[2]: Leaving directory '/<<PKGBUILDDIR>>/obj-arm-linux-gnueabihf'
make[1]: *** [Makefile:185: all] Error 2
make[1]: Leaving directory '/<<PKGBUILDDIR>>/obj-arm-linux-gnueabihf'
dh_auto_build: error: cd obj-arm-linux-gnueabihf && make -j4 "INSTALL=install --strip-program=true" returned exit code 2
make: *** [debian/rules:19: build-arch] Error 25

Tail of log for open-axiom on armhf:

/* confdefs.h */
#define PACKAGE_NAME "OpenAxiom"
#define PACKAGE_TARNAME "openaxiom"
#define PACKAGE_VERSION "1.5.0-2013-06-21"
#define PACKAGE_STRING "OpenAxiom 1.5.0-2013-06-21"
#define PACKAGE_BUGREPORT "open-axiom-bugs@lists.sf.net"
#define PACKAGE_URL ""
#define PACKAGE "openaxiom"
#define VERSION "1.5.0-2013-06-21"
#define OPENAXIOM_BASE_RTS Runtime::sbcl

configure: exit 1
dh_auto_configure: error: cd build-tree && ../configure --build=arm-linux-gnueabihf --prefix=/usr --includedir=\${prefix}/include --mandir=\${prefix}/share/man --infodir=\${prefix}/share/info --sysconfdir=/etc --localstatedir=/var --disable-option-checking --disable-silent-rules --libexecdir=\${prefix}/lib/open-axiom --disable-maintainer-mode --disable-dependency-tracking --with-lisp=sbcl --with-x --disable-gcl returned exit code 1
make: *** [debian/rules:50: configure-stamp] Error 25

Tail of log for olive on armhf:

project/clip.cpp:261:2: note: here
  261 |  case MEDIA_TYPE_SEQUENCE:
      |  ^~~~
project/clip.cpp: In member function 'int Clip::getHeight()':
project/clip.cpp:277:54: warning: this statement may fall through [-Wimplicit-fallthrough=]
  277 |         if (sequence != NULL) return sequence->height;
      |                                                      ^
project/clip.cpp:279:2: note: here
  279 |  case MEDIA_TYPE_SEQUENCE:
      |  ^~~~
make[1]: *** [Makefile:1369: clip.o] Error 1
make[1]: *** [Makefile:1392: playback.o] Error 1
make[1]: Leaving directory '/<<PKGBUILDDIR>>'
dh_auto_build: error: make -j4 returned exit code 2
make: *** [debian/rules:17: build-arch] Error 25

Tail of log for neuron on armhf:

make[6]: *** [Makefile:803: nrnran123.lo] Error 1
make[6]: *** Waiting for unfinished jobs....
make[6]: Leaving directory '/<<PKGBUILDDIR>>/src/oc'
make[5]: *** [Makefile:562: all] Error 2
make[5]: Leaving directory '/<<PKGBUILDDIR>>/src/oc'
make[4]: *** [Makefile:519: all-recursive] Error 1
make[4]: Leaving directory '/<<PKGBUILDDIR>>/src'
make[3]: *** [Makefile:658: all-recursive] Error 1
make[3]: Leaving directory '/<<PKGBUILDDIR>>'
make[2]: *** [Makefile:516: all] Error 2
make[2]: Leaving directory '/<<PKGBUILDDIR>>'
dh_auto_build: error: make -j4 returned exit code 2
make[1]: *** [debian/rules:32: override_dh_auto_build] Error 25
make[1]: Leaving directory '/<<PKGBUILDDIR>>'
make: *** [debian/rules:15: build-arch] Error 2

Tail of log for octave-tisean on armhf:

***** ###############################################################
***** fail("lazy([(1:10);(1:10)],7,-0.06)");
***** fail("lazy((1:10),0,0.04)");
***** fail("[a,b,c] = lazy((1:10),1,0.05)");
***** test
 "In is generated from Octave using 'in = 1 + 0.5 * rand(10,1);'";
 in = [1.47007925526322;1.168775342017635;1.10943000146922; 1.174293926353764;  1.075741574572656; 1.373465364407417; 1.089417388489702; 1.403669883669071;1.452726826806777;  1.016960990335037];
 "res was generated using 'lazy -m1 -v0.06 in.dat' from TISEAN 'lazy'";
 res = [1.47007930, 0.00000000; 1.17153454, -2.75921822E-03; 1.10942996, 0.00000000; 1.17153454, 2.75933743E-03; 1.07574153, 0.00000000; 1.37346542, 0.00000000; 1.08941734, 0.00000000; 1.40366983, 0.00000000; 1.45272684, 0.00000000; 1.01696098, 0.00000000];
 [al,bl] = lazy(in, 1, -0.06);
 assert([al,bl],res,1e-6);
4 tests, 4 passed, 0 known failure, 0 skipped
Summary: 162 tests, 152 passed, 0 known failures, 0 skipped
Some tests failed.  Giving up...
make: *** [debian/rules:5: binary-arch] Error 1

Tail of log for openmm on armhf:

In file included from /<<PKGBUILDDIR>>/libraries/vecmath/src/vecmath.cpp:2:
/<<PKGBUILDDIR>>/libraries/vecmath/include/neon_mathfun.h:53:25: note: called from here
   53 |   v4sf one = vdupq_n_f32(1);
      |              ~~~~~~~~~~~^~~
make[4]: *** [CMakeFiles/OpenMM.dir/build.make:2542: CMakeFiles/OpenMM.dir/libraries/vecmath/src/vecmath.cpp.o] Error 1
make[4]: *** Waiting for unfinished jobs....
make[4]: Leaving directory '/<<PKGBUILDDIR>>/obj-arm-linux-gnueabihf'
make[3]: *** [CMakeFiles/Makefile2:1412: CMakeFiles/OpenMM.dir/all] Error 2
make[3]: Leaving directory '/<<PKGBUILDDIR>>/obj-arm-linux-gnueabihf'
make[2]: *** [Makefile:163: all] Error 2
make[2]: Leaving directory '/<<PKGBUILDDIR>>/obj-arm-linux-gnueabihf'
dh_auto_build: error: cd obj-arm-linux-gnueabihf && make -j4 "INSTALL=install --strip-program=true" VERBOSE=1 returned exit code 2
make[1]: *** [debian/rules:31: override_dh_auto_build] Error 25
make[1]: Leaving directory '/<<PKGBUILDDIR>>'
make: *** [debian/rules:25: binary-arch] Error 2

Tail of log for pbseqlib on armhf:

                 from ../alignment/algorithms/anchoring/BWTSearch.hpp:6,
                 from ../alignment/algorithms/anchoring/BWTSearch.cpp:1:
../alignment/suffixarray/SuffixArray.hpp: In member function ‘void SuffixArray<T, Sigma, Compare, Tuple>::LarssonBuildSuffixArray(T*, SAIndexLength, Sigma&)’:
../alignment/suffixarray/SuffixArray.hpp:288:44: error: narrowing conversion of ‘4294967295’ from ‘unsigned int’ to ‘long int’ [-Wnarrowing]
  288 |         LarssonSuffixSort<SAIndex, UINT_MAX> sorter;
      |                                            ^
../alignment/suffixarray/SuffixArray.hpp:289:84: error: ‘sorter’ cannot be used as a function
  289 |         sorter(index, p, ((SAIndex)targetLength), ((SAIndex)maxVal + 1), (SAIndex)1);
      |                                                                                    ^
[44/187] c++ -Ilibblasr.so.5.3.4.p -I. -I.. -I/usr/include -I/usr/include/hdf5/serial -fdiagnostics-color=always -pipe -D_FILE_OFFSET_BITS=64 -Wall -Winvalid-pch -Wnon-virtual-dtor -Wextra -Wpedantic -std=c++14 -g -O2 -ffile-prefix-map=/<<BUILDDIR>>/pbseqlib-5.3.4+dfsg=. -fstack-protector-strong -Wformat -Werror=format-security -O3 -std=c++14 -Wdate-time -D_FORTIFY_SOURCE=2 -DHAVE_HDF5_1_10_1 -O3 -fPIC -DBOOST_ALL_NO_LIB -Wno-delete-non-virtual-dtor -Wno-unused-variable -Wno-non-virtual-dtor -MD -MQ libblasr.so.5.3.4.p/alignment_algorithms_anchoring_FindMaxInterval.cpp.o -MF libblasr.so.5.3.4.p/alignment_algorithms_anchoring_FindMaxInterval.cpp.o.d -o libblasr.so.5.3.4.p/alignment_algorithms_anchoring_FindMaxInterval.cpp.o -c ../alignment/algorithms/anchoring/FindMaxInterval.cpp
[45/187] c++ -Ilibblasr.so.5.3.4.p -I. -I.. -I/usr/include -I/usr/include/hdf5/serial -fdiagnostics-color=always -pipe -D_FILE_OFFSET_BITS=64 -Wall -Winvalid-pch -Wnon-virtual-dtor -Wextra -Wpedantic -std=c++14 -g -O2 -ffile-prefix-map=/<<BUILDDIR>>/pbseqlib-5.3.4+dfsg=. -fstack-protector-strong -Wformat -Werror=format-security -O3 -std=c++14 -Wdate-time -D_FORTIFY_SOURCE=2 -DHAVE_HDF5_1_10_1 -O3 -fPIC -DBOOST_ALL_NO_LIB -Wno-delete-non-virtual-dtor -Wno-unused-variable -Wno-non-virtual-dtor -MD -MQ libblasr.so.5.3.4.p/alignment_algorithms_sorting_MultikeyQuicksort.cpp.o -MF libblasr.so.5.3.4.p/alignment_algorithms_sorting_MultikeyQuicksort.cpp.o.d -o libblasr.so.5.3.4.p/alignment_algorithms_sorting_MultikeyQuicksort.cpp.o -c ../alignment/algorithms/sorting/MultikeyQuicksort.cpp
[46/187] c++ -Ilibblasr.so.5.3.4.p -I. -I.. -I/usr/include -I/usr/include/hdf5/serial -fdiagnostics-color=always -pipe -D_FILE_OFFSET_BITS=64 -Wall -Winvalid-pch -Wnon-virtual-dtor -Wextra -Wpedantic -std=c++14 -g -O2 -ffile-prefix-map=/<<BUILDDIR>>/pbseqlib-5.3.4+dfsg=. -fstack-protector-strong -Wformat -Werror=format-security -O3 -std=c++14 -Wdate-time -D_FORTIFY_SOURCE=2 -DHAVE_HDF5_1_10_1 -O3 -fPIC -DBOOST_ALL_NO_LIB -Wno-delete-non-virtual-dtor -Wno-unused-variable -Wno-non-virtual-dtor -MD -MQ libblasr.so.5.3.4.p/alignment_algorithms_sorting_LightweightSuffixArray.cpp.o -MF libblasr.so.5.3.4.p/alignment_algorithms_sorting_LightweightSuffixArray.cpp.o.d -o libblasr.so.5.3.4.p/alignment_algorithms_sorting_LightweightSuffixArray.cpp.o -c ../alignment/algorithms/sorting/LightweightSuffixArray.cpp
ninja: build stopped: subcommand failed.
dh_auto_build: error: cd obj-arm-linux-gnueabihf && LC_ALL=C.UTF-8 ninja -j4 -v returned exit code 1
make: *** [debian/rules:25: binary-arch] Error 25

Tail of log for perftest on armhf:

                 from src/perftest_communication.h:45,
                 from src/perftest_communication.c:17:
src/get_clock.h:109:2: warning: #warning get_cycles not implemented for this architecture: attempt asm/timex.h [-Wcpp]
  109 | #warning get_cycles not implemented for this architecture: attempt asm/timex.h
      |  ^~~~~~~
src/get_clock.h:110:10: fatal error: asm/timex.h: No such file or directory
  110 | #include <asm/timex.h>
      |          ^~~~~~~~~~~~~
compilation terminated.
make[2]: *** [Makefile:859: src/perftest_communication.o] Error 1
make[2]: Leaving directory '/<<BUILDDIR>>/perftest-4.4+0.37'
make[1]: *** [Makefile:583: all] Error 2
make[1]: Leaving directory '/<<BUILDDIR>>/perftest-4.4+0.37'
dh_auto_build: error: make -j4 returned exit code 2
make: *** [debian/rules:7: binary-arch] Error 25

Tail of log for percona-xtradb-cluster-galera-2.x on armhf:

   debian/rules override_dh_auto_build
make[1]: Entering directory '/<<PKGBUILDDIR>>'
scons revno=318911d boost_pool=0 garb/garbd libgalera_smm.so 
scons: Reading SConscript files ...
  File "/<<PKGBUILDDIR>>/SConstruct", line 23

    print 'Host: ' + sysname + ' ' + machine

          ^

SyntaxError: Missing parentheses in call to 'print'. Did you mean print('Host: ' + sysname + ' ' + machine)?

make[1]: *** [debian/rules:15: override_dh_auto_build] Error 2
make[1]: Leaving directory '/<<PKGBUILDDIR>>'
make: *** [debian/rules:18: build-arch] Error 2

Tail of log for pinfish on armhf:

github.com/biogo/hts/bgzf
runtime/pprof
github.com/biogo/hts/bgzf/index
github.com/biogo/hts/internal
github.com/biogo/hts/sam
github.com/biogo/hts/bam
github.com/nanoporetech/pinfish/spliced_bam2gff
github.com/nanoporetech/pinfish/polish_clusters
# github.com/nanoporetech/pinfish/polish_clusters
src/github.com/nanoporetech/pinfish/polish_clusters/polish.go:161:6: constant 9223372036854775807 overflows int
github.com/google/uuid
github.com/nanoporetech/pinfish/cluster_gff
github.com/nanoporetech/pinfish/collapse_partials
dh_auto_build: error: cd _build && go install -trimpath -v -p 4 github.com/nanoporetech/pinfish/cluster_gff github.com/nanoporetech/pinfish/collapse_partials github.com/nanoporetech/pinfish/polish_clusters github.com/nanoporetech/pinfish/spliced_bam2gff returned exit code 2
make: *** [debian/rules:4: binary-arch] Error 25

Tail of log for plink2 on armhf:

g++ -Wdate-time -D_FORTIFY_SOURCE=2 -g -O2 -ffile-prefix-map=/<<BUILDDIR>>/plink2-2.00~a3-210203+dfsg=. -fstack-protector-strong -Wformat -Werror=format-security -DSIMDE_ENABLE_OPENMP -fopenmp-simd -O3 -I/usr/include/simde -std=c++11 -O2 -DZSTD_MULTITHREAD   -Wall -Wextra -Wshadow -Wformat-security -Wold-style-cast -I../simde ../include/plink2_base.cc ../include/plink2_bits.cc ../include/pgenlib_misc.cc ../include/pgenlib_read.cc ../include/pgenlib_write.cc ../include/plink2_bgzf.cc ../include/plink2_stats.cc ../include/plink2_string.cc ../include/plink2_text.cc ../include/plink2_thread.cc ../include/plink2_zstfile.cc ../plink2.cc ../plink2_adjust.cc ../plink2_cmdline.cc ../plink2_common.cc ../plink2_compress_stream.cc ../plink2_data.cc ../plink2_decompress.cc ../plink2_export.cc ../plink2_fasta.cc ../plink2_filter.cc ../plink2_glm.cc ../plink2_help.cc ../plink2_import.cc ../plink2_ld.cc ../plink2_matrix.cc ../plink2_matrix_calc.cc ../plink2_merge.cc ../plink2_misc.cc ../plink2_psam.cc ../plink2_pvar.cc ../plink2_random.cc ../plink2_set.cc -c
../plink2_psam.cc: In function 'plink2::PglErr plink2::LoadPhenos(const char*, const RangeList*, const uintptr_t*, const SampleIdInfo*, uint32_t, uint32_t, int32_t, uint32_t, uint32_t, uint32_t, uint32_t, plink2::PhenoCol**, char**, uint32_t*, uintptr_t*)':
../plink2_psam.cc:1254:105: warning: '*' in boolean context, suggest '&&' instead [-Wint-in-bool-context]
 1254 |       if (unlikely(S_CAST(uintptr_t, tmp_bigstack_end - bigstack_base_copy) < pheno_info_alloc_byte_ct) * (xid_idx_end - xid_idx_start)) {
g++  -Wdate-time -D_FORTIFY_SOURCE=2 ../plink2_cpu.cc -c
g++ SFMT.o plink2_base.o plink2_bits.o pgenlib_misc.o pgenlib_read.o pgenlib_write.o plink2_bgzf.o plink2_stats.o plink2_string.o plink2_text.o plink2_thread.o plink2_zstfile.o plink2.o plink2_adjust.o plink2_cmdline.o plink2_common.o plink2_compress_stream.o plink2_data.o plink2_decompress.o plink2_export.o plink2_fasta.o plink2_filter.o plink2_glm.o plink2_help.o plink2_import.o plink2_ld.o plink2_matrix.o plink2_matrix_calc.o plink2_merge.o plink2_misc.o plink2_psam.o plink2_pvar.o plink2_random.o plink2_set.o plink2_cpu.o  -o plink2"" -llapack -lblas -lcblas -latlas -lm -lpthread  -lz -lzstd -Wl,-z,relro -Wl,-z,now -ldeflate
/usr/bin/ld: plink2_thread.o: in function `plink2::UpdateU64IfSmaller(unsigned long long, unsigned long long*)':
./build_dynamic/../include/plink2_thread.cc:373: undefined reference to `__atomic_compare_exchange_8'
collect2: error: ld returned 1 exit status
make[2]: *** [Makefile:157: plink2""] Error 1
make[2]: Leaving directory '/<<BUILDDIR>>/plink2-2.00~a3-210203+dfsg/build_dynamic'
dh_auto_build: error: cd build_dynamic && make -j4 "INSTALL=install --strip-program=true" returned exit code 2
make[1]: *** [debian/rules:74: override_dh_auto_build-arch] Error 25
make[1]: Leaving directory '/<<BUILDDIR>>/plink2-2.00~a3-210203+dfsg'
make: *** [debian/rules:23: binary-arch] Error 2

Tail of log for postgresql-numeral on armhf:

 
@@ -245,8 +245,8 @@
 (1 row)
 
 SELECT 'zweihundertzweiunddreißig'::zahl;
-           zahl            
----------------------------
+            zahl            
+----------------------------
  zweihundertzweiunddreißig
 (1 row)
 
### End 13 installcheck (FAILED with exit code 1) ###
dh_pgxs_test: error: pg_buildext installcheck . build-%v postgresql-%v-numeral returned exit code 1
make: *** [debian/rules:7: binary-arch] Error 25

Tail of log for nix on armhf:

      |    ~~~~~~~~~~~~~~~~~^~~~~~~~~~~~~~~~~~~~~~~~~~~~~~~~~~~~~~~
/usr/include/c++/10/bits/vector.tcc:121:21: note: parameter passing for argument of type '__gnu_cxx::__normal_iterator<nlohmann::basic_json<>*, std::vector<nlohmann::basic_json<>, std::allocator<nlohmann::basic_json<> > > >' changed in GCC 7.1
  121 |    _M_realloc_insert(end(), std::forward<_Args>(__args)...);
      |    ~~~~~~~~~~~~~~~~~^~~~~~~~~~~~~~~~~~~~~~~~~~~~~~~~~~~~~~~
g++ -std=c++17 -o src/libexpr/value-to-xml.o -c src/libexpr/value-to-xml.cc -fstack-protector-strong -Wformat -Werror=format-security -g -Wall -include config.h -Wdate-time -D_FORTIFY_SOURCE=2 -fPIC -g -I . -I src -I src/libutil -I src/libstore -I src/libmain -I src/libexpr -I src/nix  -DREADLINE -I/usr/include/arm-linux-gnueabihf -I/usr/include -g -O2 -ffile-prefix-map=/<<BUILDDIR>>/nix-2.3.7+dfsg1=. -fstack-protector-strong -Wformat -Werror=format-security  -MMD -MF src/libexpr/.value-to-xml.o.dep -MP
g++ -std=c++17 -o /<<BUILDDIR>>/nix-2.3.7+dfsg1/src/libutil/libnixutil.so -shared -L/usr/lib/arm-linux-gnueabihf -Wl,-z,relro -Wl,-z,now -L/usr/lib/arm-linux-gnueabihf -Wl,-z,relro -Wl,-z,now -Wl,--no-copy-dt-needed-entries src/libutil/affinity.o src/libutil/archive.o src/libutil/args.o src/libutil/compression.o src/libutil/config.o src/libutil/hash.o src/libutil/json.o src/libutil/logging.o src/libutil/serialise.o src/libutil/thread-pool.o src/libutil/util.o src/libutil/xml-writer.o -llzma -lbz2 -pthread -lcrypto -lbrotlienc -lbrotlidec -L/usr/lib/arm-linux-gnueabihf -lboost_context -Wl,-z,defs -Wl,-soname=libnixutil.so   
g++ -std=c++17 -o src/libstore/local-store.o -c src/libstore/local-store.cc -fstack-protector-strong -Wformat -Werror=format-security -g -Wall -include config.h -Wdate-time -D_FORTIFY_SOURCE=2 -fPIC -g -I . -I src -I src/libutil -I src/libstore -I src/libmain -I src/libexpr -I src/nix  -DREADLINE -I/usr/include/arm-linux-gnueabihf -I/usr/include -g -O2 -ffile-prefix-map=/<<BUILDDIR>>/nix-2.3.7+dfsg1=. -fstack-protector-strong -Wformat -Werror=format-security -DNIX_PREFIX=\"/usr\" -DNIX_STORE_DIR=\"/nix/store\" -DNIX_DATA_DIR=\"/usr/share\" -DNIX_STATE_DIR=\"/nix/var/nix\" -DNIX_LOG_DIR=\"/nix/var/log/nix\" -DNIX_CONF_DIR=\"/etc/nix\" -DNIX_LIBEXEC_DIR=\"/usr/libexec\" -DNIX_BIN_DIR=\"/usr/bin\" -DNIX_MAN_DIR=\"/usr/share/man\" -DLSOF=\"lsof\" -MMD -MF src/libstore/.local-store.o.dep -MP
/usr/bin/ld: src/libutil/logging.o: in function `std::__atomic_base<unsigned long long>::fetch_add(unsigned long long, std::memory_order)':
/usr/include/c++/10/bits/atomic_base.h:548: undefined reference to `__atomic_fetch_add_8'
collect2: error: ld returned 1 exit status
make[1]: *** [mk/lib.mk:104: src/libutil/libnixutil.so] Error 1
make[1]: *** Waiting for unfinished jobs....
make[1]: Leaving directory '/<<BUILDDIR>>/nix-2.3.7+dfsg1'
dh_auto_build: error: make -j4 returned exit code 2
make: *** [debian/rules:31: build-arch] Error 25

Tail of log for patat on armhf:

patat:   -Mgrace=<n>
patat:             The amount of allocation after the program receives a
patat:             HeapOverflow exception before the exception is thrown again, if
patat:             the program is still exceeding the heap limit.
patat: 
patat: RTS options may also be specified using the GHCRTS environment variable.
patat: 
patat: Other RTS options may be available for programs compiled a different way.
patat: The GHC User's Guide has full details.
patat: 
make[2]: *** [Makefile:80: extra/patat.bash-completion] Error 1
make[2]: Leaving directory '/<<PKGBUILDDIR>>'
make[1]: *** [debian/rules:23: override_dh_auto_build] Error 2
make[1]: Leaving directory '/<<PKGBUILDDIR>>'
make: *** [debian/rules:12: build-arch] Error 2

Tail of log for prometheus-libvirt-exporter on armhf:

text/template
go/doc
gopkg.in/alecthomas/kingpin.v2
expvar
github.com/prometheus/common/expfmt
github.com/prometheus/client_golang/prometheus
github.com/prometheus/client_golang/prometheus/promhttp
# github.com/libvirt/libvirt-go
src/github.com/libvirt/libvirt-go/connect.go:181:77: constant 2147483648 overflows ConnectGetAllDomainStatsFlags
src/github.com/libvirt/libvirt-go/domain_events.go:332:18: type [1073741824]_Ctype_struct__virDomainEventGraphicsSubjectIdentity larger than address space
src/github.com/libvirt/libvirt-go/domain_events.go:332:18: type [1073741824]_Ctype_struct__virDomainEventGraphicsSubjectIdentity too large
dh_auto_build: error: cd build && go install -trimpath -v -p 4 github.com/kumina/libvirt_exporter github.com/kumina/libvirt_exporter/libvirt_schema returned exit code 2
make[1]: *** [debian/rules:19: override_dh_auto_build] Error 25
make[1]: Leaving directory '/<<PKGBUILDDIR>>'
make: *** [debian/rules:12: binary-arch] Error 2

Tail of log for prboom on armhf:

      |                                png_error_ptr
i_sshot.c:234:32: note: each undeclared identifier is reported only once for each function it appears in
i_sshot.c:282:43: error: 'png_infopp_NULL' undeclared (first use in this function); did you mean 'png_infopp'?
  282 |       png_destroy_write_struct(&png_ptr,  png_infopp_NULL);
      |                                           ^~~~~~~~~~~~~~~
      |                                           png_infopp
make[4]: *** [Makefile:242: i_sshot.o] Error 1
make[4]: Leaving directory '/<<BUILDDIR>>/prboom-2.5.0+dfsg1/src/SDL'
make[3]: *** [Makefile:460: all-recursive] Error 1
make[3]: Leaving directory '/<<BUILDDIR>>/prboom-2.5.0+dfsg1/src'
make[2]: *** [Makefile:285: all-recursive] Error 1
make[2]: Leaving directory '/<<BUILDDIR>>/prboom-2.5.0+dfsg1'
make[1]: *** [Makefile:205: all] Error 2
make[1]: Leaving directory '/<<BUILDDIR>>/prboom-2.5.0+dfsg1'
make: *** [debian/rules:28: build-stamp] Error 2

Tail of log for projectm on armhf:

/usr/include/arm-linux-gnueabihf/qt5/QtCore/qflags.h:123:80: note: declared here
  123 |     QT_DEPRECATED_X("Use default constructor instead") Q_DECL_CONSTEXPR inline QFlags(Zero) noexcept : i(0) {}
      |                                                                                ^~~~~~
make[5]: *** [Makefile:533: qprojectm_mainwindow.o] Error 1
make[5]: Leaving directory '/<<PKGBUILDDIR>>/src/projectM-qt'
make[4]: *** [Makefile:454: all] Error 2
make[4]: Leaving directory '/<<PKGBUILDDIR>>/src/projectM-qt'
make[3]: *** [Makefile:458: all-recursive] Error 1
make[3]: Leaving directory '/<<PKGBUILDDIR>>/src'
make[2]: *** [Makefile:528: all-recursive] Error 1
make[2]: Leaving directory '/<<PKGBUILDDIR>>'
make[1]: *** [Makefile:418: all] Error 2
make[1]: Leaving directory '/<<PKGBUILDDIR>>'
dh_auto_build: error: make -j4 returned exit code 2
make: *** [debian/rules:9: binary-arch] Error 25

Tail of log for python-peachpy on armhf:

----------------------------------------------------------------------
Traceback (most recent call last):
  File "/<<PKGBUILDDIR>>/.pybuild/cpython3_3.9_peachpy/build/test/x86_64/test_load.py", line 28, in runTest
    py_multiply = asm_multiply.finalize(abi.detect()).encode().load()
  File "/<<PKGBUILDDIR>>/.pybuild/cpython3_3.9_peachpy/build/peachpy/x86_64/function.py", line 308, in finalize
    raise TypeError("%s is not an ABI object" % str(abi))
TypeError: None is not an ABI object

----------------------------------------------------------------------
Ran 1309 tests in 13.742s

FAILED (errors=1)
E: pybuild pybuild:353: test: plugin distutils failed with: exit code=1: cd '/<<PKGBUILDDIR>>/.pybuild/cpython3_3.9_peachpy/build'; python3.9 -m unittest discover -v 
dh_auto_test: error: pybuild --test -i python{version} -p 3.9 returned exit code 13
make: *** [debian/rules:8: binary-arch] Error 25

Tail of log for rpm2html on armhf:

  758 |              headerNextIterator(sIter, &tag, &type, (void *) &p, &count);) {
      |              ^~~~~~~~~~~~~~~~~~
      |              headerInitIterator
rpmopen.c: In function 'rpmOpen':
rpmopen.c:1052:20: error: storage size of 'lead' isn't known
 1052 |     struct rpmlead lead;
      |                    ^~~~
rpmopen.c:1140:9: warning: implicit declaration of function 'fdClose'; did you mean 'fclose'? [-Wimplicit-function-declaration]
 1140 |         fdClose(fd);
      |         ^~~~~~~
      |         fclose
make[1]: *** [Makefile:516: rpmopen.o] Error 1
make[1]: Leaving directory '/<<PKGBUILDDIR>>'
dh_auto_build: error: make -j1 returned exit code 2
make: *** [debian/rules:7: build-arch] Error 25

Tail of log for qwinff on armhf:

src/qmpwidget/qmpwidget.cpp:575:43: warning: 'QTextStream& QTextStreamFunctions::endl(QTextStream&)' is deprecated: Use Qt::endl [-Wdeprecated-declarations]
  575 |     out << keys[i] << " " << "ignored" << endl;
      |                                           ^~~~
In file included from /usr/include/arm-linux-gnueabihf/qt5/QtCore/qdebug.h:49,
                 from /usr/include/arm-linux-gnueabihf/qt5/QtCore/QtDebug:1,
                 from src/qmpwidget/qmpwidget.cpp:27:
/usr/include/arm-linux-gnueabihf/qt5/QtCore/qtextstream.h:293:75: note: declared here
  293 | Q_CORE_EXPORT QT_DEPRECATED_VERSION_X(5, 15, "Use Qt::endl") QTextStream &endl(QTextStream &s);
      |                                                                           ^~~~
make[2]: *** [Makefile:1151: qmpwidget.o] Error 1
make[2]: Leaving directory '/<<BUILDDIR>>/qwinff-0.2.1+git20201215'
dh_auto_build: error: make -j4 "INSTALL=install --strip-program=true" QMAKE=arm-linux-gnueabihf-qmake returned exit code 2
make[1]: *** [debian/rules:28: override_dh_auto_build] Error 25
make[1]: Leaving directory '/<<BUILDDIR>>/qwinff-0.2.1+git20201215'
make: *** [debian/rules:20: binary-arch] Error 2

Tail of log for qtjsbackend-opensource-src on armhf:

../3rdparty/v8/src/objects.h:7486:36: error: left operand of shift expression '(-8 << 26)' is negative [-fpermissive]
 7486 |       (~kMaxCachedArrayIndexLength << kArrayIndexHashLengthShift) |
      |       ~~~~~~~~~~~~~~~~~~~~~~~~~~~~~^~~~~~~~~~~~~~~~~~~~~~~~~~~~~~
make[3]: *** [Makefile:924: .obj/accessors.o] Error 1
make[3]: *** Waiting for unfinished jobs....
make[3]: *** [Makefile:1362: .obj/ast.o] Error 1
make[3]: *** [Makefile:1244: .obj/assembler.o] Error 1
make[3]: *** [Makefile:1097: .obj/api.o] Error 1
make[3]: Leaving directory '/<<PKGBUILDDIR>>/src/v8'
make[2]: *** [Makefile:91: sub-v8-make_first-ordered] Error 2
make[2]: Leaving directory '/<<PKGBUILDDIR>>/src'
make[1]: *** [Makefile:48: sub-src-make_first] Error 2
make[1]: Leaving directory '/<<PKGBUILDDIR>>'
dh_auto_build: error: make -j4 returned exit code 2
make: *** [debian/rules:14: build-arch] Error 25

Tail of log for r-bioc-rsubread on armhf:

/usr/include/stdint.h:96:23: error: conflicting types for 'uintptr_t'
   96 | typedef unsigned int  uintptr_t;
      |                       ^~~~~~~~~
In file included from R_wrapper.c:30:
/usr/share/R/include/Rinterface.h:110:24: note: previous declaration of 'uintptr_t' was here
  110 |  typedef unsigned long uintptr_t;
      |                        ^~~~~~~~~
make[1]: *** [/usr/lib/R/etc/Makeconf:172: R_wrapper.o] Error 1
make[1]: Leaving directory '/<<PKGBUILDDIR>>/src'
make[1]: Entering directory '/<<PKGBUILDDIR>>/src'
make[1]: Leaving directory '/<<PKGBUILDDIR>>/src'
ERROR: compilation failed for package 'Rsubread'
* removing '/<<PKGBUILDDIR>>/debian/r-bioc-rsubread/usr/lib/R/site-library/Rsubread'
dh_auto_install: error: R CMD INSTALL -l /<<PKGBUILDDIR>>/debian/r-bioc-rsubread/usr/lib/R/site-library --clean . "--built-timestamp='Fri, 27 Nov 2020 11:36:46 +0100'" returned exit code 1
make: *** [debian/rules:4: binary-arch] Error 25

Tail of log for ruby2.1 on armhf:

 4979 | #define yydestruct(m, t, v) ruby_parser_yydestruct(m, t, v, parser)
      | 
parse.c:10853:63: error: macro "yydestruct" passed 4 arguments, but takes just 3
10853 |      this YYABORT or YYACCEPT.  */
      |                                                               ^
parse.c:4979: note: macro "yydestruct" defined here
 4979 | #define yydestruct(m, t, v) ruby_parser_yydestruct(m, t, v, parser)
      | 
make[2]: *** [Makefile:333: parse.o] Error 1
make[2]: *** Waiting for unfinished jobs....
make[2]: Leaving directory '/<<PKGBUILDDIR>>'
dh_auto_build: error: make -j4 main V=1 returned exit code 2
make[1]: *** [debian/rules:67: override_dh_auto_build-arch] Error 25
make[1]: Leaving directory '/<<PKGBUILDDIR>>'
make: *** [debian/rules:49: build-arch] Error 2

Tail of log for ruby-cbor on armhf:

     # ./spec/format_spec.rb:503:in `to_cbor'
     # ./spec/format_spec.rb:503:in `check'
     # ./spec/format_spec.rb:383:in `block (2 levels) in <top (required)>'

Finished in 34.19 seconds (files took 1.32 seconds to load)
160 examples, 1 failure

Failed examples:

rspec ./spec/format_spec.rb:378 # CBOR Tagged

/usr/bin/ruby2.7 -I/usr/share/rubygems-integration/all/gems/rspec-support-3.9.3/lib:/usr/share/rubygems-integration/all/gems/rspec-core-3.9.2/lib /usr/share/rubygems-integration/all/gems/rspec-core-3.9.2/exe/rspec --pattern ./spec/\*\*/\*_spec.rb --format documentation failed
ERROR: Test "ruby2.7" failed. Exiting.
dh_auto_install: error: dh_ruby --install /<<PKGBUILDDIR>>/debian/ruby-cbor returned exit code 1
make: *** [debian/rules:7: binary-arch] Error 25

Tail of log for rust-mach-o-sys on armhf:

For more information about this error, try `rustc --explain E0600`.
error: could not compile `mach_o_sys`.

Caused by:
  process didn't exit successfully: `CARGO=/usr/bin/cargo CARGO_CRATE_NAME=mach_o_sys CARGO_MANIFEST_DIR=/<<PKGBUILDDIR>> CARGO_PKG_AUTHORS='Nick Fitzgerald <fitzgen@gmail.com>' CARGO_PKG_DESCRIPTION='Bindings to the OSX mach-o system library' CARGO_PKG_HOMEPAGE='' CARGO_PKG_LICENSE=Apache-2.0/MIT CARGO_PKG_LICENSE_FILE='' CARGO_PKG_NAME=mach_o_sys CARGO_PKG_REPOSITORY='https://github.com/fitzgen/mach_o_sys' CARGO_PKG_VERSION=0.1.1 CARGO_PKG_VERSION_MAJOR=0 CARGO_PKG_VERSION_MINOR=1 CARGO_PKG_VERSION_PATCH=1 CARGO_PKG_VERSION_PRE='' LD_LIBRARY_PATH='/<<PKGBUILDDIR>>/target/debug/deps:/usr/lib' rustc --crate-name mach_o_sys src/lib.rs --error-format=json --json=diagnostic-rendered-ansi --crate-type lib --emit=dep-info,metadata,link -Cembed-bitcode=no -C debuginfo=2 -C metadata=6c4abfb49a04aeb5 -C extra-filename=-6c4abfb49a04aeb5 --out-dir /<<PKGBUILDDIR>>/target/arm-unknown-linux-gnueabihf/debug/deps --target arm-unknown-linux-gnueabihf -C incremental=/<<PKGBUILDDIR>>/target/arm-unknown-linux-gnueabihf/debug/incremental -L dependency=/<<PKGBUILDDIR>>/target/arm-unknown-linux-gnueabihf/debug/deps -L dependency=/<<PKGBUILDDIR>>/target/debug/deps -C debuginfo=2 --cap-lints warn -C linker=arm-linux-gnueabihf-gcc -C link-arg=-Wl,-z,relro --remap-path-prefix /<<PKGBUILDDIR>>=/usr/share/cargo/registry/mach-o-sys-0.1.1` (exit code: 1)
warning: build failed, waiting for other jobs to finish...
error: aborting due to 130 previous errors

For more information about this error, try `rustc --explain E0600`.
error: build failed
dh_auto_test: error: /usr/share/cargo/bin/cargo test --all returned exit code 101
make[1]: *** [debian/rules:6: override_dh_auto_test] Error 25
make[1]: Leaving directory '/<<PKGBUILDDIR>>'
make: *** [debian/rules:3: build-arch] Error 2

Tail of log for r-cran-s2 on armhf:

      |                                                    ^~
In file included from /usr/include/openssl/bn.h:19,
                 from ../inst/include/s2/util/math/exactfloat/exactfloat.h:119,
                 from s2/util/math/exactfloat/exactfloat.cc:18:
/usr/include/openssl/ossl_typ.h:80:16: note: forward declaration of ‘BIGNUM’ {aka ‘struct bignum_st’}
   80 | typedef struct bignum_st BIGNUM;
      |                ^~~~~~~~~
make[1]: *** [/usr/lib/R/etc/Makeconf:179: s2/util/math/exactfloat/exactfloat.o] Error 1
make[1]: Leaving directory '/<<PKGBUILDDIR>>/src'
make[1]: Entering directory '/<<PKGBUILDDIR>>/src'
make[1]: Leaving directory '/<<PKGBUILDDIR>>/src'
ERROR: compilation failed for package ‘s2’
* removing ‘/<<PKGBUILDDIR>>/debian/r-cran-s2/usr/lib/R/site-library/s2’
dh_auto_install: error: R CMD INSTALL -l /<<PKGBUILDDIR>>/debian/r-cran-s2/usr/lib/R/site-library --clean . "--built-timestamp='Sat, 16 Jan 2021 17:30:37 +0100'" returned exit code 1
make: *** [debian/rules:4: binary-arch] Error 25

Tail of log for rust-pq-sys on armhf:

failures:
    bindgen_test_layout__PQconninfoOption
    bindgen_test_layout__PQprintOpt
    bindgen_test_layout___sFILE
    bindgen_test_layout___sbuf
    bindgen_test_layout_pgNotify
    bindgen_test_layout_pgresAttDesc

test result: FAILED. 2 passed; 6 failed; 0 ignored; 0 measured; 0 filtered out

error: test failed, to rerun pass '--lib'
dh_auto_test: error: /usr/share/cargo/bin/cargo test --all returned exit code 101
make[1]: *** [debian/rules:6: override_dh_auto_test] Error 25
make[1]: Leaving directory '/<<PKGBUILDDIR>>'
make: *** [debian/rules:3: build-arch] Error 2

Tail of log for rust-mysqlclient-sys on armhf:

    bindgen_test_layout_st_mysql_res
    bindgen_test_layout_st_mysql_rows
    bindgen_test_layout_st_mysql_stmt
    bindgen_test_layout_st_mysql_time
    bindgen_test_layout_st_net
    bindgen_test_layout_st_plugin_vio
    bindgen_test_layout_st_used_mem

test result: FAILED. 2 passed; 16 failed; 0 ignored; 0 measured; 0 filtered out

error: test failed, to rerun pass '--lib'
dh_auto_test: error: /usr/share/cargo/bin/cargo test --all returned exit code 101
make[1]: *** [debian/rules:6: override_dh_auto_test] Error 25
make[1]: Leaving directory '/<<PKGBUILDDIR>>'
make: *** [debian/rules:3: build-arch] Error 2

Tail of log for rust-kvm-ioctls on armhf:

    |                                                     ^^^^^^^^^^ types differ in mutability
    |
    = note: expected mutable reference `&mut [u8]`
                       found reference `&[u8]`

error: aborting due to 151 previous errors; 4 warnings emitted

Some errors have detailed explanations: E0308, E0412, E0422, E0425, E0432.
For more information about an error, try `rustc --explain E0308`.
error: could not compile `kvm-ioctls`.

Caused by:
  process didn't exit successfully: `CARGO=/usr/bin/cargo CARGO_CRATE_NAME=kvm_ioctls CARGO_MANIFEST_DIR=/<<PKGBUILDDIR>> CARGO_PKG_AUTHORS='Amazon Firecracker Team <firecracker-maintainers@amazon.com>' CARGO_PKG_DESCRIPTION='Safe wrappers over KVM ioctls' CARGO_PKG_HOMEPAGE='' CARGO_PKG_LICENSE='Apache-2.0 OR MIT' CARGO_PKG_LICENSE_FILE='' CARGO_PKG_NAME=kvm-ioctls CARGO_PKG_REPOSITORY='https://github.com/rust-vmm/kvm-ioctls' CARGO_PKG_VERSION=0.2.0 CARGO_PKG_VERSION_MAJOR=0 CARGO_PKG_VERSION_MINOR=2 CARGO_PKG_VERSION_PATCH=0 CARGO_PKG_VERSION_PRE='' LD_LIBRARY_PATH='/<<PKGBUILDDIR>>/target/debug/deps:/usr/lib' rustc --crate-name kvm_ioctls src/lib.rs --error-format=json --json=diagnostic-rendered-ansi --crate-type lib --emit=dep-info,metadata,link -Cembed-bitcode=no -C debuginfo=2 -C metadata=ef1b70ca543ca83e -C extra-filename=-ef1b70ca543ca83e --out-dir /<<PKGBUILDDIR>>/target/arm-unknown-linux-gnueabihf/debug/deps --target arm-unknown-linux-gnueabihf -C incremental=/<<PKGBUILDDIR>>/target/arm-unknown-linux-gnueabihf/debug/incremental -L dependency=/<<PKGBUILDDIR>>/target/arm-unknown-linux-gnueabihf/debug/deps -L dependency=/<<PKGBUILDDIR>>/target/debug/deps --extern kvm_bindings=/<<PKGBUILDDIR>>/target/arm-unknown-linux-gnueabihf/debug/deps/libkvm_bindings-b5fddbf1ed0c4e85.rmeta --extern libc=/<<PKGBUILDDIR>>/target/arm-unknown-linux-gnueabihf/debug/deps/liblibc-7ac701aa45c57138.rmeta -C debuginfo=2 --cap-lints warn -C linker=arm-linux-gnueabihf-gcc -C link-arg=-Wl,-z,relro --remap-path-prefix /<<PKGBUILDDIR>>=/usr/share/cargo/registry/kvm-ioctls-0.2.0` (exit code: 1)
dh_auto_test: error: /usr/share/cargo/bin/cargo build returned exit code 101
make: *** [debian/rules:3: build-arch] Error 25

Tail of log for rust-generator on armhf:

  thread 'main' panicked at 'Unsupported architecture: arm-unknown-linux-gnueabihf', build.rs:30:13
  stack backtrace:
     0: rust_begin_unwind
               at /usr/src/rustc-1.48.0/library/std/src/panicking.rs:483
     1: std::panicking::begin_panic_fmt
               at /usr/src/rustc-1.48.0/library/std/src/panicking.rs:437
     2: build_script_build::main
               at ./build.rs:30
     3: core::ops::function::FnOnce::call_once
               at /usr/src/rustc-1.48.0/library/core/src/ops/function.rs:227
  note: Some details are omitted, run with `RUST_BACKTRACE=full` for a verbose backtrace.
dh_auto_test: error: /usr/share/cargo/bin/cargo test --all returned exit code 101
make[1]: *** [debian/rules:6: override_dh_auto_test] Error 25
make[1]: Leaving directory '/<<PKGBUILDDIR>>'
make: *** [debian/rules:3: build-arch] Error 2

Tail of log for scanbuttond on armhf:

dpkg-buildpackage: info: source package scanbuttond
dpkg-buildpackage: info: source version 0.2.3.cvs20090713-16
dpkg-buildpackage: info: source distribution unstable
 dpkg-source --before-build .
dpkg-buildpackage: info: host architecture armhf
 fakeroot debian/rules clean
dh_testdir
set -e; for f in include/scanbuttond/config.h.in INSTALL; do cp "$f" "$f.upstream"; done
if [ -f /usr/share/libtool/config/ltmain.sh ]; then \
  cp /usr/share/libtool/config/ltmain.sh .; \
else \
  cp /usr/share/libtool/ltmain.sh .; \
fi
cp: cannot stat '/usr/share/libtool/ltmain.sh': No such file or directory
make: *** [debian/rules:45: configure-stamp] Error 1

Tail of log for rust-ucd-generate on armhf:

102 |                 wtr.dense_regex(args.name(), &re)?;
    |                                              ^^^ the trait `StateID` is not implemented for `u64`

error: aborting due to 10 previous errors; 2 warnings emitted

Some errors have detailed explanations: E0277, E0599.
For more information about an error, try `rustc --explain E0277`.
error: could not compile `ucd-generate`.

Caused by:
  process didn't exit successfully: `CARGO=/usr/bin/cargo CARGO_BIN_NAME=ucd-generate CARGO_CRATE_NAME=ucd_generate CARGO_MANIFEST_DIR=/<<PKGBUILDDIR>> CARGO_PKG_AUTHORS='Andrew Gallant <jamslam@gmail.com>' CARGO_PKG_DESCRIPTION='A program for generating packed representations of the Unicode character
  database that can be efficiently searched.
  ' CARGO_PKG_HOMEPAGE='https://github.com/BurntSushi/ucd-generate' CARGO_PKG_LICENSE=MIT/Apache-2.0 CARGO_PKG_LICENSE_FILE='' CARGO_PKG_NAME=ucd-generate CARGO_PKG_REPOSITORY='https://github.com/BurntSushi/ucd-generate' CARGO_PKG_VERSION=0.2.3 CARGO_PKG_VERSION_MAJOR=0 CARGO_PKG_VERSION_MINOR=2 CARGO_PKG_VERSION_PATCH=3 CARGO_PKG_VERSION_PRE='' LD_LIBRARY_PATH='/<<PKGBUILDDIR>>/target/debug/deps:/usr/lib' rustc --crate-name ucd_generate src/main.rs --error-format=json --json=diagnostic-rendered-ansi --crate-type bin --emit=dep-info,link -Cembed-bitcode=no -C debuginfo=2 -C metadata=e3c3390792a31770 -C extra-filename=-e3c3390792a31770 --out-dir /<<PKGBUILDDIR>>/target/arm-unknown-linux-gnueabihf/debug/deps --target arm-unknown-linux-gnueabihf -C incremental=/<<PKGBUILDDIR>>/target/arm-unknown-linux-gnueabihf/debug/incremental -L dependency=/<<PKGBUILDDIR>>/target/arm-unknown-linux-gnueabihf/debug/deps -L dependency=/<<PKGBUILDDIR>>/target/debug/deps --extern byteorder=/<<PKGBUILDDIR>>/target/arm-unknown-linux-gnueabihf/debug/deps/libbyteorder-c5cffb3cfcfe6c4c.rlib --extern clap=/<<PKGBUILDDIR>>/target/arm-unknown-linux-gnueabihf/debug/deps/libclap-2e4acfa8cba0f174.rlib --extern fst=/<<PKGBUILDDIR>>/target/arm-unknown-linux-gnueabihf/debug/deps/libfst-fb620ad0c9592429.rlib --extern regex_automata=/<<PKGBUILDDIR>>/target/arm-unknown-linux-gnueabihf/debug/deps/libregex_automata-918d1711dd2dd3fb.rlib --extern ucd_parse=/<<PKGBUILDDIR>>/target/arm-unknown-linux-gnueabihf/debug/deps/libucd_parse-50a56b5ca8f9cfac.rlib --extern ucd_trie=/<<PKGBUILDDIR>>/target/arm-unknown-linux-gnueabihf/debug/deps/libucd_trie-14b85d0c65fcfd99.rlib --extern ucd_util=/<<PKGBUILDDIR>>/target/arm-unknown-linux-gnueabihf/debug/deps/libucd_util-794f71ccf0285c7c.rlib -C debuginfo=2 --cap-lints warn -C linker=arm-linux-gnueabihf-gcc -C link-arg=-Wl,-z,relro --remap-path-prefix /<<PKGBUILDDIR>>=/usr/share/cargo/registry/ucd-generate-0.2.3` (exit code: 1)
dh_auto_test: error: /usr/share/cargo/bin/cargo build returned exit code 101
make: *** [debian/rules:3: build-arch] Error 25

Tail of log for rust-servo-freetype-sys on armhf:

     2: cmake::fail
               at ./debian/cargo_registry/cmake-0.1.44/src/lib.rs:885
     3: cmake::run
               at ./debian/cargo_registry/cmake-0.1.44/src/lib.rs:863
     4: cmake::Config::build
               at ./debian/cargo_registry/cmake-0.1.44/src/lib.rs:698
     5: build_script_build::main
               at ./build.rs:23
     6: core::ops::function::FnOnce::call_once
               at /usr/src/rustc-1.48.0/library/core/src/ops/function.rs:227
  note: Some details are omitted, run with `RUST_BACKTRACE=full` for a verbose backtrace.
dh_auto_test: error: /usr/share/cargo/bin/cargo test --all returned exit code 101
make[1]: *** [debian/rules:6: override_dh_auto_test] Error 25
make[1]: Leaving directory '/<<PKGBUILDDIR>>'
make: *** [debian/rules:3: build-arch] Error 2

Tail of log for slang-slirp on armhf:

checking for dlfcn.h... yes
checking for dlopen in -ldl... yes
checking for g++... g++
checking whether we are using the GNU C++ compiler... yes
checking whether g++ accepts -g... yes
checking for gfortran... gfortran
checking whether we are using the GNU Fortran compiler... yes
checking whether gfortran accepts -g... yes
checking how to get verbose linking output from gfortran... -v
checking for Fortran libraries of gfortran...  -L/usr/lib/gcc/arm-linux-gnueabihf/10 -L/usr/lib/gcc/arm-linux-gnueabihf/10/../../../arm-linux-gnueabihf -L/usr/lib/gcc/arm-linux-gnueabihf/10/../../.. -L/lib/arm-linux-gnueabihf -L/usr/lib/arm-linux-gnueabihf -lgfortran -lm
checking for dummy main to link with Fortran libraries... none
checking for Fortran name-mangling scheme... lower case, underscore, no extra underscore
checking for the slang library and header files ... no
configure: error: unable to find the slang library and header file slang.h
make: *** [/usr/share/cdbs/1/class/autotools.mk:46: debian/stamp-autotools] Error 1

Tail of log for tiledarray on armhf:

      |       ^~~~~~~~
/<<PKGBUILDDIR>>/src/TiledArray/math/vector_op.h:107:7: note:   template argument deduction/substitution failed:
/<<PKGBUILDDIR>>/src/TiledArray/math/vector_op.h:155:29: note:   candidate expects 2 arguments, 3 provided
  155 |       VecOpUnwindN::for_each(op, result, args...);
      |       ~~~~~~~~~~~~~~~~~~~~~~^~~~~~~~~~~~~~~~~~~~~
make[4]: *** [src/CMakeFiles/tiledarray.dir/build.make:85: src/CMakeFiles/tiledarray.dir/TiledArray/tensor/tensor.cpp.o] Error 1
make[4]: Leaving directory '/<<PKGBUILDDIR>>/obj-arm-linux-gnueabihf'
make[3]: *** [CMakeFiles/Makefile2:448: src/CMakeFiles/tiledarray.dir/all] Error 2
make[3]: Leaving directory '/<<PKGBUILDDIR>>/obj-arm-linux-gnueabihf'
make[2]: *** [Makefile:163: all] Error 2
make[2]: Leaving directory '/<<PKGBUILDDIR>>/obj-arm-linux-gnueabihf'
dh_auto_build: error: cd obj-arm-linux-gnueabihf && make -j1 VERBOSE=1 returned exit code 2
make[1]: *** [debian/rules:52: override_dh_auto_build] Error 25
make[1]: Leaving directory '/<<PKGBUILDDIR>>'
make: *** [debian/rules:40: build-arch] Error 2

Tail of log for tinyarray on armhf:

  File "/usr/lib/python3/dist-packages/pluggy/callers.py", line 187 in _multicall
  File "/usr/lib/python3/dist-packages/pluggy/manager.py", line 83 in <lambda>
  File "/usr/lib/python3/dist-packages/pluggy/manager.py", line 92 in _hookexec
  File "/usr/lib/python3/dist-packages/pluggy/hooks.py", line 286 in __call__
  File "/usr/lib/python3/dist-packages/_pytest/config/__init__.py", line 157 in main
  File "/usr/lib/python3/dist-packages/_pytest/config/__init__.py", line 180 in console_main
  File "/usr/lib/python3/dist-packages/pytest/__main__.py", line 7 in <module>
  File "/usr/lib/python3.9/runpy.py", line 87 in _run_code
  File "/usr/lib/python3.9/runpy.py", line 197 in _run_module_as_main
Aborted
E: pybuild pybuild:353: test: plugin distutils failed with: exit code=134: cd /<<PKGBUILDDIR>>/.pybuild/cpython3_3.9_tinyarray/build; python3.9 -m pytest ../../../test_tinyarray.py
dh_auto_test: error: pybuild --test --test-pytest -i python{version} -p 3.9 --test-pytest --test-args=../../../test_tinyarray.py returned exit code 13
make[1]: *** [debian/rules:11: override_dh_auto_test] Error 25
make[1]: Leaving directory '/<<PKGBUILDDIR>>'
make: *** [debian/rules:7: binary-arch] Error 2

Tail of log for traildb on armhf:

#define HAVE_INTTYPES_H 1
#define HAVE_STDINT_H 1
#define HAVE_UNISTD_H 1
#define HAVE_DLFCN_H 1
#define LT_OBJDIR ".libs/"
#define DSFMT_MEXP 521
#define HAVE_SSE2 1
#define HAVE_LIBJUDY 1
#define HAVE_JUDY_H 1
#define HAVE_ARCHIVE_H 1
#define HAVE_LIBARCHIVE 1

configure: exit 1
dh_auto_configure: error: ./configure --build=arm-linux-gnueabihf --prefix=/usr --includedir=\${prefix}/include --mandir=\${prefix}/share/man --infodir=\${prefix}/share/info --sysconfdir=/etc --localstatedir=/var --disable-option-checking --disable-silent-rules --libdir=\${prefix}/lib/arm-linux-gnueabihf --libexecdir=\${prefix}/lib/arm-linux-gnueabihf --disable-maintainer-mode --disable-dependency-tracking returned exit code 1
make: *** [debian/rules:10: build-arch] Error 25

Tail of log for xf86-video-msm on armhf:

                 from neon_memsets.c:30:
/usr/include/xorg/servermd.h:51:2: error: #error Drivers must include xorg-server.h before any other xserver headers
   51 | #error Drivers must include xorg-server.h before any other xserver headers
      |  ^~~~~
/usr/include/xorg/servermd.h:52:2: error: #error xserver code must include dix-config.h before any other headers
   52 | #error xserver code must include dix-config.h before any other headers
      |  ^~~~~
make[3]: *** [Makefile:550: neon_memsets.lo] Error 1
make[3]: Leaving directory '/<<BUILDDIR>>/xf86-video-msm-1.0.1+git20100122.5f7df591/src'
make[2]: *** [Makefile:428: all-recursive] Error 1
make[2]: Leaving directory '/<<BUILDDIR>>/xf86-video-msm-1.0.1+git20100122.5f7df591'
make[1]: *** [Makefile:360: all] Error 2
make[1]: Leaving directory '/<<BUILDDIR>>/xf86-video-msm-1.0.1+git20100122.5f7df591'
dh_auto_build: error: make -j1 returned exit code 2
make: *** [debian/rules:8: build-arch] Error 25

Tail of log for wmmail on armhf:

/usr/bin/make
make[1]: Entering directory '/<<PKGBUILDDIR>>'
Making all in src
make[2]: Entering directory '/<<PKGBUILDDIR>>/src'
gcc -DPACKAGE=\"WMMail\" -DVERSION=\"0.64\" -DHAVE_LIBNSL=1 -DHAVE_LIBX11=1 -DHAVE_LIBXEXT=1 -DHAVE_LIBXT=1 -DHAVE_LIBXPM=1 -DHAVE_LIBWUTIL=1 -DSTDC_HEADERS=1 -DHAVE_LIMITS_H=1 -DHAVE_STRINGS_H=1 -DHAVE_UNISTD_H=1 -DRETSIGTYPE=int -DHAVE_VPRINTF=1 -DHAVE_SOCKET=1 -DHAVE_STRSTR=1  -I. -I.      -g -O2 -I  -c global.c
In file included from global.c:27:
wmmail.h:32:10: fatal error: WINGs/proplist-compat.h: No such file or directory
   32 | #include <WINGs/proplist-compat.h>
      |          ^~~~~~~~~~~~~~~~~~~~~~~~~
compilation terminated.
make[2]: *** [Makefile:247: global.o] Error 1
make[2]: Leaving directory '/<<PKGBUILDDIR>>/src'
make[1]: *** [Makefile:125: all-recursive] Error 1
make[1]: Leaving directory '/<<PKGBUILDDIR>>'
make: *** [debian/rules:17: build-stamp] Error 2

Tail of log for tarantool on armhf:

      |    ^~~~~
/<<PKGBUILDDIR>>/third_party/coro/coro.c:480:14: error: 'NUM_SAVED' undeclared (first use in this function)
  480 |   ctx->sp -= NUM_SAVED;
      |              ^~~~~~~~~
/<<PKGBUILDDIR>>/third_party/coro/coro.c:480:14: note: each undeclared identifier is reported only once for each function it appears in
/<<PKGBUILDDIR>>/third_party/coro/coro.c:494:4: error: #error unsupported architecture
  494 |   #error unsupported architecture
      |    ^~~~~
make[3]: *** [CMakeFiles/coro.dir/build.make:85: CMakeFiles/coro.dir/third_party/coro/coro.c.o] Error 1
make[3]: Leaving directory '/<<PKGBUILDDIR>>/obj-arm-linux-gnueabihf'
make[2]: *** [CMakeFiles/Makefile2:1367: CMakeFiles/coro.dir/all] Error 2
make[2]: Leaving directory '/<<PKGBUILDDIR>>/obj-arm-linux-gnueabihf'
make[1]: *** [Makefile:174: all] Error 2
make[1]: Leaving directory '/<<PKGBUILDDIR>>/obj-arm-linux-gnueabihf'
make: *** [/usr/share/cdbs/1/class/makefile.mk:77: debian/stamp-makefile-build] Error 2

Tail of log for tendermint on armhf:

--- PASS: TestBadVotes (0.05s)
=== RUN   TestConflicts
--- PASS: TestConflicts (0.11s)
=== RUN   TestMakeCommit
--- PASS: TestMakeCommit (0.14s)
=== RUN   TestVoteSignable
--- PASS: TestVoteSignable (0.00s)
PASS
ok  	github.com/tendermint/tendermint/types	7.610s
?   	github.com/tendermint/tendermint/version	[no test files]
FAIL
dh_auto_test: error: cd obj-arm-linux-gnueabihf && go test -vet=off -v -p 1 github.com/tendermint/tendermint/benchmarks github.com/tendermint/tendermint/benchmarks/proto github.com/tendermint/tendermint/benchmarks/simu github.com/tendermint/tendermint/blockchain github.com/tendermint/tendermint/cmd/tendermint github.com/tendermint/tendermint/config/tendermint github.com/tendermint/tendermint/config/tendermint_test github.com/tendermint/tendermint/consensus github.com/tendermint/tendermint/fail-test github.com/tendermint/tendermint/mempool github.com/tendermint/tendermint/node github.com/tendermint/tendermint/proxy github.com/tendermint/tendermint/rpc/core github.com/tendermint/tendermint/rpc/core/types github.com/tendermint/tendermint/rpc/grpc github.com/tendermint/tendermint/rpc/test github.com/tendermint/tendermint/state github.com/tendermint/tendermint/test/app github.com/tendermint/tendermint/types github.com/tendermint/tendermint/version returned exit code 1
make[1]: *** [debian/rules:9: override_dh_auto_test] Error 25
make[1]: Leaving directory '/<<BUILDDIR>>/tendermint-0.8.0+git20170113.0.764091d'
make: *** [debian/rules:6: build-arch] Error 2

Tail of log for rust-libnotcurses-sys on armhf:

   |                                         ^^ types differ in mutability
   |
   = note: expected raw pointer `*mut bindings::ffi::notcurses`
                found reference `&bindings::ffi::notcurses`

error: aborting due to 11 previous errors

Some errors have detailed explanations: E0308, E0432.
For more information about an error, try `rustc --explain E0308`.
error: could not compile `libnotcurses-sys`.

Caused by:
  process didn't exit successfully: `CARGO=/usr/bin/cargo CARGO_CRATE_NAME=libnotcurses_sys CARGO_MANIFEST_DIR=/<<PKGBUILDDIR>> CARGO_PKG_AUTHORS='nick black <dankamongmen@gmail.com>:José Luis Cruz <joseluis@andamira.net>' CARGO_PKG_DESCRIPTION='Low-level Rust bindings for the notcurses C library.' CARGO_PKG_HOMEPAGE='https://nick-black.com/dankwiki/index.php/Notcurses' CARGO_PKG_LICENSE=Apache-2.0 CARGO_PKG_LICENSE_FILE='' CARGO_PKG_NAME=libnotcurses-sys CARGO_PKG_REPOSITORY='https://github.com/dankamongmen/notcurses' CARGO_PKG_VERSION=2.1.8 CARGO_PKG_VERSION_MAJOR=2 CARGO_PKG_VERSION_MINOR=1 CARGO_PKG_VERSION_PATCH=8 CARGO_PKG_VERSION_PRE='' LD_LIBRARY_PATH='/<<PKGBUILDDIR>>/target/debug/deps:/usr/lib' OUT_DIR=/<<PKGBUILDDIR>>/target/arm-unknown-linux-gnueabihf/debug/build/libnotcurses-sys-6d2a835ad1a90904/out rustc --crate-name libnotcurses_sys --edition=2018 src/lib.rs --error-format=json --json=diagnostic-rendered-ansi --crate-type lib --emit=dep-info,metadata,link -Cembed-bitcode=no -C debuginfo=2 -C metadata=f9dd4e71e191bc5c -C extra-filename=-f9dd4e71e191bc5c --out-dir /<<PKGBUILDDIR>>/target/arm-unknown-linux-gnueabihf/debug/deps --target arm-unknown-linux-gnueabihf -C incremental=/<<PKGBUILDDIR>>/target/arm-unknown-linux-gnueabihf/debug/incremental -L dependency=/<<PKGBUILDDIR>>/target/arm-unknown-linux-gnueabihf/debug/deps -L dependency=/<<PKGBUILDDIR>>/target/debug/deps --extern cty=/<<PKGBUILDDIR>>/target/arm-unknown-linux-gnueabihf/debug/deps/libcty-904649ed5cec472e.rmeta --extern libc=/<<PKGBUILDDIR>>/target/arm-unknown-linux-gnueabihf/debug/deps/liblibc-7ac701aa45c57138.rmeta -C debuginfo=2 --cap-lints warn -C linker=arm-linux-gnueabihf-gcc -C link-arg=-Wl,-z,relro --remap-path-prefix /<<PKGBUILDDIR>>=/usr/share/cargo/registry/libnotcurses-sys-2.1.8 -L native=/usr/lib/arm-linux-gnueabihf -l notcurses -l notcurses-core` (exit code: 1)
dh_auto_test: error: /usr/share/cargo/bin/cargo build returned exit code 101
make: *** [debian/rules:3: binary-arch] Error 25

Tail of log for qtmir on armhf:

+ _ZTVSt23_Sp_counted_ptr_inplaceIN5qtmir20PromptSessionManagerESaIS1_ELN9__gnu_cxx12_Lock_policyE1EE@Base 0.6.1
+#MISSING: 0.6.1-5# (arch=!armel)_ZTVSt23_Sp_counted_ptr_inplaceIN5qtmir20PromptSessionManagerESaIS1_ELN9__gnu_cxx12_Lock_policyE2EE@Base 0.6.1
+ _ZTVSt23_Sp_counted_ptr_inplaceIN5qtmir26DisplayConfigurationPolicyESaIS1_ELN9__gnu_cxx12_Lock_policyE1EE@Base 0.6.1
+#MISSING: 0.6.1-5# (arch=!armel)_ZTVSt23_Sp_counted_ptr_inplaceIN5qtmir26DisplayConfigurationPolicyESaIS1_ELN9__gnu_cxx12_Lock_policyE2EE@Base 0.6.1
+ _ZTVSt23_Sp_counted_ptr_inplaceIN5qtmir29WindowManagementPolicyPrivateESaIS1_ELN9__gnu_cxx12_Lock_policyE1EE@Base 0.6.1
+#MISSING: 0.6.1-5# (arch=!armel)_ZTVSt23_Sp_counted_ptr_inplaceIN5qtmir29WindowManagementPolicyPrivateESaIS1_ELN9__gnu_cxx12_Lock_policyE2EE@Base 0.6.1
+ _ZTVSt23_Sp_counted_ptr_inplaceIN5qtmir34BasicSetDisplayConfigurationPolicy4SelfESaIS2_ELN9__gnu_cxx12_Lock_policyE1EE@Base 0.6.1
+#MISSING: 0.6.1-5# (arch=!armel)_ZTVSt23_Sp_counted_ptr_inplaceIN5qtmir34BasicSetDisplayConfigurationPolicy4SelfESaIS2_ELN9__gnu_cxx12_Lock_policyE2EE@Base 0.6.1
+ _ZTVSt23_Sp_counted_ptr_inplaceIN5qtmir35BasicSetDisplayConfigurationStorage4SelfESaIS2_ELN9__gnu_cxx12_Lock_policyE1EE@Base 0.6.1
+#MISSING: 0.6.1-5# (arch=!armel)_ZTVSt23_Sp_counted_ptr_inplaceIN5qtmir35BasicSetDisplayConfigurationStorage4SelfESaIS2_ELN9__gnu_cxx12_Lock_policyE2EE@Base 0.6.1
  (optional=templinst)_ZZN11QMetaTypeIdIN3Mir5StateEE14qt_metatype_idEvE11metatype_id@Base 0.6.1
  (optional=templinst)_ZZN11QMetaTypeIdIN5miral10WindowInfoEE14qt_metatype_idEvE11metatype_id@Base 0.6.1
  (optional=templinst)_ZZN11QMetaTypeIdIN5miral15ApplicationInfoEE14qt_metatype_idEvE11metatype_id@Base 0.6.1
dh_makeshlibs: error: failing due to earlier errors
make: *** [debian/rules:24: binary-arch] Error 25

Tail of log for rheolef on armhf:

/usr/bin/ld: ./.libs/libfem.a(geo_domain_indirect_seq.o):(.data.rel.ro+0x18): multiple definition of `typeinfo for rheolef::geo_domain_indirect_rep<double, rheolef::sequential>'; ./.libs/libfem.a(geo_domain_indirect.o):(.data.rel.ro+0x0): first defined here
/usr/bin/ld: ./.libs/libfem.a(geo_domain_indirect_mpi.o):(.rodata+0x0): multiple definition of `typeinfo name for rheolef::geo_domain_indirect_rep<double, rheolef::distributed>'; ./.libs/libfem.a(geo_domain_indirect.o):(.rodata+0x38): first defined here
/usr/bin/ld: ./.libs/libfem.a(geo_domain_indirect_mpi.o):(.data.rel.ro+0x0): multiple definition of `typeinfo for rheolef::geo_domain_indirect_rep<double, rheolef::distributed>'; ./.libs/libfem.a(geo_domain_indirect.o):(.data.rel.ro+0xc): first defined here
/usr/bin/ld: ./.libs/libfem.a(geo_domain_seq.o):(.rodata+0x0): multiple definition of `typeinfo name for rheolef::geo_rep<double, rheolef::sequential>'; ./.libs/libfem.a(geo.o):(.rodata+0x2c): first defined here
/usr/bin/ld: ./.libs/libfem.a(geo_domain_seq.o):(.data.rel.ro+0x0): multiple definition of `typeinfo for rheolef::geo_rep<double, rheolef::sequential>'; ./.libs/libfem.a(geo.o):(.data.rel.ro+0xc): first defined here
/usr/bin/ld: ./.libs/libfem.a(geo_domain_mpi.o):(.rodata+0x0): multiple definition of `typeinfo name for rheolef::geo_rep<double, rheolef::distributed>'; ./.libs/libfem.a(geo.o):(.rodata+0x84): first defined here
/usr/bin/ld: ./.libs/libfem.a(geo_domain_mpi.o):(.data.rel.ro+0x0): multiple definition of `typeinfo for rheolef::geo_rep<double, rheolef::distributed>'; ./.libs/libfem.a(geo.o):(.data.rel.ro+0x24): first defined here
collect2: error: ld returned 1 exit status
make[4]: *** [Makefile:947: librheolef.la] Error 1
make[3]: *** [Makefile:863: all] Error 2
make[2]: *** [Makefile:445: all-recursive] Error 1
make[1]: *** [Makefile:514: all-recursive] Error 1
make[1]: Leaving directory '/<<PKGBUILDDIR>>'
dh_auto_build: error: make -j4 returned exit code 2
make: *** [debian/rules:30: build-arch] Error 25

Tail of log for pyfftw on armhf:

One run: 21.97 ms (versus 64.65 ms for singled threaded)
One run: 23.62 ms (versus 64.65 ms for singled threaded)
One run: 70.55 ms (versus 85.29 ms for numpy.fft)
One run: 70.55 ms (versus 85.44 ms for numpy.fft)
One run: 27.98 ms (versus 106.04 ms for numpy.fft)
One run: 28.70 ms (versus 106.17 ms for numpy.fft)
One run: 70.82 ms (versus 61.90 ms for numpy.fft)
One run: 70.60 ms (versus 61.82 ms for numpy.fft)
One run: 35.98 ms (versus 78.78 ms for numpy.fft)
One run: 36.29 ms (versus 78.77 ms for numpy.fft)
E: pybuild pybuild:353: test: plugin distutils failed with: exit code=1: cd /<<PKGBUILDDIR>>/.pybuild/cpython3_3.9_pyfftw/build; python3.9 -m unittest discover -v 
dh_auto_test: error: pybuild --test -i python{version} -p 3.9 returned exit code 13
make[1]: *** [debian/rules:35: override_dh_auto_test] Error 1
make[1]: Leaving directory '/<<PKGBUILDDIR>>'
make: *** [debian/rules:14: build-arch] Error 2

Tail of log for tulip on armhf:

                 from /usr/include/arm-linux-gnueabihf/qt5/QtGui/QOpenGLContext:1,
                 from ../library/tulip-gui/src/GlOffscreenRenderer.cpp:29:
/usr/include/GLES3/gl32.h:1821:187: error: ‘void __glewTexStorage3DMultisample(GLenum, GLsizei, GLenum, GLsizei, GLsizei, GLsizei, GLboolean)’ redeclared as different kind of entity
 1821 | GL_APICALL void GL_APIENTRY glTexStorage3DMultisample (GLenum target, GLsizei samples, GLenum internalformat, GLsizei width, GLsizei height, GLsizei depth, GLboolean fixedsamplelocations);
      |                                                                                                                                                                                           ^
In file included from ../library/tulip-gui/src/GlOffscreenRenderer.cpp:24:
/usr/include/GL/glew.h:20901:50: note: previous declaration ‘void (* __glewTexStorage3DMultisample)(GLenum, GLsizei, GLenum, GLsizei, GLsizei, GLsizei, GLboolean)’
20901 | GLEW_FUN_EXPORT PFNGLTEXSTORAGE3DMULTISAMPLEPROC __glewTexStorage3DMultisample;
      |                                                  ^~~~~~~~~~~~~~~~~~~~~~~~~~~~~
[1172/1775] /usr/bin/c++ -DQT_CORE_LIB -DQT_DLL -DQT_GUI_LIB -DQT_NETWORK_LIB -DQT_NO_DEBUG -DQT_THREAD_SUPPORT -DQT_WIDGETS_LIB -DTULIP_BUILD_PYTHON_COMPONENTS -D_LINUX -Dtulip_gui_5_4_EXPORTS -Ilibrary/tulip-gui/include -Ilibrary/tulip-core/include -I../library/tulip-core/include -I../library/tulip-ogl/include -I../library/tulip-gui/include -Ilibrary/tulip-gui/src -I/usr/include/quazip5 -isystem /usr/include/arm-linux-gnueabihf/qt5 -isystem /usr/include/arm-linux-gnueabihf/qt5/QtWidgets -isystem /usr/include/arm-linux-gnueabihf/qt5/QtGui -isystem /usr/include/arm-linux-gnueabihf/qt5/QtCore -isystem /usr/lib/arm-linux-gnueabihf/qt5/mkspecs/linux-g++ -isystem /usr/include/arm-linux-gnueabihf/qt5/QtNetwork -g -O2 -ffile-prefix-map=/<<BUILDDIR>>/tulip-5.4.0+dfsg=. -fstack-protector-strong -Wformat -Werror=format-security -Wdate-time -D_FORTIFY_SOURCE=2 -Wall -Wextra -Wunused -Wno-long-long -Wold-style-cast -pedantic -Wimplicit-fallthrough=0 -O3 -DNDEBUG -fopenmp -fPIC -fPIC -MD -MT library/tulip-gui/src/CMakeFiles/tulip-gui-5.4.dir/CopyPropertyDialog.cpp.o -MF library/tulip-gui/src/CMakeFiles/tulip-gui-5.4.dir/CopyPropertyDialog.cpp.o.d -o library/tulip-gui/src/CMakeFiles/tulip-gui-5.4.dir/CopyPropertyDialog.cpp.o -c ../library/tulip-gui/src/CopyPropertyDialog.cpp
ninja: build stopped: subcommand failed.
dh_auto_build: error: cd obj-arm-linux-gnueabihf && LC_ALL=C.UTF-8 ninja -j4 -v returned exit code 1
make[1]: *** [debian/rules:14: override_dh_auto_build-arch] Error 25
make[1]: Leaving directory '/<<BUILDDIR>>/tulip-5.4.0+dfsg'
make: *** [debian/rules:8: binary-arch] Error 2

Tail of log for sfcgal on armhf:

/usr/bin/ld: CMakeFiles/SFCGAL.dir/detail/generator/building.cpp.o:(.data.rel.ro+0x3c): multiple definition of `typeinfo for CORE::AddSubRep<CORE::Add>'; CMakeFiles/SFCGAL.dir/algorithm/straightSkeleton.cpp.o:(.data.rel.ro+0x3c): first defined here
/usr/bin/ld: CMakeFiles/SFCGAL.dir/detail/generator/building.cpp.o:(.data.rel.ro+0x48): multiple definition of `typeinfo for CORE::AddSubRep<CORE::Sub>'; CMakeFiles/SFCGAL.dir/algorithm/straightSkeleton.cpp.o:(.data.rel.ro+0x48): first defined here
/usr/bin/ld: CMakeFiles/SFCGAL.dir/detail/generator/building.cpp.o:(.data.rel.ro+0x54): multiple definition of `typeinfo for CORE::ConstPolyRep<CORE::Expr>'; CMakeFiles/SFCGAL.dir/algorithm/straightSkeleton.cpp.o:(.data.rel.ro+0x54): first defined here
/usr/bin/ld: CMakeFiles/SFCGAL.dir/detail/generator/building.cpp.o:(.data.rel.ro+0x60): multiple definition of `typeinfo for CORE::ConstPolyRep<CORE::BigFloat>'; CMakeFiles/SFCGAL.dir/algorithm/straightSkeleton.cpp.o:(.data.rel.ro+0x60): first defined here
/usr/bin/ld: CMakeFiles/SFCGAL.dir/detail/generator/building.cpp.o:(.data.rel.ro+0x6c): multiple definition of `typeinfo for CORE::ConstPolyRep<CORE::BigInt>'; CMakeFiles/SFCGAL.dir/algorithm/straightSkeleton.cpp.o:(.data.rel.ro+0x6c): first defined here
/usr/bin/ld: CMakeFiles/SFCGAL.dir/detail/generator/building.cpp.o:(.data.rel.ro+0x78): multiple definition of `typeinfo for CORE::ConstPolyRep<CORE::BigRat>'; CMakeFiles/SFCGAL.dir/algorithm/straightSkeleton.cpp.o:(.data.rel.ro+0x78): first defined here
collect2: error: ld returned 1 exit status
make[3]: *** [src/CMakeFiles/SFCGAL.dir/build.make:1423: src/libSFCGAL.so.1.3.8] Error 1
make[3]: Leaving directory '/<<PKGBUILDDIR>>/obj-arm-linux-gnueabihf'
make[2]: *** [CMakeFiles/Makefile2:280: src/CMakeFiles/SFCGAL.dir/all] Error 2
make[2]: Leaving directory '/<<PKGBUILDDIR>>/obj-arm-linux-gnueabihf'
make[1]: *** [Makefile:163: all] Error 2
make[1]: Leaving directory '/<<PKGBUILDDIR>>/obj-arm-linux-gnueabihf'
dh_auto_build: error: cd obj-arm-linux-gnueabihf && make -j4 VERBOSE=1 returned exit code 2
make: *** [debian/rules:22: build-arch] Error 25

Tail of log for agda on armhf:

[146 of 369] Compiling Agda.Utils.TypeLits ( src/full/Agda/Utils/TypeLits.hs, dist-ghc/build/Agda/Utils/TypeLits.o )
[147 of 369] Compiling Agda.Utils.Update ( src/full/Agda/Utils/Update.hs, dist-ghc/build/Agda/Utils/Update.o )
[148 of 369] Compiling Agda.Syntax.Concrete.Definitions ( src/full/Agda/Syntax/Concrete/Definitions.hs, dist-ghc/build/Agda/Syntax/Concrete/Definitions.o )
[149 of 369] Compiling Agda.Utils.VarSet ( src/full/Agda/Utils/VarSet.hs, dist-ghc/build/Agda/Utils/VarSet.o )
[150 of 369] Compiling Agda.Utils.Warshall ( src/full/Agda/Utils/Warshall.hs, dist-ghc/build/Agda/Utils/Warshall.o )
[151 of 369] Compiling Agda.Utils.WithDefault ( src/full/Agda/Utils/WithDefault.hs, dist-ghc/build/Agda/Utils/WithDefault.o )
[152 of 369] Compiling Agda.Utils.Zipper ( src/full/Agda/Utils/Zipper.hs, dist-ghc/build/Agda/Utils/Zipper.o )
[153 of 369] Compiling Paths_Agda       ( dist-ghc/build/autogen/Paths_Agda.hs, dist-ghc/build/Paths_Agda.o )
[154 of 369] Compiling Agda.Version     ( src/full/Agda/Version.hs, dist-ghc/build/Agda/Version.o )
[155 of 369] Compiling Agda.VersionCommit ( src/full/Agda/VersionCommit.hs, dist-ghc/build/Agda/VersionCommit.o )
[156 of 369] Compiling Agda.Interaction.Library ( src/full/Agda/Interaction/Library.hs, dist-ghc/build/Agda/Interaction/Library.o )
[157 of 369] Compiling Agda.Interaction.Options ( src/full/Agda/Interaction/Options.hs, dist-ghc/build/Agda/Interaction/Options.o )
[158 of 369] Compiling Agda.TypeChecking.Monad.Base ( src/full/Agda/TypeChecking/Monad/Base.hs, dist-ghc/build/Agda/TypeChecking/Monad/Base.o )
ghc: out of memory (requested 1048576 bytes)
make: *** [/usr/share/cdbs/1/class/hlibrary.mk:147: build-ghc-stamp] Error 251

Tail of log for libmaus2 on armhf:

/usr/bin/ld: ./.libs/libmaus2.so: undefined reference to `__atomic_fetch_and_8'
collect2: error: ld returned 1 exit status
make[3]: *** [Makefile:6848: testThreadPoolBgzfRead] Error 1
/usr/bin/ld: ./.libs/libmaus2.so: undefined reference to `__atomic_fetch_or_8'
/usr/bin/ld: ./.libs/libmaus2.so: undefined reference to `__atomic_compare_exchange_8'
/usr/bin/ld: ./.libs/libmaus2.so: undefined reference to `__atomic_fetch_and_8'
collect2: error: ld returned 1 exit status
make[3]: *** [Makefile:6842: testThreadPoolBgzfDecompress] Error 1
make[3]: Leaving directory '/<<BUILDDIR>>/libmaus2-2.0.768+dfsg/src'
make[2]: *** [Makefile:679: all-recursive] Error 1
make[2]: Leaving directory '/<<BUILDDIR>>/libmaus2-2.0.768+dfsg'
make[1]: *** [Makefile:563: all] Error 2
make[1]: Leaving directory '/<<BUILDDIR>>/libmaus2-2.0.768+dfsg'
dh_auto_build: error: make -j4 returned exit code 2
make: *** [debian/rules:12: binary-arch] Error 25

Tail of log for openms on armhf:

  101 |         return static_cast< QOpenGLFunctions_2_0*>(this);
      |                                                         ^
      |                                                         )
make[5]: *** [src/openms_gui/CMakeFiles/OpenMS_GUI.dir/build.make:227: src/openms_gui/CMakeFiles/OpenMS_GUI.dir/OpenMS_GUI_autogen/mocs_compilation.cpp.o] Error 1
make[5]: Leaving directory '/<<BUILDDIR>>/openms-2.6.0+cleaned1/obj-arm-linux-gnueabihf'
make[4]: *** [CMakeFiles/Makefile2:1961: src/openms_gui/CMakeFiles/OpenMS_GUI.dir/all] Error 2
make[4]: Leaving directory '/<<BUILDDIR>>/openms-2.6.0+cleaned1/obj-arm-linux-gnueabihf'
make[3]: *** [CMakeFiles/Makefile2:1819: src/openms_gui/CMakeFiles/GUI.dir/rule] Error 2
make[3]: Leaving directory '/<<BUILDDIR>>/openms-2.6.0+cleaned1/obj-arm-linux-gnueabihf'
make[2]: *** [Makefile:626: GUI] Error 2
make[2]: Leaving directory '/<<BUILDDIR>>/openms-2.6.0+cleaned1/obj-arm-linux-gnueabihf'
dh_auto_build: error: cd obj-arm-linux-gnueabihf && make -j1 "INSTALL=install --strip-program=true" OpenMS GUI TOPP UTILS VERBOSE=1 returned exit code 2
make[1]: *** [debian/rules:95: override_dh_auto_build] Error 25
make[1]: Leaving directory '/<<BUILDDIR>>/openms-2.6.0+cleaned1'
make: *** [debian/rules:43: build-arch] Error 2

Tail of log for qtwebengine-opensource-src on armhf:

[7954/20506] /usr/bin/python2 ../../3rdparty/chromium/tools/grit/grit.py -i ../../3rdparty/chromium/third_party/blink/public/strings/blink_strings.grd build -o gen/third_party/blink/public/strings --depdir . --depfile gen/third_party/blink/public/strings/strings_grit.d --write-only-new=1 --depend-on-stamp -D scale_factors=2x -D _chromium -E CHROMIUM_BUILD=chromium -D desktop_linux -D use_aura -D use_nss_certs -D use_ozone -t linux2 -f gen/tools/gritsettings/default_resource_ids --assert-file-list obj/third_party/blink/public/strings/strings_expected_outputs.txt
[7955/20506] /usr/bin/g++ -MMD -MF obj/url/url/url_canon_ip.o.d -DIS_URL_IMPL -DUSE_UDEV -DUSE_AURA=1 -DUSE_NSS_CERTS=1 -DUSE_OZONE=1 -DOFFICIAL_BUILD -DTOOLKIT_QT -D_FILE_OFFSET_BITS=64 -D_LARGEFILE_SOURCE -D_LARGEFILE64_SOURCE -DNO_UNWIND_TABLES -D__STDC_CONSTANT_MACROS -D__STDC_FORMAT_MACROS -DNDEBUG -DNVALGRIND -DDYNAMIC_ANNOTATIONS_ENABLED=0 -DUSING_SYSTEM_ICU=1 -DICU_UTIL_DATA_IMPL=ICU_UTIL_DATA_STATIC -DUCHAR_TYPE=uint16_t -Igen -I../../3rdparty/chromium -Igen -Igen -Igen -I../../3rdparty/chromium/third_party/boringssl/src/include -fno-strict-aliasing --param=ssp-buffer-size=4 -fstack-protector -fno-unwind-tables -fno-asynchronous-unwind-tables -fPIC -pipe -pthread -march=armv7-a -mfloat-abi=hard -mtune=generic-armv7-a -mfpu=vfpv3-d16 -marm -Wall -U_FORTIFY_SOURCE -D_FORTIFY_SOURCE=2 -Wno-psabi -Wno-unused-local-typedefs -Wno-maybe-uninitialized -Wno-deprecated-declarations -fno-delete-null-pointer-checks -Wno-comments -Wno-packed-not-aligned -Wno-dangling-else -Wno-missing-field-initializers -Wno-unused-parameter -O2 -fno-ident -fdata-sections -ffunction-sections -fno-omit-frame-pointer -g0 -fvisibility=hidden -std=gnu++14 -Wno-narrowing -Wno-class-memaccess -Wno-attributes -Wno-class-memaccess -Wno-subobject-linkage -Wno-invalid-offsetof -Wno-return-type -Wno-deprecated-copy -fno-exceptions -fno-rtti -fvisibility-inlines-hidden -c ../../3rdparty/chromium/url/url_canon_ip.cc -o obj/url/url/url_canon_ip.o
ninja: build stopped: subcommand failed.
make[5]: *** [Makefile.gn_run:360: run_ninja] Error 1
make[5]: Leaving directory '/<<PKGBUILDDIR>>/src/core'
make[4]: *** [Makefile:82: sub-gn_run-pro-make_first] Error 2
make[4]: Leaving directory '/<<PKGBUILDDIR>>/src/core'
make[3]: *** [Makefile:80: sub-core-make_first] Error 2
make[3]: Leaving directory '/<<PKGBUILDDIR>>/src'
make[2]: *** [Makefile:49: sub-src-make_first] Error 2
make[2]: Leaving directory '/<<PKGBUILDDIR>>'
dh_auto_build: error: make -j4 -Onone returned exit code 2
make[1]: *** [debian/rules:152: override_dh_auto_build-arch] Error 25
make[1]: Leaving directory '/<<PKGBUILDDIR>>'
make: *** [debian/rules:56: build-arch] Error 2

Tail of log for mlpack on armhf:

/usr/bin/cmake -E tar xjf digits_test.tar.bz2
/usr/bin/cmake -E tar xjf digits_train_label.tar.bz2
/usr/bin/cmake -E tar xjf digits_test_label.tar.bz2
make[3]: Leaving directory '/<<PKGBUILDDIR>>/obj-arm-linux-gnueabihf'
[ 37%] Built target mlpack_test
[ 37%] Linking CXX executable ../../../../bin/mlpack_cf
cd /<<PKGBUILDDIR>>/obj-arm-linux-gnueabihf/src/mlpack/methods/cf && /usr/bin/cmake -E cmake_link_script CMakeFiles/mlpack_cf.dir/link.txt --verbose=1
/usr/bin/clang++ -g -O2 -ffile-prefix-map=/<<PKGBUILDDIR>>=. -fstack-protector-strong -Wformat -Werror=format-security -Wdate-time -D_FORTIFY_SOURCE=2 -Wall -Wextra -ftemplate-depth=1000 -Wno-unused-function -pthread -g -O0 -ftemplate-backtrace-limit=0 -Wno-unknown-pragmas -Wl,-z,relro -Wl,-z,now -rdynamic CMakeFiles/mlpack_cf.dir/cf_main.cpp.o -o ../../../../bin/mlpack_cf  -Wl,-rpath,/<<PKGBUILDDIR>>/obj-arm-linux-gnueabihf/lib: ../../../../lib/libmlpack.so.3.4 /usr/lib/libarmadillo.so /usr/lib/arm-linux-gnueabihf/libboost_unit_test_framework.so /usr/lib/arm-linux-gnueabihf/libboost_serialization.so -lm 
make[3]: Leaving directory '/<<PKGBUILDDIR>>/obj-arm-linux-gnueabihf'
[ 37%] Built target mlpack_cf
make[2]: Leaving directory '/<<PKGBUILDDIR>>/obj-arm-linux-gnueabihf'
make[1]: *** [Makefile:163: all] Error 2
make[1]: Leaving directory '/<<PKGBUILDDIR>>/obj-arm-linux-gnueabihf'
dh_auto_build: error: cd obj-arm-linux-gnueabihf && make -j4 "INSTALL=install --strip-program=true" VERBOSE=1 returned exit code 2
make: *** [debian/rules:59: binary-arch] Error 25

Tail of log for paraview on armhf:

[  6%] Building CXX object VTK/Common/Core/CMakeFiles/CommonCore.dir/vtkMutexLock.cxx.o
cd /<<PKGBUILDDIR>>/build.python3.9/VTK/Common/Core && /usr/bin/c++ -DCommonCore_EXPORTS -DVTK_MODULE_ENABLE_VTK_loguru=1 -I/<<PKGBUILDDIR>>/build.python3.9/VTK/Common/Core -I/<<PKGBUILDDIR>>/VTK/Common/Core -I/<<PKGBUILDDIR>>/build.python3.9/VTK/Common/Core/../DataModel -I/<<PKGBUILDDIR>>/build.python3.9/VTK/ThirdParty/loguru/vtkloguru -I/<<PKGBUILDDIR>>/VTK/ThirdParty/loguru/vtkloguru -isystem /<<PKGBUILDDIR>>/build.python3.9/VTK/Utilities/KWIML -isystem /<<PKGBUILDDIR>>/VTK/Utilities/KWIML -isystem /<<PKGBUILDDIR>>/build.python3.9/VTK/Utilities/KWSys -isystem /<<PKGBUILDDIR>>/VTK/Utilities/KWSys -isystem /<<PKGBUILDDIR>>/build.python3.9/VTK/ThirdParty/utf8 -isystem /<<PKGBUILDDIR>>/VTK/ThirdParty/utf8 -isystem /<<PKGBUILDDIR>>/build.python3.9/VTK/ThirdParty/loguru -isystem /<<PKGBUILDDIR>>/VTK/ThirdParty/loguru -g -O2 -ffile-prefix-map=/<<PKGBUILDDIR>>=. -fstack-protector-strong -Wformat -Werror=format-security -Wdate-time -D_FORTIFY_SOURCE=2 -Wdate-time -D_FORTIFY_SOURCE=2  -O3 -DNDEBUG -fPIC -fvisibility=hidden -fvisibility-inlines-hidden -std=c++11 -o CMakeFiles/CommonCore.dir/vtkMutexLock.cxx.o -c /<<PKGBUILDDIR>>/VTK/Common/Core/vtkMutexLock.cxx
[  6%] Linking CXX shared library ../../../lib/arm-linux-gnueabihf/libvtkCommonCore-pv5.9.so
cd /<<PKGBUILDDIR>>/build.python3.9/VTK/Common/Core && /usr/bin/cmake -E cmake_link_script CMakeFiles/CommonCore.dir/link.txt --verbose=1
/usr/bin/c++ -fPIC -g -O2 -ffile-prefix-map=/<<PKGBUILDDIR>>=. -fstack-protector-strong -Wformat -Werror=format-security -Wdate-time -D_FORTIFY_SOURCE=2 -Wdate-time -D_FORTIFY_SOURCE=2  -O3 -DNDEBUG  -Wl,-lc -Wl,-z,relro -Wl,--as-needed  -shared -Wl,-soname,libvtkCommonCore-pv5.9.so.1 -o ../../../lib/arm-linux-gnueabihf/libvtkCommonCore-pv5.9.so.5.9 CMakeFiles/CommonCore.dir/vtkArrayIteratorTemplateInstantiate.cxx.o CMakeFiles/CommonCore.dir/vtkGenericDataArray.cxx.o CMakeFiles/CommonCore.dir/vtkSOADataArrayTemplateInstantiate.cxx.o CMakeFiles/CommonCore.dir/SMP/Sequential/vtkSMPTools.cxx.o CMakeFiles/CommonCore.dir/vtkTypeInt8Array.cxx.o CMakeFiles/CommonCore.dir/vtkTypeInt16Array.cxx.o CMakeFiles/CommonCore.dir/vtkTypeInt32Array.cxx.o CMakeFiles/CommonCore.dir/vtkTypeInt64Array.cxx.o CMakeFiles/CommonCore.dir/vtkTypeUInt8Array.cxx.o CMakeFiles/CommonCore.dir/vtkTypeUInt16Array.cxx.o CMakeFiles/CommonCore.dir/vtkTypeUInt32Array.cxx.o CMakeFiles/CommonCore.dir/vtkTypeUInt64Array.cxx.o CMakeFiles/CommonCore.dir/vtkTypeFloat32Array.cxx.o CMakeFiles/CommonCore.dir/vtkTypeFloat64Array.cxx.o CMakeFiles/CommonCore.dir/vtkAbstractArray.cxx.o CMakeFiles/CommonCore.dir/vtkAnimationCue.cxx.o CMakeFiles/CommonCore.dir/vtkArchiver.cxx.o CMakeFiles/CommonCore.dir/vtkArray.cxx.o CMakeFiles/CommonCore.dir/vtkArrayCoordinates.cxx.o CMakeFiles/CommonCore.dir/vtkArrayExtents.cxx.o CMakeFiles/CommonCore.dir/vtkArrayExtentsList.cxx.o CMakeFiles/CommonCore.dir/vtkArrayIterator.cxx.o CMakeFiles/CommonCore.dir/vtkArrayRange.cxx.o CMakeFiles/CommonCore.dir/vtkArraySort.cxx.o CMakeFiles/CommonCore.dir/vtkArrayWeights.cxx.o CMakeFiles/CommonCore.dir/vtkBitArray.cxx.o CMakeFiles/CommonCore.dir/vtkBitArrayIterator.cxx.o CMakeFiles/CommonCore.dir/vtkBoxMuellerRandomSequence.cxx.o CMakeFiles/CommonCore.dir/vtkBreakPoint.cxx.o CMakeFiles/CommonCore.dir/vtkByteSwap.cxx.o CMakeFiles/CommonCore.dir/vtkCallbackCommand.cxx.o CMakeFiles/CommonCore.dir/vtkCharArray.cxx.o CMakeFiles/CommonCore.dir/vtkCollection.cxx.o CMakeFiles/CommonCore.dir/vtkCollectionIterator.cxx.o CMakeFiles/CommonCore.dir/vtkCommand.cxx.o CMakeFiles/CommonCore.dir/vtkCommonInformationKeyManager.cxx.o CMakeFiles/CommonCore.dir/vtkDataArray.cxx.o CMakeFiles/CommonCore.dir/vtkDataArrayCollection.cxx.o CMakeFiles/CommonCore.dir/vtkDataArrayCollectionIterator.cxx.o CMakeFiles/CommonCore.dir/vtkDataArraySelection.cxx.o CMakeFiles/CommonCore.dir/vtkDebugLeaks.cxx.o CMakeFiles/CommonCore.dir/vtkDebugLeaksManager.cxx.o CMakeFiles/CommonCore.dir/vtkDoubleArray.cxx.o CMakeFiles/CommonCore.dir/vtkDynamicLoader.cxx.o CMakeFiles/CommonCore.dir/vtkEventForwarderCommand.cxx.o CMakeFiles/CommonCore.dir/vtkFileOutputWindow.cxx.o CMakeFiles/CommonCore.dir/vtkFloatArray.cxx.o CMakeFiles/CommonCore.dir/vtkFloatingPointExceptions.cxx.o CMakeFiles/CommonCore.dir/vtkGarbageCollector.cxx.o CMakeFiles/CommonCore.dir/vtkGarbageCollectorManager.cxx.o CMakeFiles/CommonCore.dir/vtkGaussianRandomSequence.cxx.o CMakeFiles/CommonCore.dir/vtkIdList.cxx.o CMakeFiles/CommonCore.dir/vtkIdListCollection.cxx.o CMakeFiles/CommonCore.dir/vtkIdTypeArray.cxx.o CMakeFiles/CommonCore.dir/vtkIndent.cxx.o CMakeFiles/CommonCore.dir/vtkInformation.cxx.o CMakeFiles/CommonCore.dir/vtkInformationDataObjectKey.cxx.o CMakeFiles/CommonCore.dir/vtkInformationDoubleKey.cxx.o CMakeFiles/CommonCore.dir/vtkInformationDoubleVectorKey.cxx.o CMakeFiles/CommonCore.dir/vtkInformationIdTypeKey.cxx.o CMakeFiles/CommonCore.dir/vtkInformationInformationKey.cxx.o CMakeFiles/CommonCore.dir/vtkInformationInformationVectorKey.cxx.o CMakeFiles/CommonCore.dir/vtkInformationIntegerKey.cxx.o CMakeFiles/CommonCore.dir/vtkInformationIntegerPointerKey.cxx.o CMakeFiles/CommonCore.dir/vtkInformationIntegerVectorKey.cxx.o CMakeFiles/CommonCore.dir/vtkInformationIterator.cxx.o CMakeFiles/CommonCore.dir/vtkInformationKey.cxx.o CMakeFiles/CommonCore.dir/vtkInformationKeyLookup.cxx.o CMakeFiles/CommonCore.dir/vtkInformationKeyVectorKey.cxx.o CMakeFiles/CommonCore.dir/vtkInformationObjectBaseKey.cxx.o CMakeFiles/CommonCore.dir/vtkInformationObjectBaseVectorKey.cxx.o CMakeFiles/CommonCore.dir/vtkInformationRequestKey.cxx.o CMakeFiles/CommonCore.dir/vtkInformationStringKey.cxx.o CMakeFiles/CommonCore.dir/vtkInformationStringVectorKey.cxx.o CMakeFiles/CommonCore.dir/vtkInformationUnsignedLongKey.cxx.o CMakeFiles/CommonCore.dir/vtkInformationVariantKey.cxx.o CMakeFiles/CommonCore.dir/vtkInformationVariantVectorKey.cxx.o CMakeFiles/CommonCore.dir/vtkInformationVector.cxx.o CMakeFiles/CommonCore.dir/vtkIntArray.cxx.o CMakeFiles/CommonCore.dir/vtkLargeInteger.cxx.o CMakeFiles/CommonCore.dir/vtkLogger.cxx.o CMakeFiles/CommonCore.dir/vtkLongArray.cxx.o CMakeFiles/CommonCore.dir/vtkLongLongArray.cxx.o CMakeFiles/CommonCore.dir/vtkLookupTable.cxx.o CMakeFiles/CommonCore.dir/vtkMath.cxx.o CMakeFiles/CommonCore.dir/vtkMersenneTwister.cxx.o CMakeFiles/CommonCore.dir/vtkMinimalStandardRandomSequence.cxx.o CMakeFiles/CommonCore.dir/vtkMultiThreader.cxx.o CMakeFiles/CommonCore.dir/vtkOStrStreamWrapper.cxx.o CMakeFiles/CommonCore.dir/vtkOStreamWrapper.cxx.o CMakeFiles/CommonCore.dir/vtkObject.cxx.o CMakeFiles/CommonCore.dir/vtkObjectBase.cxx.o CMakeFiles/CommonCore.dir/vtkObjectFactory.cxx.o CMakeFiles/CommonCore.dir/vtkObjectFactoryCollection.cxx.o CMakeFiles/CommonCore.dir/vtkOldStyleCallbackCommand.cxx.o CMakeFiles/CommonCore.dir/vtkOutputWindow.cxx.o CMakeFiles/CommonCore.dir/vtkOverrideInformation.cxx.o CMakeFiles/CommonCore.dir/vtkOverrideInformationCollection.cxx.o CMakeFiles/CommonCore.dir/vtkPoints.cxx.o CMakeFiles/CommonCore.dir/vtkPoints2D.cxx.o CMakeFiles/CommonCore.dir/vtkPriorityQueue.cxx.o CMakeFiles/CommonCore.dir/vtkRandomPool.cxx.o CMakeFiles/CommonCore.dir/vtkRandomSequence.cxx.o CMakeFiles/CommonCore.dir/vtkReferenceCount.cxx.o CMakeFiles/CommonCore.dir/vtkScalarsToColors.cxx.o CMakeFiles/CommonCore.dir/vtkShortArray.cxx.o CMakeFiles/CommonCore.dir/vtkSignedCharArray.cxx.o CMakeFiles/CommonCore.dir/vtkSmartPointerBase.cxx.o CMakeFiles/CommonCore.dir/vtkSortDataArray.cxx.o CMakeFiles/CommonCore.dir/vtkStdString.cxx.o CMakeFiles/CommonCore.dir/vtkStringArray.cxx.o CMakeFiles/CommonCore.dir/vtkStringOutputWindow.cxx.o CMakeFiles/CommonCore.dir/vtkTimePointUtility.cxx.o CMakeFiles/CommonCore.dir/vtkTimeStamp.cxx.o CMakeFiles/CommonCore.dir/vtkUnicodeString.cxx.o CMakeFiles/CommonCore.dir/vtkUnicodeStringArray.cxx.o CMakeFiles/CommonCore.dir/vtkUnsignedCharArray.cxx.o CMakeFiles/CommonCore.dir/vtkUnsignedIntArray.cxx.o CMakeFiles/CommonCore.dir/vtkUnsignedLongArray.cxx.o CMakeFiles/CommonCore.dir/vtkUnsignedLongLongArray.cxx.o CMakeFiles/CommonCore.dir/vtkUnsignedShortArray.cxx.o CMakeFiles/CommonCore.dir/vtkVariant.cxx.o CMakeFiles/CommonCore.dir/vtkVariantArray.cxx.o CMakeFiles/CommonCore.dir/vtkVersion.cxx.o CMakeFiles/CommonCore.dir/vtkVoidArray.cxx.o CMakeFiles/CommonCore.dir/vtkWeakPointerBase.cxx.o CMakeFiles/CommonCore.dir/vtkWeakReference.cxx.o CMakeFiles/CommonCore.dir/vtkWindow.cxx.o CMakeFiles/CommonCore.dir/vtkXMLFileOutputWindow.cxx.o CMakeFiles/CommonCore.dir/vtkConditionVariable.cxx.o CMakeFiles/CommonCore.dir/vtkCriticalSection.cxx.o CMakeFiles/CommonCore.dir/vtkSimpleCriticalSection.cxx.o CMakeFiles/CommonCore.dir/vtkMutexLock.cxx.o  -Wl,-rpath,/<<PKGBUILDDIR>>/build.python3.9/lib/arm-linux-gnueabihf: ../../../lib/arm-linux-gnueabihf/libvtksys-pv5.9.so.5.9 ../../../lib/arm-linux-gnueabihf/libvtkloguru-pv5.9.so.5.9 -ldl -lpthread 
cd /<<PKGBUILDDIR>>/build.python3.9/VTK/Common/Core && /usr/bin/cmake -E cmake_symlink_library ../../../lib/arm-linux-gnueabihf/libvtkCommonCore-pv5.9.so.5.9 ../../../lib/arm-linux-gnueabihf/libvtkCommonCore-pv5.9.so.1 ../../../lib/arm-linux-gnueabihf/libvtkCommonCore-pv5.9.so
make[4]: Leaving directory '/<<PKGBUILDDIR>>/build.python3.9'
[  6%] Built target CommonCore
make[3]: Leaving directory '/<<PKGBUILDDIR>>/build.python3.9'
make[2]: *** [Makefile:163: all] Error 2
make[2]: Leaving directory '/<<PKGBUILDDIR>>/build.python3.9'
dh_auto_build: error: cd build.python3.9 && make -j4 "INSTALL=install --strip-program=true" VERBOSE=1 returned exit code 2
make[1]: *** [debian/rules:95: my_build_python3.9] Error 25
make[1]: Leaving directory '/<<PKGBUILDDIR>>'
make: *** [debian/rules:8: build-arch] Error 2

Tail of log for siconos on armhf:

 6518 |     npy_intp this_vector_dim[1] = { v.size() };
      |                                     ~~~~~~^~
/<<BUILDDIR>>/siconos-4.3.1+dfsg/obj-arm-linux-gnueabihf/wrap/siconos/kernelPYTHON_wrap.cxx: In function 'PyObject* SP_SiconosVector_to_numpy(SP::SiconosVector)':
/<<BUILDDIR>>/siconos-4.3.1+dfsg/obj-arm-linux-gnueabihf/wrap/siconos/kernelPYTHON_wrap.cxx:6528:44: warning: narrowing conversion of '((std::__shared_ptr_access<SiconosVector, __gnu_cxx::_S_mutex, false, false>*)(& v))->std::__shared_ptr_access<SiconosVector, __gnu_cxx::_S_mutex, false, false>::operator->()->SiconosVector::size()' from 'unsigned int' to 'npy_intp' {aka 'int'} [-Wnarrowing]
 6528 |     npy_intp this_vector_dim[1] = { v->size() };
      |                                     ~~~~~~~^~
virtual memory exhausted: Cannot allocate memory
make[3]: *** [kernel/swig/CMakeFiles/_kernel.dir/build.make:85: kernel/swig/CMakeFiles/_kernel.dir/__/__/wrap/siconos/kernelPYTHON_wrap.cxx.o] Error 1
make[3]: Leaving directory '/<<BUILDDIR>>/siconos-4.3.1+dfsg/obj-arm-linux-gnueabihf'
make[2]: *** [CMakeFiles/Makefile2:6035: kernel/swig/CMakeFiles/_kernel.dir/all] Error 2
make[2]: Leaving directory '/<<BUILDDIR>>/siconos-4.3.1+dfsg/obj-arm-linux-gnueabihf'
make[1]: *** [Makefile:163: all] Error 2
make[1]: Leaving directory '/<<BUILDDIR>>/siconos-4.3.1+dfsg/obj-arm-linux-gnueabihf'
dh_auto_build: error: cd obj-arm-linux-gnueabihf && make -j1 "INSTALL=install --strip-program=true" VERBOSE=1 returned exit code 2
make: *** [debian/rules:49: binary-arch] Error 25

Tail of log for openstructure on armhf:

----------------------------------------------------------------------
Ran 2 tests in 17.223s

OK (skipped=1)
Could not find NACCESS, could not compare Accessiblity function...
make[4]: Leaving directory '/<<PKGBUILDDIR>>/obj-arm-linux-gnueabihf'
[100%] Built target test_accessibility.py_run
.
----------------------------------------------------------------------
Ran 2 tests in 123.139s

OK
Could not find CAD score classic executables: ignoring unit tests
make[4]: Leaving directory '/<<PKGBUILDDIR>>/obj-arm-linux-gnueabihf'
[100%] Built target test_cadscore.py_run

Tail of log for iem-plugin-suite on armhf:

                 from ../../JuceLibraryCode/../JuceLibraryCode/JuceHeader.h:17,
                 from ../../../resources/Standalone/StandaloneApp.cpp:53:
/usr/share/juce/modules/juce_core/memory/juce_Atomic.h: In instantiation of 'juce::Atomic<Type>::~Atomic() [with Type = bool]':
../../JuceLibraryCode/../Source/../../resources/OSC/OSCUtilities.h:33:5:   required from here
/usr/share/juce/modules/juce_core/memory/juce_Atomic.h:58:43: error: static assertion failed: This class can only be used for lock-free types
   58 |         static_assert (std::atomic<Type>::is_always_lock_free,
      |                                           ^~~~~~~~~~~~~~~~~~~
make[3]: *** [Makefile:179: build/intermediate/Release/StandaloneApp_2a979640.o] Error 1
make[3]: Leaving directory '/<<PKGBUILDDIR>>/RoomEncoder/Builds/LinuxMakefile'
make[2]: *** [Makefile:125: RoomEncoder-LinuxMakefile-build] Error 2
make[2]: Leaving directory '/<<PKGBUILDDIR>>'
dh_auto_build: error: make -j1 "INSTALL=install --strip-program=true" returned exit code 2
make[1]: *** [debian/rules:42: override_dh_auto_build] Error 25
make[1]: Leaving directory '/<<PKGBUILDDIR>>'
make: *** [debian/rules:39: binary-arch] Error 2

Tail of log for kodi on armhf:

dh_clean \
	addons/skin.estuary/media/from-debian-logo.png \
	addons/webinterface.default/ \
	debian/dh-addon/*.1 \
	kodi_build_*/ \
	lib/gtest/ \
	media/Fonts/arial.ttf
make[1]: Leaving directory '/<<BUILDDIR>>/kodi-19.0+dfsg1'
 debian/rules binary-arch
dh binary-arch --buildsystem cmake --with python3
   dh_update_autotools_config -a -O--buildsystem=cmake
   dh_autoreconf -a -O--buildsystem=cmake
   debian/rules override_dh_auto_configure
make[1]: Entering directory '/<<BUILDDIR>>/kodi-19.0+dfsg1'
rsvg-convert -w 250 -h 82 -o addons/skin.estuary/media/from-debian-logo.png debian/from-debian-logo.svg

Tail of log for nextpnr on armhf:

 1198 |    _M_realloc_insert(end(), __x);
      |    ~~~~~~~~~~~~~~~~~^~~~~~~~~~~~
/usr/include/c++/10/bits/stl_vector.h:1198:21: note: parameter passing for argument of type '__gnu_cxx::__normal_iterator<nextpnr_ice40::SDF::Interconnect*, std::vector<nextpnr_ice40::SDF::Interconnect> >' changed in GCC 7.1
 1198 |    _M_realloc_insert(end(), __x);
      |    ~~~~~~~~~~~~~~~~~^~~~~~~~~~~~
[ 45%] Building CXX object CMakeFiles/nextpnr-ice40-test.dir/common/svg.cc.o
[ 46%] Building CXX object CMakeFiles/nextpnr-ice40-test.dir/common/timing.cc.o
make[4]: *** wait: No child processes.  Stop.
make[4]: *** Waiting for unfinished jobs....
make[4]: *** wait: No child processes.  Stop.
make[3]: *** [CMakeFiles/Makefile2:249: CMakeFiles/nextpnr-ice40-test.dir/all] Error 2
E: Caught signal ‘Terminated’: terminating immediately
make: *** [debian/rules:21: binary-arch] Terminated
make[2]: *** [Makefile:160: all] Terminated
make[1]: *** [debian/rules:73: build-ice40] Terminated

Tail of log for sagemath on armhf:

sage -t --long --random-seed=0 src/sage/tests/books/computational-mathematics-with-sagemath/linalg_doctest.py  # 1 doctest failed
sage -t --long --random-seed=0 src/sage/tests/books/computational-mathematics-with-sagemath/mpoly_doctest.py  # Timed out
sage -t --long --random-seed=0 src/sage/tests/books/judson-abstract-algebra/galois-sage.py  # 1 doctest failed
----------------------------------------------------------------------
Total time for all tests: 203190.7 seconds
    cpu time: 7416.3 seconds
    cumulative wall time: 8180.0 seconds
make[2]: Entering directory '/<<PKGBUILDDIR>>'
Success: 195 tests failed, up to 200 failures are tolerated
Error: critical test failures (e.g. timeout, segfault, etc.)
make[2]: *** [debian/rules:166: had-few-failures] Error 1
make[2]: Leaving directory '/<<PKGBUILDDIR>>'
make[1]: *** [debian/rules:202: override_dh_auto_test-arch] Error 2
make[1]: Leaving directory '/<<PKGBUILDDIR>>'
make: *** [debian/rules:40: binary-arch] Error 2

Tail of log for libgrokj2k on armhf:

/usr/bin/ld: ../../../bin/libgrokj2k.so.7.6.6: undefined reference to `__atomic_fetch_add_8'
collect2: error: ld returned 1 exit status
make[3]: *** [src/bin/jp2/CMakeFiles/grk_compress.dir/build.make:418: bin/grk_compress] Error 1
make[3]: Leaving directory '/<<PKGBUILDDIR>>/obj-arm-linux-gnueabihf'
make[2]: *** [CMakeFiles/Makefile2:342: src/bin/jp2/CMakeFiles/grk_compress.dir/all] Error 2
/usr/bin/ld: ../../../bin/libgrokj2k.so.7.6.6: undefined reference to `__atomic_fetch_add_8'
collect2: error: ld returned 1 exit status
make[3]: *** [src/bin/jp2/CMakeFiles/grk_decompress.dir/build.make:418: bin/grk_decompress] Error 1
make[3]: Leaving directory '/<<PKGBUILDDIR>>/obj-arm-linux-gnueabihf'
make[2]: *** [CMakeFiles/Makefile2:369: src/bin/jp2/CMakeFiles/grk_decompress.dir/all] Error 2
make[2]: Leaving directory '/<<PKGBUILDDIR>>/obj-arm-linux-gnueabihf'
make[1]: *** [Makefile:174: all] Error 2
make[1]: Leaving directory '/<<PKGBUILDDIR>>/obj-arm-linux-gnueabihf'
dh_auto_build: error: cd obj-arm-linux-gnueabihf && make -j4 "INSTALL=install --strip-program=true" VERBOSE=1 returned exit code 2
make: *** [debian/rules:14: binary-arch] Error 25

Tail of log for guix on armhf:

============================================================================
make[6]: *** [Makefile:5390: test-suite.log] Error 1
make[6]: Leaving directory '/<<PKGBUILDDIR>>'
make[5]: *** [Makefile:5498: check-TESTS] Error 2
make[5]: Leaving directory '/<<PKGBUILDDIR>>'
make[4]: *** [Makefile:5747: check-am] Error 2
make[4]: Leaving directory '/<<PKGBUILDDIR>>'
make[3]: *** [Makefile:5275: check-recursive] Error 1
make[3]: Leaving directory '/<<PKGBUILDDIR>>'
make[2]: *** [Makefile:5749: check] Error 2
make[2]: Leaving directory '/<<PKGBUILDDIR>>'
dh_auto_test: error: make -j1 check VERBOSE=1 RES_OPTIONS=attempts:0 AM_SCM_LOG_DRIVER_FLAGS=--brief=no returned exit code 2
make[1]: *** [debian/rules:33: override_dh_auto_test] Error 25
make[1]: Leaving directory '/<<PKGBUILDDIR>>'
make: *** [debian/rules:19: binary-arch] Error 2

Tail of log for libdnf on armhf:

4/4 Test #4: test_python ......................   Passed    7.17 sec

75% tests passed, 1 tests failed out of 4

Total Test time (real) =   7.21 sec

The following tests FAILED:
	  3 - test_libdnf_main (Child aborted)
Errors while running CTest
make[2]: *** [Makefile:152: test] Error 8
make[2]: Leaving directory '/<<PKGBUILDDIR>>/build'
dh_auto_test: error: cd build && make -j4 test ARGS=-V ARGS\+=-j4 returned exit code 2
make[1]: *** [debian/rules:48: override_dh_auto_test] Error 25
make[1]: Leaving directory '/<<PKGBUILDDIR>>'
make: *** [debian/rules:11: build-arch] Error 2