Raspbian Package Auto-Building

Buildd status for appstream-generator (bookworm-staging)

Debian PTSTrackerChangelogBugspackages.d.obuildd.d.o

Package(s): Suite:
Compact mode Co-maintainers

ArchitectureVersionStatusForBuilddStateMiscLogs
Buildd exposure stats armhf  0.8.5-1Build-Attempted11d 13h 19mbm-wb-01uncompiledmisc:optionalold | all (1)

Tail of log for appstream-generator on armhf:

      |                                                                                     ^
[59/150] gdc -Isrc/asgen/appstream-generator.p -Isrc/asgen -I../src/asgen -Isrc -I../src -Igirepo -I../girepo -I/usr/include/d/glibd-2 -I/usr/include/libmount -I/usr/include/blkid -I/usr/include/glib-2.0 -I/usr/lib/arm-linux-gnueabihf/glib-2.0/include -I/usr/include/appstream -I/usr/include/appstream-compose -I/usr/include/gdk-pixbuf-2.0 -I/usr/include/libpng16 -I/usr/include/arm-linux-gnueabihf -Wall -Wdeprecated -g -O2 -ffile-prefix-map=/<<PKGBUILDDIR>>=. -fstack-protector-strong -frelease -pthread -pthread -pthread -J../src/asgen/../../data -Jsrc/asgen/../../data -MD -MQ src/asgen/appstream-generator.p/datainjectpkg.d.o -MF src/asgen/appstream-generator.p/datainjectpkg.d.o.deps -o src/asgen/appstream-generator.p/datainjectpkg.d.o -c ../src/asgen/datainjectpkg.d
FAILED: src/asgen/appstream-generator.p/datainjectpkg.d.o 
gdc -Isrc/asgen/appstream-generator.p -Isrc/asgen -I../src/asgen -Isrc -I../src -Igirepo -I../girepo -I/usr/include/d/glibd-2 -I/usr/include/libmount -I/usr/include/blkid -I/usr/include/glib-2.0 -I/usr/lib/arm-linux-gnueabihf/glib-2.0/include -I/usr/include/appstream -I/usr/include/appstream-compose -I/usr/include/gdk-pixbuf-2.0 -I/usr/include/libpng16 -I/usr/include/arm-linux-gnueabihf -Wall -Wdeprecated -g -O2 -ffile-prefix-map=/<<PKGBUILDDIR>>=. -fstack-protector-strong -frelease -pthread -pthread -pthread -J../src/asgen/../../data -Jsrc/asgen/../../data -MD -MQ src/asgen/appstream-generator.p/datainjectpkg.d.o -MF src/asgen/appstream-generator.p/datainjectpkg.d.o.deps -o src/asgen/appstream-generator.p/datainjectpkg.d.o -c ../src/asgen/datainjectpkg.d
../src/asgen/datainjectpkg.d:93:23: error: template std.range.primitives.empty cannot deduce function from argument types !()(string[string]), candidates are:
   93 |         if (!_contents.empty)
      |                       ^
/usr/lib/gcc/arm-linux-gnueabihf/10/include/d/std/range/primitives.d:2012:16: note: std.range.primitives.empty(T)(in T[] a)
 2012 | @property bool empty(T)(in T[] a) @safe pure nothrow @nogc
      |                ^
[60/150] gdc -Isrc/asgen/appstream-generator.p -Isrc/asgen -I../src/asgen -Isrc -I../src -Igirepo -I../girepo -I/usr/include/d/glibd-2 -I/usr/include/libmount -I/usr/include/blkid -I/usr/include/glib-2.0 -I/usr/lib/arm-linux-gnueabihf/glib-2.0/include -I/usr/include/appstream -I/usr/include/appstream-compose -I/usr/include/gdk-pixbuf-2.0 -I/usr/include/libpng16 -I/usr/include/arm-linux-gnueabihf -Wall -Wdeprecated -g -O2 -ffile-prefix-map=/<<PKGBUILDDIR>>=. -fstack-protector-strong -frelease -pthread -pthread -pthread -J../src/asgen/../../data -Jsrc/asgen/../../data -MD -MQ src/asgen/appstream-generator.p/.._app.d.o -MF src/asgen/appstream-generator.p/.._app.d.o.deps -o src/asgen/appstream-generator.p/.._app.d.o -c ../src/app.d
[61/150] gdc -Isrc/asgen/appstream-generator.p -Isrc/asgen -I../src/asgen -Isrc -I../src -Igirepo -I../girepo -I/usr/include/d/glibd-2 -I/usr/include/libmount -I/usr/include/blkid -I/usr/include/glib-2.0 -I/usr/lib/arm-linux-gnueabihf/glib-2.0/include -I/usr/include/appstream -I/usr/include/appstream-compose -I/usr/include/gdk-pixbuf-2.0 -I/usr/include/libpng16 -I/usr/include/arm-linux-gnueabihf -Wall -Wdeprecated -g -O2 -ffile-prefix-map=/<<PKGBUILDDIR>>=. -fstack-protector-strong -frelease -pthread -pthread -pthread -J../src/asgen/../../data -Jsrc/asgen/../../data -MD -MQ src/asgen/appstream-generator.p/contentsstore.d.o -MF src/asgen/appstream-generator.p/contentsstore.d.o.deps -o src/asgen/appstream-generator.p/contentsstore.d.o -c ../src/asgen/contentsstore.d
ninja: build stopped: subcommand failed.
dh_auto_build: error: cd obj-arm-linux-gnueabihf && LC_ALL=C.UTF-8 ninja -j4 -v returned exit code 1
make: *** [debian/rules:18: binary-arch] Error 25