Raspbian Package Auto-Building

Buildd status for abiword (stretch-staging)

Debian PTSTrackerChangelogBugspackages.d.obuildd.d.o

Package(s): Suite:
Compact mode Co-maintainers

ArchitectureVersionStatusForBuilddStateMiscLogs
Buildd exposure stats armhf  3.0.2-2+deb9u2Build-Attempted2163d 3h 37mtestbuilddout-of-dateeditors:sourceold | all (4)

Tail of log for abiword on armhf:

make[4]: *** [check-recursive] Terminated
Makefile:1067: recipe for target 'check-am' failed
make[6]: *** [check-am] Error 2
Makefile:1169: recipe for target 'check-recursive' failed
make[3]: *** [check-recursive] Terminated
Makefile:781: recipe for target 'check-recursive' failed
make[2]: *** [check-recursive] Terminated
debian/rules:72: recipe for target 'override_dh_auto_test' failed
make[1]: [override_dh_auto_test] Terminated (ignored)
debian/rules:32: recipe for target 'build-arch' failed
make: *** [build-arch] Terminated
make[8]: *** wait: No child processes.  Stop.
make[8]: *** Waiting for unfinished jobs....
make[8]: *** wait: No child processes.  Stop.
E: Build killed with signal TERM after 1500 minutes of inactivity