Raspbian Package Auto-Building

Build log for yp-tools (3.3-1) on armhf

yp-tools3.3-1armhf → 2016-02-06 11:40:16

sbuild (Debian sbuild) 0.66.0 (04 Oct 2015) on bm-wb-03

+==============================================================================+
| yp-tools 3.3-1 (armhf)                                     06 Feb 2016 11:35 |
+==============================================================================+

Package: yp-tools
Version: 3.3-1
Source Version: 3.3-1
Distribution: stretch-staging
Machine Architecture: armhf
Host Architecture: armhf
Build Architecture: armhf

I: NOTICE: Log filtering will replace 'build/yp-tools-XFxoQY/yp-tools-3.3' with '<<PKGBUILDDIR>>'
I: NOTICE: Log filtering will replace 'build/yp-tools-XFxoQY' with '<<BUILDDIR>>'
I: NOTICE: Log filtering will replace 'var/lib/schroot/mount/stretch-staging-armhf-sbuild-1aded32b-cfe9-4e49-bba2-70f83d889cdf' with '<<CHROOT>>'

+------------------------------------------------------------------------------+
| Update chroot                                                                |
+------------------------------------------------------------------------------+

Get:1 http://172.17.0.1/private stretch-staging InRelease [11.3 kB]
Get:2 http://172.17.0.1/private stretch-staging/main Sources [8666 kB]
Get:3 http://172.17.0.1/private stretch-staging/main armhf Packages [10.7 MB]
Fetched 19.4 MB in 21s (884 kB/s)
Reading package lists...
W: No sandbox user '_apt' on the system, can not drop privileges

+------------------------------------------------------------------------------+
| Fetch source files                                                           |
+------------------------------------------------------------------------------+


Check APT
---------

Checking available source versions...

Download source files with APT
------------------------------

Reading package lists...
Building dependency tree...
Reading state information...
Need to get 416 kB of source archives.
Get:1 http://172.17.0.1/private stretch-staging/main yp-tools 3.3-1 (dsc) [1462 B]
Get:2 http://172.17.0.1/private stretch-staging/main yp-tools 3.3-1 (tar) [411 kB]
Get:3 http://172.17.0.1/private stretch-staging/main yp-tools 3.3-1 (diff) [3760 B]
Fetched 416 kB in 0s (4428 kB/s)
Download complete and in download only mode

Check architectures
-------------------


Check dependencies
------------------

Merged Build-Depends: build-essential, fakeroot
Filtered Build-Depends: build-essential, fakeroot
dpkg-deb: building package 'sbuild-build-depends-core-dummy' in '/<<BUILDDIR>>/resolver-ElGpBM/apt_archive/sbuild-build-depends-core-dummy.deb'.
OK
Get:1 file:/<<BUILDDIR>>/resolver-ElGpBM/apt_archive ./ InRelease
Ign:1 file:/<<BUILDDIR>>/resolver-ElGpBM/apt_archive ./ InRelease
Get:2 file:/<<BUILDDIR>>/resolver-ElGpBM/apt_archive ./ Release [2119 B]
Get:2 file:/<<BUILDDIR>>/resolver-ElGpBM/apt_archive ./ Release [2119 B]
Get:3 file:/<<BUILDDIR>>/resolver-ElGpBM/apt_archive ./ Release.gpg [299 B]
Get:3 file:/<<BUILDDIR>>/resolver-ElGpBM/apt_archive ./ Release.gpg [299 B]
Get:4 file:/<<BUILDDIR>>/resolver-ElGpBM/apt_archive ./ Sources [214 B]
Get:5 file:/<<BUILDDIR>>/resolver-ElGpBM/apt_archive ./ Packages [527 B]
Reading package lists...
W: No sandbox user '_apt' on the system, can not drop privileges
Reading package lists...

+------------------------------------------------------------------------------+
| Install core build dependencies (apt-based resolver)                         |
+------------------------------------------------------------------------------+

Installing build dependencies
Reading package lists...
Building dependency tree...
Reading state information...
The following NEW packages will be installed:
  sbuild-build-depends-core-dummy
0 upgraded, 1 newly installed, 0 to remove and 0 not upgraded.
Need to get 0 B/768 B of archives.
After this operation, 0 B of additional disk space will be used.
Get:1 file:/<<BUILDDIR>>/resolver-ElGpBM/apt_archive ./ sbuild-build-depends-core-dummy 0.invalid.0 [768 B]
debconf: delaying package configuration, since apt-utils is not installed
Selecting previously unselected package sbuild-build-depends-core-dummy.
(Reading database ... 
(Reading database ... 5%
(Reading database ... 10%
(Reading database ... 15%
(Reading database ... 20%
(Reading database ... 25%
(Reading database ... 30%
(Reading database ... 35%
(Reading database ... 40%
(Reading database ... 45%
(Reading database ... 50%
(Reading database ... 55%
(Reading database ... 60%
(Reading database ... 65%
(Reading database ... 70%
(Reading database ... 75%
(Reading database ... 80%
(Reading database ... 85%
(Reading database ... 90%
(Reading database ... 95%
(Reading database ... 100%
(Reading database ... 12662 files and directories currently installed.)
Preparing to unpack .../sbuild-build-depends-core-dummy.deb ...
Unpacking sbuild-build-depends-core-dummy (0.invalid.0) ...
Setting up sbuild-build-depends-core-dummy (0.invalid.0) ...
W: No sandbox user '_apt' on the system, can not drop privileges
Merged Build-Depends: debhelper (>= 9), autotools-dev, pkg-config, libtirpc-dev
Filtered Build-Depends: debhelper (>= 9), autotools-dev, pkg-config, libtirpc-dev
dpkg-deb: building package 'sbuild-build-depends-yp-tools-dummy' in '/<<BUILDDIR>>/resolver-MUq_Mx/apt_archive/sbuild-build-depends-yp-tools-dummy.deb'.
OK
Get:1 file:/<<BUILDDIR>>/resolver-MUq_Mx/apt_archive ./ InRelease
Ign:1 file:/<<BUILDDIR>>/resolver-MUq_Mx/apt_archive ./ InRelease
Get:2 file:/<<BUILDDIR>>/resolver-MUq_Mx/apt_archive ./ Release [2119 B]
Get:2 file:/<<BUILDDIR>>/resolver-MUq_Mx/apt_archive ./ Release [2119 B]
Get:3 file:/<<BUILDDIR>>/resolver-MUq_Mx/apt_archive ./ Release.gpg [299 B]
Get:3 file:/<<BUILDDIR>>/resolver-MUq_Mx/apt_archive ./ Release.gpg [299 B]
Get:4 file:/<<BUILDDIR>>/resolver-MUq_Mx/apt_archive ./ Sources [234 B]
Get:5 file:/<<BUILDDIR>>/resolver-MUq_Mx/apt_archive ./ Packages [549 B]
Reading package lists...
W: No sandbox user '_apt' on the system, can not drop privileges
Reading package lists...

+------------------------------------------------------------------------------+
| Install yp-tools build dependencies (apt-based resolver)                     |
+------------------------------------------------------------------------------+

Installing build dependencies
Reading package lists...
Building dependency tree...
Reading state information...
The following additional packages will be installed:
  autotools-dev bsdmainutils debhelper dh-strip-nondeterminism file gettext
  gettext-base groff-base intltool-debian libarchive-zip-perl libcroco3
  libffi6 libfile-stripnondeterminism-perl libglib2.0-0 libgssapi-krb5-2
  libicu55 libk5crypto3 libkeyutils1 libkrb5-3 libkrb5support0 libmagic1
  libpipeline1 libtimedate-perl libtirpc-dev libtirpc1 libunistring0 libxml2
  man-db pkg-config po-debconf
Suggested packages:
  wamerican | wordlist whois vacation dh-make gettext-doc autopoint
  libasprintf-dev libgettextpo-dev groff krb5-doc krb5-user less www-browser
  libmail-box-perl
Recommended packages:
  curl | wget | lynx-cur libglib2.0-data shared-mime-info xdg-user-dirs
  krb5-locales xml-core libmail-sendmail-perl
The following NEW packages will be installed:
  autotools-dev bsdmainutils debhelper dh-strip-nondeterminism file gettext
  gettext-base groff-base intltool-debian libarchive-zip-perl libcroco3
  libffi6 libfile-stripnondeterminism-perl libglib2.0-0 libgssapi-krb5-2
  libicu55 libk5crypto3 libkeyutils1 libkrb5-3 libkrb5support0 libmagic1
  libpipeline1 libtimedate-perl libtirpc-dev libtirpc1 libunistring0 libxml2
  man-db pkg-config po-debconf sbuild-build-depends-yp-tools-dummy
0 upgraded, 31 newly installed, 0 to remove and 0 not upgraded.
Need to get 17.3 MB/17.3 MB of archives.
After this operation, 60.2 MB of additional disk space will be used.
Get:1 file:/<<BUILDDIR>>/resolver-MUq_Mx/apt_archive ./ sbuild-build-depends-yp-tools-dummy 0.invalid.0 [786 B]
Get:2 http://172.17.0.1/private stretch-staging/main armhf groff-base armhf 1.22.3-7 [1083 kB]
Get:3 http://172.17.0.1/private stretch-staging/main armhf bsdmainutils armhf 9.0.6 [177 kB]
Get:4 http://172.17.0.1/private stretch-staging/main armhf libpipeline1 armhf 1.4.1-2 [23.7 kB]
Get:5 http://172.17.0.1/private stretch-staging/main armhf man-db armhf 2.7.5-1 [975 kB]
Get:6 http://172.17.0.1/private stretch-staging/main armhf libkeyutils1 armhf 1.5.9-8 [11.5 kB]
Get:7 http://172.17.0.1/private stretch-staging/main armhf libkrb5support0 armhf 1.13.2+dfsg-4+b1 [56.5 kB]
Get:8 http://172.17.0.1/private stretch-staging/main armhf libk5crypto3 armhf 1.13.2+dfsg-4+b1 [110 kB]
Get:9 http://172.17.0.1/private stretch-staging/main armhf libkrb5-3 armhf 1.13.2+dfsg-4+b1 [261 kB]
Get:10 http://172.17.0.1/private stretch-staging/main armhf libgssapi-krb5-2 armhf 1.13.2+dfsg-4+b1 [129 kB]
Get:11 http://172.17.0.1/private stretch-staging/main armhf libtirpc1 armhf 0.2.5-1 [67.3 kB]
Get:12 http://172.17.0.1/private stretch-staging/main armhf libunistring0 armhf 0.9.3-5.2 [253 kB]
Get:13 http://172.17.0.1/private stretch-staging/main armhf libmagic1 armhf 1:5.25-2 [250 kB]
Get:14 http://172.17.0.1/private stretch-staging/main armhf file armhf 1:5.25-2 [61.2 kB]
Get:15 http://172.17.0.1/private stretch-staging/main armhf gettext-base armhf 0.19.7-2 [111 kB]
Get:16 http://172.17.0.1/private stretch-staging/main armhf libicu55 armhf 55.1-7 [7380 kB]
Get:17 http://172.17.0.1/private stretch-staging/main armhf libxml2 armhf 2.9.3+dfsg1-1 [800 kB]
Get:18 http://172.17.0.1/private stretch-staging/main armhf autotools-dev all 20150820.1 [71.7 kB]
Get:19 http://172.17.0.1/private stretch-staging/main armhf libffi6 armhf 3.2.1-4 [18.5 kB]
Get:20 http://172.17.0.1/private stretch-staging/main armhf libglib2.0-0 armhf 2.46.2-3 [2482 kB]
Get:21 http://172.17.0.1/private stretch-staging/main armhf libcroco3 armhf 0.6.11-1 [131 kB]
Get:22 http://172.17.0.1/private stretch-staging/main armhf gettext armhf 0.19.7-2 [1400 kB]
Get:23 http://172.17.0.1/private stretch-staging/main armhf intltool-debian all 0.35.0+20060710.4 [26.3 kB]
Get:24 http://172.17.0.1/private stretch-staging/main armhf po-debconf all 1.0.19 [249 kB]
Get:25 http://172.17.0.1/private stretch-staging/main armhf libarchive-zip-perl all 1.56-2 [94.9 kB]
Get:26 http://172.17.0.1/private stretch-staging/main armhf libfile-stripnondeterminism-perl all 0.015-1 [11.0 kB]
Get:27 http://172.17.0.1/private stretch-staging/main armhf libtimedate-perl all 2.3000-2 [42.2 kB]
Get:28 http://172.17.0.1/private stretch-staging/main armhf dh-strip-nondeterminism all 0.015-1 [6810 B]
Get:29 http://172.17.0.1/private stretch-staging/main armhf debhelper all 9.20160115 [827 kB]
Get:30 http://172.17.0.1/private stretch-staging/main armhf pkg-config armhf 0.29-3 [59.0 kB]
Get:31 http://172.17.0.1/private stretch-staging/main armhf libtirpc-dev armhf 0.2.5-1 [144 kB]
debconf: delaying package configuration, since apt-utils is not installed
Fetched 17.3 MB in 2s (8358 kB/s)
Selecting previously unselected package groff-base.
(Reading database ... 
(Reading database ... 5%
(Reading database ... 10%
(Reading database ... 15%
(Reading database ... 20%
(Reading database ... 25%
(Reading database ... 30%
(Reading database ... 35%
(Reading database ... 40%
(Reading database ... 45%
(Reading database ... 50%
(Reading database ... 55%
(Reading database ... 60%
(Reading database ... 65%
(Reading database ... 70%
(Reading database ... 75%
(Reading database ... 80%
(Reading database ... 85%
(Reading database ... 90%
(Reading database ... 95%
(Reading database ... 100%
(Reading database ... 12662 files and directories currently installed.)
Preparing to unpack .../groff-base_1.22.3-7_armhf.deb ...
Unpacking groff-base (1.22.3-7) ...
Selecting previously unselected package bsdmainutils.
Preparing to unpack .../bsdmainutils_9.0.6_armhf.deb ...
Unpacking bsdmainutils (9.0.6) ...
Selecting previously unselected package libpipeline1:armhf.
Preparing to unpack .../libpipeline1_1.4.1-2_armhf.deb ...
Unpacking libpipeline1:armhf (1.4.1-2) ...
Selecting previously unselected package man-db.
Preparing to unpack .../man-db_2.7.5-1_armhf.deb ...
Unpacking man-db (2.7.5-1) ...
Selecting previously unselected package libkeyutils1:armhf.
Preparing to unpack .../libkeyutils1_1.5.9-8_armhf.deb ...
Unpacking libkeyutils1:armhf (1.5.9-8) ...
Selecting previously unselected package libkrb5support0:armhf.
Preparing to unpack .../libkrb5support0_1.13.2+dfsg-4+b1_armhf.deb ...
Unpacking libkrb5support0:armhf (1.13.2+dfsg-4+b1) ...
Selecting previously unselected package libk5crypto3:armhf.
Preparing to unpack .../libk5crypto3_1.13.2+dfsg-4+b1_armhf.deb ...
Unpacking libk5crypto3:armhf (1.13.2+dfsg-4+b1) ...
Selecting previously unselected package libkrb5-3:armhf.
Preparing to unpack .../libkrb5-3_1.13.2+dfsg-4+b1_armhf.deb ...
Unpacking libkrb5-3:armhf (1.13.2+dfsg-4+b1) ...
Selecting previously unselected package libgssapi-krb5-2:armhf.
Preparing to unpack .../libgssapi-krb5-2_1.13.2+dfsg-4+b1_armhf.deb ...
Unpacking libgssapi-krb5-2:armhf (1.13.2+dfsg-4+b1) ...
Selecting previously unselected package libtirpc1:armhf.
Preparing to unpack .../libtirpc1_0.2.5-1_armhf.deb ...
Unpacking libtirpc1:armhf (0.2.5-1) ...
Selecting previously unselected package libunistring0:armhf.
Preparing to unpack .../libunistring0_0.9.3-5.2_armhf.deb ...
Unpacking libunistring0:armhf (0.9.3-5.2) ...
Selecting previously unselected package libmagic1:armhf.
Preparing to unpack .../libmagic1_1%3a5.25-2_armhf.deb ...
Unpacking libmagic1:armhf (1:5.25-2) ...
Selecting previously unselected package file.
Preparing to unpack .../file_1%3a5.25-2_armhf.deb ...
Unpacking file (1:5.25-2) ...
Selecting previously unselected package gettext-base.
Preparing to unpack .../gettext-base_0.19.7-2_armhf.deb ...
Unpacking gettext-base (0.19.7-2) ...
Selecting previously unselected package libicu55:armhf.
Preparing to unpack .../libicu55_55.1-7_armhf.deb ...
Unpacking libicu55:armhf (55.1-7) ...
Selecting previously unselected package libxml2:armhf.
Preparing to unpack .../libxml2_2.9.3+dfsg1-1_armhf.deb ...
Unpacking libxml2:armhf (2.9.3+dfsg1-1) ...
Selecting previously unselected package autotools-dev.
Preparing to unpack .../autotools-dev_20150820.1_all.deb ...
Unpacking autotools-dev (20150820.1) ...
Selecting previously unselected package libffi6:armhf.
Preparing to unpack .../libffi6_3.2.1-4_armhf.deb ...
Unpacking libffi6:armhf (3.2.1-4) ...
Selecting previously unselected package libglib2.0-0:armhf.
Preparing to unpack .../libglib2.0-0_2.46.2-3_armhf.deb ...
Unpacking libglib2.0-0:armhf (2.46.2-3) ...
Selecting previously unselected package libcroco3:armhf.
Preparing to unpack .../libcroco3_0.6.11-1_armhf.deb ...
Unpacking libcroco3:armhf (0.6.11-1) ...
Selecting previously unselected package gettext.
Preparing to unpack .../gettext_0.19.7-2_armhf.deb ...
Unpacking gettext (0.19.7-2) ...
Selecting previously unselected package intltool-debian.
Preparing to unpack .../intltool-debian_0.35.0+20060710.4_all.deb ...
Unpacking intltool-debian (0.35.0+20060710.4) ...
Selecting previously unselected package po-debconf.
Preparing to unpack .../po-debconf_1.0.19_all.deb ...
Unpacking po-debconf (1.0.19) ...
Selecting previously unselected package libarchive-zip-perl.
Preparing to unpack .../libarchive-zip-perl_1.56-2_all.deb ...
Unpacking libarchive-zip-perl (1.56-2) ...
Selecting previously unselected package libfile-stripnondeterminism-perl.
Preparing to unpack .../libfile-stripnondeterminism-perl_0.015-1_all.deb ...
Unpacking libfile-stripnondeterminism-perl (0.015-1) ...
Selecting previously unselected package libtimedate-perl.
Preparing to unpack .../libtimedate-perl_2.3000-2_all.deb ...
Unpacking libtimedate-perl (2.3000-2) ...
Selecting previously unselected package dh-strip-nondeterminism.
Preparing to unpack .../dh-strip-nondeterminism_0.015-1_all.deb ...
Unpacking dh-strip-nondeterminism (0.015-1) ...
Selecting previously unselected package debhelper.
Preparing to unpack .../debhelper_9.20160115_all.deb ...
Unpacking debhelper (9.20160115) ...
Selecting previously unselected package pkg-config.
Preparing to unpack .../pkg-config_0.29-3_armhf.deb ...
Unpacking pkg-config (0.29-3) ...
Selecting previously unselected package libtirpc-dev.
Preparing to unpack .../libtirpc-dev_0.2.5-1_armhf.deb ...
Unpacking libtirpc-dev (0.2.5-1) ...
Selecting previously unselected package sbuild-build-depends-yp-tools-dummy.
Preparing to unpack .../sbuild-build-depends-yp-tools-dummy.deb ...
Unpacking sbuild-build-depends-yp-tools-dummy (0.invalid.0) ...
Processing triggers for libc-bin (2.21-7) ...
Setting up groff-base (1.22.3-7) ...
Setting up bsdmainutils (9.0.6) ...
update-alternatives: using /usr/bin/bsd-write to provide /usr/bin/write (write) in auto mode
update-alternatives: using /usr/bin/bsd-from to provide /usr/bin/from (from) in auto mode
Setting up libpipeline1:armhf (1.4.1-2) ...
Setting up man-db (2.7.5-1) ...
Not building database; man-db/auto-update is not 'true'.
Setting up libkeyutils1:armhf (1.5.9-8) ...
Setting up libkrb5support0:armhf (1.13.2+dfsg-4+b1) ...
Setting up libk5crypto3:armhf (1.13.2+dfsg-4+b1) ...
Setting up libkrb5-3:armhf (1.13.2+dfsg-4+b1) ...
Setting up libgssapi-krb5-2:armhf (1.13.2+dfsg-4+b1) ...
Setting up libtirpc1:armhf (0.2.5-1) ...
Setting up libunistring0:armhf (0.9.3-5.2) ...
Setting up libmagic1:armhf (1:5.25-2) ...
Setting up file (1:5.25-2) ...
Setting up gettext-base (0.19.7-2) ...
Setting up libicu55:armhf (55.1-7) ...
Setting up libxml2:armhf (2.9.3+dfsg1-1) ...
Setting up autotools-dev (20150820.1) ...
Setting up libffi6:armhf (3.2.1-4) ...
Setting up libglib2.0-0:armhf (2.46.2-3) ...
No schema files found: doing nothing.
Setting up libcroco3:armhf (0.6.11-1) ...
Setting up gettext (0.19.7-2) ...
Setting up intltool-debian (0.35.0+20060710.4) ...
Setting up po-debconf (1.0.19) ...
Setting up libarchive-zip-perl (1.56-2) ...
Setting up libfile-stripnondeterminism-perl (0.015-1) ...
Setting up libtimedate-perl (2.3000-2) ...
Setting up pkg-config (0.29-3) ...
Setting up libtirpc-dev (0.2.5-1) ...
Setting up debhelper (9.20160115) ...
Setting up sbuild-build-depends-yp-tools-dummy (0.invalid.0) ...
Setting up dh-strip-nondeterminism (0.015-1) ...
Processing triggers for libc-bin (2.21-7) ...
W: No sandbox user '_apt' on the system, can not drop privileges

+------------------------------------------------------------------------------+
| Build environment                                                            |
+------------------------------------------------------------------------------+

Kernel: Linux 3.19.0-trunk-armmp armhf (armv7l)
Toolchain package versions: binutils_2.26-2 dpkg-dev_1.18.4 g++-5_5.3.1-7+rpi1 gcc-5_5.3.1-7+rpi1 libc6-dev_2.21-7 libstdc++-5-dev_5.3.1-7+rpi1 libstdc++6_5.3.1-7+rpi1 linux-libc-dev_3.18.5-1~exp1+rpi19+stretch
Package versions: adduser_3.113+nmu3 apt_1.2.1 autotools-dev_20150820.1 base-files_9.5+rpi1 base-passwd_3.5.39 bash_4.3-14 binutils_2.26-2 bsdmainutils_9.0.6 bsdutils_1:2.27.1-3 build-essential_11.7 bzip2_1.0.6-8 coreutils_8.24-1 cpio_2.11+dfsg-4.1 cpp_4:5.3.1-1+rpi1 cpp-5_5.3.1-7+rpi1 dash_0.5.8-2.1 debconf_1.5.58 debfoster_2.7-2 debhelper_9.20160115 debianutils_4.7 dh-strip-nondeterminism_0.015-1 diffutils_1:3.3-3 dmsetup_2:1.02.115-1 dpkg_1.18.4 dpkg-dev_1.18.4 e2fslibs_1.42.13-1 e2fsprogs_1.42.13-1 fakeroot_1.20.2-1 file_1:5.25-2 findutils_4.6.0-2 g++_4:5.3.1-1+rpi1 g++-5_5.3.1-7+rpi1 gcc_4:5.3.1-1+rpi1 gcc-4.6-base_4.6.4-5+rpi1 gcc-4.7-base_4.7.3-11+rpi1 gcc-4.8-base_4.8.5-4 gcc-4.9-base_4.9.3-10 gcc-5_5.3.1-7+rpi1 gcc-5-base_5.3.1-7+rpi1 gettext_0.19.7-2 gettext-base_0.19.7-2 gnupg_1.4.20-1 gpgv_1.4.20-1 grep_2.22-1 groff-base_1.22.3-7 gzip_1.6-4 hostname_3.16 init_1.24 init-system-helpers_1.24 initramfs-tools_0.120 initscripts_2.88dsf-59.2 insserv_1.14.0-5.1 intltool-debian_0.35.0+20060710.4 klibc-utils_2.0.4-7+rpi1 kmod_22-1 libacl1_2.2.52-2 libapparmor1_2.10-3 libapt-pkg5.0_1.2.1 libarchive-zip-perl_1.56-2 libasan2_5.3.1-7+rpi1 libatomic1_5.3.1-7+rpi1 libattr1_1:2.4.47-2 libaudit-common_1:2.4.5-1 libaudit1_1:2.4.5-1 libblkid1_2.27.1-3 libbz2-1.0_1.0.6-8 libc-bin_2.21-7 libc-dev-bin_2.21-7 libc6_2.21-7 libc6-dev_2.21-7 libcap2_1:2.24-12 libcap2-bin_1:2.24-12 libcc1-0_5.3.1-7+rpi1 libcomerr2_1.42.13-1 libcroco3_0.6.11-1 libcryptsetup4_2:1.7.0-2 libdb5.3_5.3.28-11 libdbus-1-3_1.10.6-1 libdebconfclient0_0.201 libdevmapper1.02.1_2:1.02.115-1 libdpkg-perl_1.18.4 libdrm2_2.4.66-2 libfakeroot_1.20.2-1 libfdisk1_2.27.1-3 libffi6_3.2.1-4 libfile-stripnondeterminism-perl_0.015-1 libgc1c2_1:7.4.2-7.3 libgcc-5-dev_5.3.1-7+rpi1 libgcc1_1:5.3.1-7+rpi1 libgcrypt20_1.6.4-5 libgdbm3_1.8.3-13.1 libglib2.0-0_2.46.2-3 libgmp10_2:6.1.0+dfsg-2 libgomp1_5.3.1-7+rpi1 libgpg-error0_1.21-1 libgssapi-krb5-2_1.13.2+dfsg-4+b1 libicu55_55.1-7 libisl15_0.16.1-1 libk5crypto3_1.13.2+dfsg-4+b1 libkeyutils1_1.5.9-8 libklibc_2.0.4-7+rpi1 libkmod2_22-1 libkrb5-3_1.13.2+dfsg-4+b1 libkrb5support0_1.13.2+dfsg-4+b1 liblz4-1_0.0~r131-1 liblzma5_5.1.1alpha+20120614-2.1 libmagic1_1:5.25-2 libmount1_2.27.1-3 libmpc3_1.0.3-1 libmpfr4_3.1.3-2 libncurses5_6.0+20151024-2 libncursesw5_6.0+20151024-2 libpam-modules_1.1.8-3.2 libpam-modules-bin_1.1.8-3.2 libpam-runtime_1.1.8-3.2 libpam0g_1.1.8-3.2 libpcre3_2:8.38-1 libperl5.22_5.22.1-5 libpipeline1_1.4.1-2 libplymouth4_0.9.2-3 libpng12-0_1.2.54-1 libprocps5_2:3.3.11-3 libreadline6_6.3-8+b3 libseccomp2_2.2.3-2 libselinux1_2.4-3 libsemanage-common_2.4-3 libsemanage1_2.4-3 libsepol1_2.4-2 libsmartcols1_2.27.1-3 libss2_1.42.13-1 libstdc++-5-dev_5.3.1-7+rpi1 libstdc++6_5.3.1-7+rpi1 libsystemd0_228-4+b1 libtimedate-perl_2.3000-2 libtinfo5_6.0+20151024-2 libtirpc-dev_0.2.5-1 libtirpc1_0.2.5-1 libubsan0_5.3.1-7+rpi1 libudev1_228-4+b1 libunistring0_0.9.3-5.2 libusb-0.1-4_2:0.1.12-28 libustr-1.0-1_1.0.4-5 libuuid1_2.27.1-3 libxml2_2.9.3+dfsg1-1 linux-libc-dev_3.18.5-1~exp1+rpi19+stretch login_1:4.2-3.1 lsb-base_9.20160110+rpi1 make_4.1-5 makedev_2.3.1-93 man-db_2.7.5-1 manpages_4.04-0.1 mawk_1.3.3-17 mount_2.27.1-3 multiarch-support_2.21-7 ncurses-base_6.0+20151024-2 ncurses-bin_6.0+20151024-2 passwd_1:4.2-3.1 patch_2.7.5-1 perl_5.22.1-5 perl-base_5.22.1-5 perl-modules-5.22_5.22.1-5 pkg-config_0.29-3 plymouth_0.9.2-3 po-debconf_1.0.19 procps_2:3.3.11-3 raspbian-archive-keyring_20120528.2 readline-common_6.3-8 sbuild-build-depends-core-dummy_0.invalid.0 sbuild-build-depends-yp-tools-dummy_0.invalid.0 sed_4.2.2-6.1 sensible-utils_0.0.9 startpar_0.59-3 systemd_228-4+b1 systemd-sysv_228-4+b1 sysv-rc_2.88dsf-59.2 sysvinit-utils_2.88dsf-59.2 tar_1.28-2.1 tzdata_2016a-1 udev_228-4+b1 util-linux_2.27.1-3 xz-utils_5.1.1alpha+20120614-2.1 zlib1g_1:1.2.8.dfsg-2+b1

+------------------------------------------------------------------------------+
| Build                                                                        |
+------------------------------------------------------------------------------+


Unpack source
-------------

gpgv: keyblock resource `/sbuild-nonexistent/.gnupg/trustedkeys.gpg': file open error
gpgv: Signature made Wed Jan 20 16:18:09 2016 UTC using RSA key ID 5D5487D0
gpgv: Can't check signature: public key not found
dpkg-source: warning: failed to verify signature on ./yp-tools_3.3-1.dsc
dpkg-source: info: extracting yp-tools in yp-tools-3.3
dpkg-source: info: unpacking yp-tools_3.3.orig.tar.bz2
dpkg-source: info: unpacking yp-tools_3.3-1.debian.tar.xz
dpkg-source: info: applying no-internal-files

Check disc space
----------------

Sufficient free space for build

User Environment
----------------

DEB_BUILD_OPTIONS=parallel=4
HOME=/sbuild-nonexistent
LOGNAME=buildd
PATH=/usr/local/sbin:/usr/local/bin:/usr/sbin:/usr/bin:/sbin:/bin:/usr/games
SCHROOT_ALIAS_NAME=stretch-staging-armhf-sbuild
SCHROOT_CHROOT_NAME=stretch-staging-armhf-sbuild
SCHROOT_COMMAND=env
SCHROOT_GID=109
SCHROOT_GROUP=buildd
SCHROOT_SESSION_ID=stretch-staging-armhf-sbuild-1aded32b-cfe9-4e49-bba2-70f83d889cdf
SCHROOT_UID=104
SCHROOT_USER=buildd
SHELL=/bin/sh
TERM=linux
USER=buildd

dpkg-buildpackage
-----------------

dpkg-buildpackage: source package yp-tools
dpkg-buildpackage: source version 3.3-1
dpkg-buildpackage: source distribution unstable
 dpkg-source --before-build yp-tools-3.3
dpkg-buildpackage: host architecture armhf
 fakeroot debian/rules clean
dh clean  --with autotools-dev
   dh_testdir
   dh_auto_clean
   dh_autotools-dev_restoreconfig
   dh_clean
 debian/rules build-arch
dh build-arch  --with autotools-dev
   dh_testdir -a
   dh_update_autotools_config -a
   dh_autotools-dev_updateconfig -a
   dh_auto_configure -a
	./configure --build=arm-linux-gnueabihf --prefix=/usr --includedir=\${prefix}/include --mandir=\${prefix}/share/man --infodir=\${prefix}/share/info --sysconfdir=/etc --localstatedir=/var --disable-silent-rules --libdir=\${prefix}/lib/arm-linux-gnueabihf --libexecdir=\${prefix}/lib/arm-linux-gnueabihf --disable-maintainer-mode --disable-dependency-tracking
configure: WARNING: unrecognized options: --disable-maintainer-mode
checking for a BSD-compatible install... /usr/bin/install -c
checking whether build environment is sane... yes
checking for a thread-safe mkdir -p... /bin/mkdir -p
checking for gawk... no
checking for mawk... mawk
checking whether make sets $(MAKE)... yes
checking whether make supports nested variables... yes
checking for gcc... gcc
checking whether the C compiler works... yes
checking for C compiler default output file name... a.out
checking for suffix of executables... 
checking whether we are cross compiling... no
checking for suffix of object files... o
checking whether we are using the GNU C compiler... yes
checking whether gcc accepts -g... yes
checking for gcc option to accept ISO C89... none needed
checking for style of include used by make... GNU
checking dependency style of gcc... none
checking how to run the C preprocessor... gcc -E
checking for grep that handles long lines and -e... /bin/grep
checking for egrep... /bin/grep -E
checking for ANSI C header files... yes
checking for sys/types.h... yes
checking for sys/stat.h... yes
checking for stdlib.h... yes
checking for string.h... yes
checking for memory.h... yes
checking for strings.h... yes
checking for inttypes.h... yes
checking for stdint.h... yes
checking for unistd.h... yes
checking minix/config.h usability... no
checking minix/config.h presence... no
checking for minix/config.h... no
checking whether it is safe to define __EXTENSIONS__... yes
checking whether gcc and cc understand -c and -o together... yes
checking how to run the C preprocessor... gcc -E
checking for strerror in -lcposix... no
checking whether make sets $(MAKE)... (cached) yes
checking for ranlib... ranlib
checking build system type... arm-unknown-linux-gnueabihf
checking host system type... arm-unknown-linux-gnueabihf
checking how to print strings... printf
checking for a sed that does not truncate output... /bin/sed
checking for fgrep... /bin/grep -F
checking for ld used by gcc... /usr/bin/ld
checking if the linker (/usr/bin/ld) is GNU ld... yes
checking for BSD- or MS-compatible name lister (nm)... /usr/bin/nm -B
checking the name lister (/usr/bin/nm -B) interface... BSD nm
checking whether ln -s works... yes
checking the maximum length of command line arguments... 1572864
checking whether the shell understands some XSI constructs... yes
checking whether the shell understands "+="... yes
checking how to convert arm-unknown-linux-gnueabihf file names to arm-unknown-linux-gnueabihf format... func_convert_file_noop
checking how to convert arm-unknown-linux-gnueabihf file names to toolchain format... func_convert_file_noop
checking for /usr/bin/ld option to reload object files... -r
checking for objdump... objdump
checking how to recognize dependent libraries... pass_all
checking for dlltool... no
checking how to associate runtime and link libraries... printf %s\n
checking for ar... ar
checking for archiver @FILE support... @
checking for strip... strip
checking for ranlib... (cached) ranlib
checking command to parse /usr/bin/nm -B output from gcc object... ok
checking for sysroot... no
checking for mt... mt
checking if mt is a manifest tool... no
checking for dlfcn.h... yes
checking for objdir... .libs
checking if gcc supports -fno-rtti -fno-exceptions... no
checking for gcc option to produce PIC... -fPIC -DPIC
checking if gcc PIC flag -fPIC -DPIC works... yes
checking if gcc static flag -static works... yes
checking if gcc supports -c -o file.o... yes
checking if gcc supports -c -o file.o... (cached) yes
checking whether the gcc linker (/usr/bin/ld) supports shared libraries... yes
checking whether -lc should be explicitly linked in... no
checking dynamic linker characteristics... GNU/Linux ld.so
checking how to hardcode library paths into programs... immediate
checking whether stripping libraries is possible... yes
checking if libtool supports shared libraries... yes
checking whether to build shared libraries... yes
checking whether to build static libraries... yes
checking for pkg-config... /usr/bin/pkg-config
checking pkg-config is at least version 0.9.0... yes
checking for TIRPC... yes
checking for crypt in -lcrypt... yes
checking for ANSI C header files... (cached) yes
checking getopt.h usability... yes
checking getopt.h presence... yes
checking for getopt.h... yes
checking rpc/clnt_soc.h usability... no
checking rpc/clnt_soc.h presence... no
checking for rpc/clnt_soc.h... no
checking for an ANSI C-conforming const... yes
checking whether NLS is requested... yes
checking for msgfmt... /usr/bin/msgfmt
checking for gmsgfmt... /usr/bin/msgfmt
checking for xgettext... /usr/bin/xgettext
checking for msgmerge... /usr/bin/msgmerge
checking for ld used by gcc... /usr/bin/ld
checking if the linker (/usr/bin/ld) is GNU ld... yes
checking for shared library run path origin... done
checking for CFPreferencesCopyAppValue... no
checking for CFLocaleCopyCurrent... no
checking for GNU gettext in libc... yes
checking whether to use NLS... yes
checking where the gettext function comes from... libc
checking that generated files are newer than configure... done
configure: creating ./config.status
config.status: creating Makefile
config.status: creating lib/Makefile
config.status: creating src/Makefile
config.status: creating man/Makefile
config.status: creating etc/Makefile
config.status: creating po/Makefile.in
config.status: creating nss_nis6/Makefile
config.status: creating libnis.pc
config.status: creating man/domainname.8
config.status: creating man/nicknames.5
config.status: creating man/yp_dump_binding.8
config.status: creating man/ypcat.1
config.status: creating man/ypmatch.1
config.status: creating man/yppasswd.1
config.status: creating man/yppoll.8
config.status: creating man/ypset.8
config.status: creating man/yptest.8
config.status: creating man/ypwhich.1
config.status: creating config.h
config.status: executing depfiles commands
config.status: executing libtool commands
config.status: executing po-directories commands
config.status: creating po/POTFILES
config.status: creating po/Makefile
configure: WARNING: unrecognized options: --disable-maintainer-mode
   dh_auto_build -a
	make -j1
make[1]: Entering directory '/<<PKGBUILDDIR>>'
make  all-recursive
make[2]: Entering directory '/<<PKGBUILDDIR>>'
Making all in lib
make[3]: Entering directory '/<<PKGBUILDDIR>>/lib'
gcc -DHAVE_CONFIG_H -I. -I..  -I. -I/usr/include/tirpc -DLOCALEDIR=\"/usr/share/locale\" -Wdate-time -D_FORTIFY_SOURCE=2 -W -Wall -Wbad-function-cast -Wcast-align -Winline -Wnested-externs -Wshadow -Wmissing-declarations -Wmissing-prototypes -Wstrict-prototypes -Wundef -Werror -D_REENTRANT=1 -g -O2 -fstack-protector-strong -Wformat -Werror=format-security -c nicknames.c
gcc -DHAVE_CONFIG_H -I. -I..  -I. -I/usr/include/tirpc -DLOCALEDIR=\"/usr/share/locale\" -Wdate-time -D_FORTIFY_SOURCE=2 -W -Wall -Wbad-function-cast -Wcast-align -Winline -Wnested-externs -Wshadow -Wmissing-declarations -Wmissing-prototypes -Wstrict-prototypes -Wundef -Werror -D_REENTRANT=1 -g -O2 -fstack-protector-strong -Wformat -Werror=format-security -c yp_all_host.c
rm -f libyptools.a
ar cru libyptools.a nicknames.o yp_all_host.o 
ar: `u' modifier ignored since `D' is the default (see `U')
ranlib libyptools.a
/bin/bash ../libtool  --tag=CC   --mode=compile gcc -DHAVE_CONFIG_H -I. -I..  -I. -I/usr/include/tirpc -DLOCALEDIR=\"/usr/share/locale\" -Wdate-time -D_FORTIFY_SOURCE=2 -W -Wall -Wbad-function-cast -Wcast-align -Winline -Wnested-externs -Wshadow -Wmissing-declarations -Wmissing-prototypes -Wstrict-prototypes -Wundef -Werror -D_REENTRANT=1 -g -O2 -fstack-protector-strong -Wformat -Werror=format-security -c -o yp_xdr.lo yp_xdr.c
libtool: compile:  gcc -DHAVE_CONFIG_H -I. -I.. -I. -I/usr/include/tirpc -DLOCALEDIR=\"/usr/share/locale\" -Wdate-time -D_FORTIFY_SOURCE=2 -W -Wall -Wbad-function-cast -Wcast-align -Winline -Wnested-externs -Wshadow -Wmissing-declarations -Wmissing-prototypes -Wstrict-prototypes -Wundef -Werror -D_REENTRANT=1 -g -O2 -fstack-protector-strong -Wformat -Werror=format-security -c yp_xdr.c  -fPIC -DPIC -o .libs/yp_xdr.o
libtool: compile:  gcc -DHAVE_CONFIG_H -I. -I.. -I. -I/usr/include/tirpc -DLOCALEDIR=\"/usr/share/locale\" -Wdate-time -D_FORTIFY_SOURCE=2 -W -Wall -Wbad-function-cast -Wcast-align -Winline -Wnested-externs -Wshadow -Wmissing-declarations -Wmissing-prototypes -Wstrict-prototypes -Wundef -Werror -D_REENTRANT=1 -g -O2 -fstack-protector-strong -Wformat -Werror=format-security -c yp_xdr.c -o yp_xdr.o >/dev/null 2>&1
/bin/bash ../libtool  --tag=CC   --mode=compile gcc -DHAVE_CONFIG_H -I. -I..  -I. -I/usr/include/tirpc -DLOCALEDIR=\"/usr/share/locale\" -Wdate-time -D_FORTIFY_SOURCE=2 -W -Wall -Wbad-function-cast -Wcast-align -Winline -Wnested-externs -Wshadow -Wmissing-declarations -Wmissing-prototypes -Wstrict-prototypes -Wundef -Werror -D_REENTRANT=1 -g -O2 -fstack-protector-strong -Wformat -Werror=format-security -c -o do_ypcall.lo do_ypcall.c
libtool: compile:  gcc -DHAVE_CONFIG_H -I. -I.. -I. -I/usr/include/tirpc -DLOCALEDIR=\"/usr/share/locale\" -Wdate-time -D_FORTIFY_SOURCE=2 -W -Wall -Wbad-function-cast -Wcast-align -Winline -Wnested-externs -Wshadow -Wmissing-declarations -Wmissing-prototypes -Wstrict-prototypes -Wundef -Werror -D_REENTRANT=1 -g -O2 -fstack-protector-strong -Wformat -Werror=format-security -c do_ypcall.c  -fPIC -DPIC -o .libs/do_ypcall.o
do_ypcall.c: In function 'do_ypcall_tr':
do_ypcall.c:461:27: error: cast increases required alignment of target type [-Werror=cast-align]
     status = ypprot_err (((struct ypresp_val *) resp)->status);
                           ^
cc1: all warnings being treated as errors
Makefile:541: recipe for target 'do_ypcall.lo' failed
make[3]: *** [do_ypcall.lo] Error 1
make[3]: Leaving directory '/<<PKGBUILDDIR>>/lib'
Makefile:485: recipe for target 'all-recursive' failed
make[2]: *** [all-recursive] Error 1
make[2]: Leaving directory '/<<PKGBUILDDIR>>'
Makefile:393: recipe for target 'all' failed
make[1]: *** [all] Error 2
make[1]: Leaving directory '/<<PKGBUILDDIR>>'
dh_auto_build: make -j1 returned exit code 2
debian/rules:22: recipe for target 'build-arch' failed
make: *** [build-arch] Error 2
dpkg-buildpackage: error: debian/rules build-arch gave error exit status 2
--------------------------------------------------------------------------------
Build finished at 20160206-1140

Finished
--------

E: Build failure (dpkg-buildpackage died)

+------------------------------------------------------------------------------+
| Cleanup                                                                      |
+------------------------------------------------------------------------------+

Purging /<<BUILDDIR>>
Not cleaning session: cloned chroot in use

+------------------------------------------------------------------------------+
| Summary                                                                      |
+------------------------------------------------------------------------------+

Build Architecture: armhf
Build-Space: 3536
Build-Time: 47
Distribution: stretch-staging
Fail-Stage: build
Host Architecture: armhf
Install-Time: 170
Job: yp-tools_3.3-1
Machine Architecture: armhf
Package: yp-tools
Package-Time: 258
Source-Version: 3.3-1
Space: 3536
Status: attempted
Version: 3.3-1
--------------------------------------------------------------------------------
Finished at 20160206-1140
Build needed 00:04:18, 3536k disc space