Raspbian Package Auto-Building

Build log for tilix (1.9.4-2) on armhf

tilix1.9.4-2armhf → 2022-08-30 06:56:41

sbuild (Debian sbuild) 0.71.0 (24 Aug 2016) on testbuildd

+==============================================================================+
| tilix 1.9.4-2 (armhf)                        Tue, 30 Aug 2022 06:18:55 +0000 |
+==============================================================================+

Package: tilix
Version: 1.9.4-2
Source Version: 1.9.4-2
Distribution: bookworm-staging
Machine Architecture: armhf
Host Architecture: armhf
Build Architecture: armhf

I: NOTICE: Log filtering will replace 'var/lib/schroot/mount/bookworm-staging-armhf-sbuild-8248995e-b0c8-48d7-b139-4f056d926498' with '<<CHROOT>>'

+------------------------------------------------------------------------------+
| Update chroot                                                                |
+------------------------------------------------------------------------------+

Get:1 http://172.17.4.1/private bookworm-staging InRelease [11.3 kB]
Get:2 http://172.17.4.1/private bookworm-staging/main Sources [13.2 MB]
Get:3 http://172.17.4.1/private bookworm-staging/main armhf Packages [14.1 MB]
Fetched 27.3 MB in 31s (891 kB/s)
Reading package lists...
W: No sandbox user '_apt' on the system, can not drop privileges
W: http://172.17.4.1/private/dists/bookworm-staging/InRelease: Key is stored in legacy trusted.gpg keyring (/etc/apt/trusted.gpg), see the DEPRECATION section in apt-key(8) for details.

+------------------------------------------------------------------------------+
| Fetch source files                                                           |
+------------------------------------------------------------------------------+


Check APT
---------

Checking available source versions...

Download source files with APT
------------------------------

Reading package lists...
NOTICE: 'tilix' packaging is maintained in the 'Git' version control system at:
https://salsa.debian.org/gnome-team/tilix.git
Please use:
git clone https://salsa.debian.org/gnome-team/tilix.git
to retrieve the latest (possibly unreleased) updates to the package.
Need to get 990 kB of source archives.
Get:1 http://172.17.4.1/private bookworm-staging/main tilix 1.9.4-2 (dsc) [2156 B]
Get:2 http://172.17.4.1/private bookworm-staging/main tilix 1.9.4-2 (tar) [968 kB]
Get:3 http://172.17.4.1/private bookworm-staging/main tilix 1.9.4-2 (diff) [19.3 kB]
Fetched 990 kB in 0s (2727 kB/s)
Download complete and in download only mode
I: NOTICE: Log filtering will replace 'build/tilix-vxJmlZ/tilix-1.9.4' with '<<PKGBUILDDIR>>'
I: NOTICE: Log filtering will replace 'build/tilix-vxJmlZ' with '<<BUILDDIR>>'

+------------------------------------------------------------------------------+
| Install build-essential                                                      |
+------------------------------------------------------------------------------+


Setup apt archive
-----------------

Merged Build-Depends: build-essential, fakeroot
Filtered Build-Depends: build-essential, fakeroot
dpkg-deb: building package 'sbuild-build-depends-core-dummy' in '/<<BUILDDIR>>/resolver-6C1ZOH/apt_archive/sbuild-build-depends-core-dummy.deb'.
dpkg-scanpackages: warning: Packages in archive but missing from override file:
dpkg-scanpackages: warning:   sbuild-build-depends-core-dummy
dpkg-scanpackages: info: Wrote 1 entries to output Packages file.
gpg: keybox '/<<BUILDDIR>>/resolver-6C1ZOH/gpg/pubring.kbx' created
gpg: /<<BUILDDIR>>/resolver-6C1ZOH/gpg/trustdb.gpg: trustdb created
gpg: key 35506D9A48F77B2E: public key "Sbuild Signer (Sbuild Build Dependency Archive Key) <buildd-tools-devel@lists.alioth.debian.org>" imported
gpg: Total number processed: 1
gpg:               imported: 1
gpg: key 35506D9A48F77B2E: "Sbuild Signer (Sbuild Build Dependency Archive Key) <buildd-tools-devel@lists.alioth.debian.org>" not changed
gpg: key 35506D9A48F77B2E: secret key imported
gpg: Total number processed: 1
gpg:              unchanged: 1
gpg:       secret keys read: 1
gpg:   secret keys imported: 1
gpg: using "Sbuild Signer" as default secret key for signing
Ign:1 copy:/<<BUILDDIR>>/resolver-6C1ZOH/apt_archive ./ InRelease
Get:2 copy:/<<BUILDDIR>>/resolver-6C1ZOH/apt_archive ./ Release [957 B]
Get:3 copy:/<<BUILDDIR>>/resolver-6C1ZOH/apt_archive ./ Release.gpg [370 B]
Get:4 copy:/<<BUILDDIR>>/resolver-6C1ZOH/apt_archive ./ Sources [349 B]
Get:5 copy:/<<BUILDDIR>>/resolver-6C1ZOH/apt_archive ./ Packages [432 B]
Fetched 2108 B in 1s (2410 B/s)
Reading package lists...
W: No sandbox user '_apt' on the system, can not drop privileges
Reading package lists...

Install core build dependencies (apt-based resolver)
----------------------------------------------------

Installing build dependencies
Reading package lists...
Building dependency tree...
Reading state information...
The following packages were automatically installed and are no longer required:
  krb5-locales libpam-cap netbase sensible-utils
Use 'apt autoremove' to remove them.
The following NEW packages will be installed:
  sbuild-build-depends-core-dummy
0 upgraded, 1 newly installed, 0 to remove and 15 not upgraded.
Need to get 852 B of archives.
After this operation, 0 B of additional disk space will be used.
Get:1 copy:/<<BUILDDIR>>/resolver-6C1ZOH/apt_archive ./ sbuild-build-depends-core-dummy 0.invalid.0 [852 B]
debconf: delaying package configuration, since apt-utils is not installed
Fetched 852 B in 0s (22.6 kB/s)
Selecting previously unselected package sbuild-build-depends-core-dummy.
(Reading database ... 12802 files and directories currently installed.)
Preparing to unpack .../sbuild-build-depends-core-dummy_0.invalid.0_armhf.deb ...
Unpacking sbuild-build-depends-core-dummy (0.invalid.0) ...
Setting up sbuild-build-depends-core-dummy (0.invalid.0) ...
W: No sandbox user '_apt' on the system, can not drop privileges

+------------------------------------------------------------------------------+
| Check architectures                                                          |
+------------------------------------------------------------------------------+

Arch check ok (armhf included in any all)

+------------------------------------------------------------------------------+
| Install package build dependencies                                           |
+------------------------------------------------------------------------------+


Setup apt archive
-----------------

Merged Build-Depends: appstream, debhelper-compat (= 12), dh-dlang, gnome-pkg-tools (>= 0.19.8), libgtkd-3-dev (>= 3.9), librsvg2-dev, libsecret-1-dev, libunwind-dev, libvted-3-dev (>= 3.9), meson, po4a
Filtered Build-Depends: appstream, debhelper-compat (= 12), dh-dlang, gnome-pkg-tools (>= 0.19.8), libgtkd-3-dev (>= 3.9), librsvg2-dev, libsecret-1-dev, libunwind-dev, libvted-3-dev (>= 3.9), meson, po4a
dpkg-deb: building package 'sbuild-build-depends-tilix-dummy' in '/<<BUILDDIR>>/resolver-6C1ZOH/apt_archive/sbuild-build-depends-tilix-dummy.deb'.
dpkg-scanpackages: warning: Packages in archive but missing from override file:
dpkg-scanpackages: warning:   sbuild-build-depends-core-dummy sbuild-build-depends-tilix-dummy
dpkg-scanpackages: info: Wrote 2 entries to output Packages file.
gpg: using "Sbuild Signer" as default secret key for signing
Ign:1 copy:/<<BUILDDIR>>/resolver-6C1ZOH/apt_archive ./ InRelease
Get:2 copy:/<<BUILDDIR>>/resolver-6C1ZOH/apt_archive ./ Release [963 B]
Get:3 copy:/<<BUILDDIR>>/resolver-6C1ZOH/apt_archive ./ Release.gpg [370 B]
Get:4 copy:/<<BUILDDIR>>/resolver-6C1ZOH/apt_archive ./ Sources [571 B]
Get:5 copy:/<<BUILDDIR>>/resolver-6C1ZOH/apt_archive ./ Packages [658 B]
Fetched 2562 B in 1s (3532 B/s)
Reading package lists...
W: No sandbox user '_apt' on the system, can not drop privileges
Reading package lists...

Install tilix build dependencies (apt-based resolver)
-----------------------------------------------------

Installing build dependencies
Reading package lists...
Building dependency tree...
Reading state information...
The following packages were automatically installed and are no longer required:
  krb5-locales libpam-cap netbase
Use 'apt autoremove' to remove them.
The following additional packages will be installed:
  adwaita-icon-theme appstream autoconf automake autopoint autotools-dev
  bsdextrautils cpp-12 dbus dbus-bin dbus-daemon dbus-session-bus-common
  dbus-system-bus-common dbus-user-session dconf-gsettings-backend
  dconf-service debhelper default-d-compiler dh-autoreconf dh-dlang
  dh-strip-nondeterminism dmsetup dwz file fontconfig fontconfig-config
  fonts-dejavu-core g++-12 gcc-11-base gcc-12 gcc-12-base gdc gdc-12 gettext
  gettext-base gir1.2-atk-1.0 gir1.2-atspi-2.0 gir1.2-freedesktop
  gir1.2-gdkpixbuf-2.0 gir1.2-glib-2.0 gir1.2-gtk-3.0 gir1.2-harfbuzz-0.0
  gir1.2-pango-1.0 gir1.2-rsvg-2.0 gir1.2-secret-1 gir1.2-vte-2.91
  gnome-pkg-tools groff-base gtk-update-icon-cache hicolor-icon-theme
  icu-devtools intltool-debian libapparmor1 libappstream4 libarchive-zip-perl
  libargon2-1 libasan8 libatk-bridge2.0-0 libatk-bridge2.0-dev libatk1.0-0
  libatk1.0-data libatk1.0-dev libatomic1 libatspi2.0-0 libatspi2.0-dev
  libavahi-client3 libavahi-common-data libavahi-common3 libblkid-dev
  libbrotli-dev libbrotli1 libbsd0 libcairo-gobject2
  libcairo-script-interpreter2 libcairo2 libcairo2-dev libcc1-0 libcolord2
  libcryptsetup12 libcups2 libcurl3-gnutls libdatrie-dev libdatrie1
  libdbus-1-3 libdbus-1-dev libdconf1 libdebhelper-perl libdeflate-dev
  libdeflate0 libdevmapper1.02.1 libdrm-amdgpu1 libdrm-common libdrm-nouveau2
  libdrm-radeon1 libdrm2 libedit2 libegl-dev libegl-mesa0 libegl1
  libegl1-mesa-dev libelf1 libepoxy-dev libepoxy0 libevent-2.1-7 libexpat1
  libexpat1-dev libfdisk1 libffi-dev libfile-stripnondeterminism-perl
  libfontconfig-dev libfontconfig1 libfreetype-dev libfreetype6
  libfreetype6-dev libfribidi-dev libfribidi0 libgbm1 libgcc-12-dev libgcc-s1
  libgcrypt20-dev libgdk-pixbuf-2.0-0 libgdk-pixbuf-2.0-dev
  libgdk-pixbuf2.0-bin libgdk-pixbuf2.0-common libgirepository-1.0-1 libgl-dev
  libgl1 libgl1-mesa-dri libglapi-mesa libgles-dev libgles1 libgles2
  libglib2.0-0 libglib2.0-bin libglib2.0-data libglib2.0-dev
  libglib2.0-dev-bin libglvnd-core-dev libglvnd-dev libglvnd0 libglx-dev
  libglx-mesa0 libglx0 libgmp-dev libgmpxx4ldbl libgnutls-dane0
  libgnutls-openssl27 libgnutls28-dev libgnutlsxx30 libgomp1 libgpg-error-dev
  libgphobos-12-dev libgphobos-dev libgphobos2 libgphobos3 libgraphite2-3
  libgraphite2-dev libgtk-3-0 libgtk-3-common libgtk-3-dev libgtkd-3-0
  libgtkd-3-dev libharfbuzz-dev libharfbuzz-gobject0 libharfbuzz-icu0
  libharfbuzz0b libice-dev libice6 libicu-dev libicu71 libidn2-dev libip4tc2
  libjbig-dev libjbig0 libjpeg-dev libjpeg62-turbo libjpeg62-turbo-dev
  libjson-c5 libkmod2 liblcms2-2 liblerc-dev liblerc4 libllvm14 liblzma-dev
  liblzo2-2 libmagic-mgc libmagic1 libmd0 libmount-dev libmpdec3 libnghttp2-14
  libopengl-dev libopengl0 libosp5 libp11-kit-dev libpam-systemd
  libpango-1.0-0 libpango1.0-dev libpangocairo-1.0-0 libpangoft2-1.0-0
  libpangoxft-1.0-0 libpcre16-3 libpcre2-16-0 libpcre2-32-0 libpcre2-dev
  libpcre2-posix3 libpcre3-dev libpcre32-3 libpcrecpp0v5 libpipeline1
  libpixman-1-0 libpixman-1-dev libpng-dev libpng16-16 libpod-parser-perl
  libpsl5 libpthread-stubs0-dev libpython3-stdlib libpython3.10-minimal
  libpython3.10-stdlib librsvg2-2 librsvg2-common librsvg2-dev librtmp1
  libsecret-1-0 libsecret-1-dev libsecret-common libselinux1-dev
  libsensors-config libsensors5 libsepol-dev libsgmls-perl libsm-dev libsm6
  libssh2-1 libstdc++-12-dev libstdc++6 libstemmer0d libsub-override-perl
  libsyntax-keyword-try-perl libsystemd-shared libtasn1-6-dev libthai-data
  libthai-dev libthai0 libtiff-dev libtiff5 libtiffxx5 libtool libubsan1
  libuchardet0 libunbound8 libunwind-dev libunwind8 libvte-2.91-0
  libvte-2.91-common libvte-2.91-dev libvted-3-0 libvted-3-dev libwayland-bin
  libwayland-client0 libwayland-cursor0 libwayland-dev libwayland-egl1
  libwayland-server0 libwebp7 libx11-6 libx11-data libx11-dev libx11-xcb1
  libxau-dev libxau6 libxcb-dri2-0 libxcb-dri3-0 libxcb-glx0 libxcb-present0
  libxcb-render0 libxcb-render0-dev libxcb-shm0 libxcb-shm0-dev libxcb-sync1
  libxcb-xfixes0 libxcb1 libxcb1-dev libxcomposite-dev libxcomposite1
  libxcursor-dev libxcursor1 libxdamage-dev libxdamage1 libxdmcp-dev libxdmcp6
  libxext-dev libxext6 libxfixes-dev libxfixes3 libxft-dev libxft2 libxi-dev
  libxi6 libxinerama-dev libxinerama1 libxkbcommon-dev libxkbcommon0 libxml2
  libxmlb2 libxrandr-dev libxrandr2 libxrender-dev libxrender1
  libxs-parse-keyword-perl libxshmfence1 libxtst-dev libxtst6 libxxf86vm1
  libyaml-0-2 libyaml-tiny-perl libz3-4 m4 man-db media-types meson nettle-dev
  ninja-build opensp pango1.0-tools pkg-config po-debconf po4a python3
  python3-distutils python3-lib2to3 python3-minimal python3-pkg-resources
  python3-setuptools python3.10 python3.10-minimal shared-mime-info systemd
  systemd-sysv ucf uuid-dev wayland-protocols x11-common x11proto-core-dev
  x11proto-dev xkb-data xml-core xorg-sgml-doctools xtrans-dev zlib1g-dev
Suggested packages:
  apt-config-icons autoconf-archive gnu-standards autoconf-doc gcc-12-locales
  dh-make gcc-12-doc gettext-doc libasprintf-dev libgettextpo-dev groff
  libcairo2-doc colord cups-common libdatrie-doc freetype2-doc libgcrypt20-doc
  libgirepository1.0-dev libglib2.0-doc libxml2-utils gmp-doc libgmp10-doc
  libmpfr-dev dns-root-data gnutls-bin gnutls-doc libgraphite2-utils gvfs
  libgtk-3-doc libice-doc icu-doc liblcms2-utils liblzma-doc p11-kit-doc
  libpango1.0-doc librsvg2-bin librsvg2-doc lm-sensors sgmlspl sgmls-doc
  libsm-doc libstdc++-12-doc libthai-doc libtool-doc gfortran
  | fortran95-compiler gcj-jdk libwayland-doc libx11-doc libxcb-doc
  libxext-doc m4-doc apparmor less www-browser doc-base sgml-data
  graphicsmagick libmail-box-perl python3-doc python3-tk python3-venv
  python-setuptools-doc python3.10-venv python3.10-doc binfmt-support
  systemd-container systemd-homed systemd-userdbd systemd-boot libfido2-1
  libtss2-esys-3.0.2-0 libtss2-mu0 libtss2-rc0 policykit-1
Recommended packages:
  curl | wget | lynx git-buildpackage at-spi2-core ca-certificates
  libarchive-cpio-perl xdg-user-dirs libgtk-3-bin libpng-tools publicsuffix
  libtasn1-doc libltdl-dev libvte-2.91-doc libmail-sendmail-perl
  liblocale-gettext-perl libterm-readkey-perl libtext-wrapi18n-perl
  libunicode-linebreak-perl systemd-timesyncd | time-daemon libnss-systemd
The following NEW packages will be installed:
  adwaita-icon-theme appstream autoconf automake autopoint autotools-dev
  bsdextrautils dbus dbus-bin dbus-daemon dbus-session-bus-common
  dbus-system-bus-common dbus-user-session dconf-gsettings-backend
  dconf-service debhelper default-d-compiler dh-autoreconf dh-dlang
  dh-strip-nondeterminism dmsetup dwz file fontconfig fontconfig-config
  fonts-dejavu-core gcc-11-base gdc gdc-12 gettext gettext-base gir1.2-atk-1.0
  gir1.2-atspi-2.0 gir1.2-freedesktop gir1.2-gdkpixbuf-2.0 gir1.2-glib-2.0
  gir1.2-gtk-3.0 gir1.2-harfbuzz-0.0 gir1.2-pango-1.0 gir1.2-rsvg-2.0
  gir1.2-secret-1 gir1.2-vte-2.91 gnome-pkg-tools groff-base
  gtk-update-icon-cache hicolor-icon-theme icu-devtools intltool-debian
  libapparmor1 libappstream4 libarchive-zip-perl libargon2-1
  libatk-bridge2.0-0 libatk-bridge2.0-dev libatk1.0-0 libatk1.0-data
  libatk1.0-dev libatspi2.0-0 libatspi2.0-dev libavahi-client3
  libavahi-common-data libavahi-common3 libblkid-dev libbrotli-dev libbrotli1
  libbsd0 libcairo-gobject2 libcairo-script-interpreter2 libcairo2
  libcairo2-dev libcolord2 libcryptsetup12 libcups2 libcurl3-gnutls
  libdatrie-dev libdatrie1 libdbus-1-3 libdbus-1-dev libdconf1
  libdebhelper-perl libdeflate-dev libdeflate0 libdevmapper1.02.1
  libdrm-amdgpu1 libdrm-common libdrm-nouveau2 libdrm-radeon1 libdrm2 libedit2
  libegl-dev libegl-mesa0 libegl1 libegl1-mesa-dev libelf1 libepoxy-dev
  libepoxy0 libevent-2.1-7 libexpat1 libexpat1-dev libfdisk1 libffi-dev
  libfile-stripnondeterminism-perl libfontconfig-dev libfontconfig1
  libfreetype-dev libfreetype6 libfreetype6-dev libfribidi-dev libfribidi0
  libgbm1 libgcrypt20-dev libgdk-pixbuf-2.0-0 libgdk-pixbuf-2.0-dev
  libgdk-pixbuf2.0-bin libgdk-pixbuf2.0-common libgirepository-1.0-1 libgl-dev
  libgl1 libgl1-mesa-dri libglapi-mesa libgles-dev libgles1 libgles2
  libglib2.0-0 libglib2.0-bin libglib2.0-data libglib2.0-dev
  libglib2.0-dev-bin libglvnd-core-dev libglvnd-dev libglvnd0 libglx-dev
  libglx-mesa0 libglx0 libgmp-dev libgmpxx4ldbl libgnutls-dane0
  libgnutls-openssl27 libgnutls28-dev libgnutlsxx30 libgpg-error-dev
  libgphobos-12-dev libgphobos-dev libgphobos2 libgphobos3 libgraphite2-3
  libgraphite2-dev libgtk-3-0 libgtk-3-common libgtk-3-dev libgtkd-3-0
  libgtkd-3-dev libharfbuzz-dev libharfbuzz-gobject0 libharfbuzz-icu0
  libharfbuzz0b libice-dev libice6 libicu-dev libicu71 libidn2-dev libip4tc2
  libjbig-dev libjbig0 libjpeg-dev libjpeg62-turbo libjpeg62-turbo-dev
  libjson-c5 libkmod2 liblcms2-2 liblerc-dev liblerc4 libllvm14 liblzma-dev
  liblzo2-2 libmagic-mgc libmagic1 libmd0 libmount-dev libmpdec3 libnghttp2-14
  libopengl-dev libopengl0 libosp5 libp11-kit-dev libpam-systemd
  libpango-1.0-0 libpango1.0-dev libpangocairo-1.0-0 libpangoft2-1.0-0
  libpangoxft-1.0-0 libpcre16-3 libpcre2-16-0 libpcre2-32-0 libpcre2-dev
  libpcre2-posix3 libpcre3-dev libpcre32-3 libpcrecpp0v5 libpipeline1
  libpixman-1-0 libpixman-1-dev libpng-dev libpng16-16 libpod-parser-perl
  libpsl5 libpthread-stubs0-dev libpython3-stdlib libpython3.10-minimal
  libpython3.10-stdlib librsvg2-2 librsvg2-common librsvg2-dev librtmp1
  libsecret-1-0 libsecret-1-dev libsecret-common libselinux1-dev
  libsensors-config libsensors5 libsepol-dev libsgmls-perl libsm-dev libsm6
  libssh2-1 libstemmer0d libsub-override-perl libsyntax-keyword-try-perl
  libsystemd-shared libtasn1-6-dev libthai-data libthai-dev libthai0
  libtiff-dev libtiff5 libtiffxx5 libtool libuchardet0 libunbound8
  libunwind-dev libunwind8 libvte-2.91-0 libvte-2.91-common libvte-2.91-dev
  libvted-3-0 libvted-3-dev libwayland-bin libwayland-client0
  libwayland-cursor0 libwayland-dev libwayland-egl1 libwayland-server0
  libwebp7 libx11-6 libx11-data libx11-dev libx11-xcb1 libxau-dev libxau6
  libxcb-dri2-0 libxcb-dri3-0 libxcb-glx0 libxcb-present0 libxcb-render0
  libxcb-render0-dev libxcb-shm0 libxcb-shm0-dev libxcb-sync1 libxcb-xfixes0
  libxcb1 libxcb1-dev libxcomposite-dev libxcomposite1 libxcursor-dev
  libxcursor1 libxdamage-dev libxdamage1 libxdmcp-dev libxdmcp6 libxext-dev
  libxext6 libxfixes-dev libxfixes3 libxft-dev libxft2 libxi-dev libxi6
  libxinerama-dev libxinerama1 libxkbcommon-dev libxkbcommon0 libxml2 libxmlb2
  libxrandr-dev libxrandr2 libxrender-dev libxrender1 libxs-parse-keyword-perl
  libxshmfence1 libxtst-dev libxtst6 libxxf86vm1 libyaml-0-2 libyaml-tiny-perl
  libz3-4 m4 man-db media-types meson nettle-dev ninja-build opensp
  pango1.0-tools pkg-config po-debconf po4a python3 python3-distutils
  python3-lib2to3 python3-minimal python3-pkg-resources python3-setuptools
  python3.10 python3.10-minimal sbuild-build-depends-tilix-dummy
  shared-mime-info systemd systemd-sysv ucf uuid-dev wayland-protocols
  x11-common x11proto-core-dev x11proto-dev xkb-data xml-core
  xorg-sgml-doctools xtrans-dev zlib1g-dev
The following packages will be upgraded:
  cpp-12 g++-12 gcc-12 gcc-12-base libasan8 libatomic1 libcc1-0 libgcc-12-dev
  libgcc-s1 libgomp1 libstdc++-12-dev libstdc++6 libubsan1
13 upgraded, 339 newly installed, 0 to remove and 2 not upgraded.
Need to get 377 MB of archives.
After this operation, 863 MB of additional disk space will be used.
Get:1 copy:/<<BUILDDIR>>/resolver-6C1ZOH/apt_archive ./ sbuild-build-depends-tilix-dummy 0.invalid.0 [940 B]
Get:2 http://172.17.4.1/private bookworm-staging/main armhf libargon2-1 armhf 0~20171227-0.3 [19.6 kB]
Get:3 http://172.17.4.1/private bookworm-staging/main armhf dmsetup armhf 2:1.02.185-1 [91.8 kB]
Get:4 http://172.17.4.1/private bookworm-staging/main armhf libdevmapper1.02.1 armhf 2:1.02.185-1 [134 kB]
Get:5 http://172.17.4.1/private bookworm-staging/main armhf libjson-c5 armhf 0.16-1 [40.0 kB]
Get:6 http://172.17.4.1/private bookworm-staging/main armhf libcryptsetup12 armhf 2:2.5.0-2 [225 kB]
Get:7 http://172.17.4.1/private bookworm-staging/main armhf libfdisk1 armhf 2.38.1-1 [237 kB]
Get:8 http://172.17.4.1/private bookworm-staging/main armhf libkmod2 armhf 30+20220630-3 [51.8 kB]
Get:9 http://172.17.4.1/private bookworm-staging/main armhf libapparmor1 armhf 3.0.7-1 [98.9 kB]
Get:10 http://172.17.4.1/private bookworm-staging/main armhf libip4tc2 armhf 1.8.8-1 [32.9 kB]
Get:11 http://172.17.4.1/private bookworm-staging/main armhf libsystemd-shared armhf 251.3-1+rpi1 [1526 kB]
Get:12 http://172.17.4.1/private bookworm-staging/main armhf systemd armhf 251.3-1+rpi1 [2985 kB]
Get:13 http://172.17.4.1/private bookworm-staging/main armhf systemd-sysv armhf 251.3-1+rpi1 [123 kB]
Get:14 http://172.17.4.1/private bookworm-staging/main armhf libdbus-1-3 armhf 1.14.0-2 [210 kB]
Get:15 http://172.17.4.1/private bookworm-staging/main armhf dbus-bin armhf 1.14.0-2 [136 kB]
Get:16 http://172.17.4.1/private bookworm-staging/main armhf dbus-session-bus-common all 1.14.0-2 [111 kB]
Get:17 http://172.17.4.1/private bookworm-staging/main armhf libubsan1 armhf 12.1.0-8+rpi1 [861 kB]
Get:18 http://172.17.4.1/private bookworm-staging/main armhf gcc-12-base armhf 12.1.0-8+rpi1 [208 kB]
Get:19 http://172.17.4.1/private bookworm-staging/main armhf libgcc-s1 armhf 12.1.0-8+rpi1 [36.2 kB]
Get:20 http://172.17.4.1/private bookworm-staging/main armhf libgomp1 armhf 12.1.0-8+rpi1 [95.9 kB]
Get:21 http://172.17.4.1/private bookworm-staging/main armhf libatomic1 armhf 12.1.0-8+rpi1 [8236 B]
Get:22 http://172.17.4.1/private bookworm-staging/main armhf libasan8 armhf 12.1.0-8+rpi1 [2090 kB]
Get:23 http://172.17.4.1/private bookworm-staging/main armhf cpp-12 armhf 12.1.0-8+rpi1 [50.1 MB]
Get:24 http://172.17.4.1/private bookworm-staging/main armhf libcc1-0 armhf 12.1.0-8+rpi1 [32.2 kB]
Get:25 http://172.17.4.1/private bookworm-staging/main armhf g++-12 armhf 12.1.0-8+rpi1 [54.0 MB]
Get:26 http://172.17.4.1/private bookworm-staging/main armhf gcc-12 armhf 12.1.0-8+rpi1 [55.9 MB]
Get:27 http://172.17.4.1/private bookworm-staging/main armhf libgcc-12-dev armhf 12.1.0-8+rpi1 [725 kB]
Get:28 http://172.17.4.1/private bookworm-staging/main armhf libstdc++-12-dev armhf 12.1.0-8+rpi1 [2026 kB]
Get:29 http://172.17.4.1/private bookworm-staging/main armhf libstdc++6 armhf 12.1.0-8+rpi1 [505 kB]
Get:30 http://172.17.4.1/private bookworm-staging/main armhf libexpat1 armhf 2.4.8-1 [84.1 kB]
Get:31 http://172.17.4.1/private bookworm-staging/main armhf dbus-daemon armhf 1.14.0-2 [202 kB]
Get:32 http://172.17.4.1/private bookworm-staging/main armhf dbus-system-bus-common all 1.14.0-2 [112 kB]
Get:33 http://172.17.4.1/private bookworm-staging/main armhf dbus armhf 1.14.0-2 [128 kB]
Get:34 http://172.17.4.1/private bookworm-staging/main armhf libpython3.10-minimal armhf 3.10.6-1 [813 kB]
Get:35 http://172.17.4.1/private bookworm-staging/main armhf python3.10-minimal armhf 3.10.6-1 [1520 kB]
Get:36 http://172.17.4.1/private bookworm-staging/main armhf python3-minimal armhf 3.10.6-1 [38.7 kB]
Get:37 http://172.17.4.1/private bookworm-staging/main armhf media-types all 8.0.0 [33.4 kB]
Get:38 http://172.17.4.1/private bookworm-staging/main armhf libmpdec3 armhf 2.5.1-2+rpi1 [73.5 kB]
Get:39 http://172.17.4.1/private bookworm-staging/main armhf libpython3.10-stdlib armhf 3.10.6-1 [1596 kB]
Get:40 http://172.17.4.1/private bookworm-staging/main armhf python3.10 armhf 3.10.6-1 [545 kB]
Get:41 http://172.17.4.1/private bookworm-staging/main armhf libpython3-stdlib armhf 3.10.6-1 [21.7 kB]
Get:42 http://172.17.4.1/private bookworm-staging/main armhf python3 armhf 3.10.6-1 [38.2 kB]
Get:43 http://172.17.4.1/private bookworm-staging/main armhf libuchardet0 armhf 0.0.7-1 [65.0 kB]
Get:44 http://172.17.4.1/private bookworm-staging/main armhf groff-base armhf 1.22.4-8 [793 kB]
Get:45 http://172.17.4.1/private bookworm-staging/main armhf bsdextrautils armhf 2.38.1-1 [137 kB]
Get:46 http://172.17.4.1/private bookworm-staging/main armhf libpipeline1 armhf 1.5.6-2 [34.2 kB]
Get:47 http://172.17.4.1/private bookworm-staging/main armhf man-db armhf 2.10.2-2 [1364 kB]
Get:48 http://172.17.4.1/private bookworm-staging/main armhf libmagic-mgc armhf 1:5.41-4 [295 kB]
Get:49 http://172.17.4.1/private bookworm-staging/main armhf libmagic1 armhf 1:5.41-4 [120 kB]
Get:50 http://172.17.4.1/private bookworm-staging/main armhf file armhf 1:5.41-4 [65.8 kB]
Get:51 http://172.17.4.1/private bookworm-staging/main armhf gettext-base armhf 0.21-8 [171 kB]
Get:52 http://172.17.4.1/private bookworm-staging/main armhf libpam-systemd armhf 251.3-1+rpi1 [279 kB]
Get:53 http://172.17.4.1/private bookworm-staging/main armhf ucf all 3.0043 [74.0 kB]
Get:54 http://172.17.4.1/private bookworm-staging/main armhf hicolor-icon-theme all 0.17-2 [11.4 kB]
Get:55 http://172.17.4.1/private bookworm-staging/main armhf libgdk-pixbuf2.0-common all 2.42.9+dfsg-1 [315 kB]
Get:56 http://172.17.4.1/private bookworm-staging/main armhf libglib2.0-0 armhf 2.72.3-1 [1233 kB]
Get:57 http://172.17.4.1/private bookworm-staging/main armhf libicu71 armhf 71.1-3 [8855 kB]
Get:58 http://172.17.4.1/private bookworm-staging/main armhf libxml2 armhf 2.9.14+dfsg-1 [591 kB]
Get:59 http://172.17.4.1/private bookworm-staging/main armhf shared-mime-info armhf 2.2-1 [726 kB]
Get:60 http://172.17.4.1/private bookworm-staging/main armhf libjpeg62-turbo armhf 1:2.1.2-1 [144 kB]
Get:61 http://172.17.4.1/private bookworm-staging/main armhf libpng16-16 armhf 1.6.37-5 [272 kB]
Get:62 http://172.17.4.1/private bookworm-staging/main armhf libdeflate0 armhf 1.12-1 [60.5 kB]
Get:63 http://172.17.4.1/private bookworm-staging/main armhf libjbig0 armhf 2.1-3.1+b2 [27.6 kB]
Get:64 http://172.17.4.1/private bookworm-staging/main armhf liblerc4 armhf 4.0.0+ds-1 [121 kB]
Get:65 http://172.17.4.1/private bookworm-staging/main armhf libwebp7 armhf 1.2.2-2 [237 kB]
Get:66 http://172.17.4.1/private bookworm-staging/main armhf libtiff5 armhf 4.4.0-4 [290 kB]
Get:67 http://172.17.4.1/private bookworm-staging/main armhf libgdk-pixbuf-2.0-0 armhf 2.42.9+dfsg-1 [132 kB]
Get:68 http://172.17.4.1/private bookworm-staging/main armhf gtk-update-icon-cache armhf 3.24.34-3 [95.2 kB]
Get:69 http://172.17.4.1/private bookworm-staging/main armhf adwaita-icon-theme all 43~beta.1-2 [5118 kB]
Get:70 http://172.17.4.1/private bookworm-staging/main armhf libbrotli1 armhf 1.0.9-2+b2 [260 kB]
Get:71 http://172.17.4.1/private bookworm-staging/main armhf libnghttp2-14 armhf 1.49.0-1 [69.8 kB]
Get:72 http://172.17.4.1/private bookworm-staging/main armhf libpsl5 armhf 0.21.0-1.2 [56.2 kB]
Get:73 http://172.17.4.1/private bookworm-staging/main armhf librtmp1 armhf 2.4+20151223.gitfa8646d.1-2+b2 [54.2 kB]
Get:74 http://172.17.4.1/private bookworm-staging/main armhf libssh2-1 armhf 1.10.0-3+b1 [161 kB]
Get:75 http://172.17.4.1/private bookworm-staging/main armhf libcurl3-gnutls armhf 7.84.0-2 [315 kB]
Get:76 http://172.17.4.1/private bookworm-staging/main armhf libstemmer0d armhf 2.2.0-1 [100 kB]
Get:77 http://172.17.4.1/private bookworm-staging/main armhf libxmlb2 armhf 0.3.8-1 [49.6 kB]
Get:78 http://172.17.4.1/private bookworm-staging/main armhf libyaml-0-2 armhf 0.2.5-1 [44.6 kB]
Get:79 http://172.17.4.1/private bookworm-staging/main armhf libappstream4 armhf 0.15.4-1 [154 kB]
Get:80 http://172.17.4.1/private bookworm-staging/main armhf appstream armhf 0.15.4-1 [363 kB]
Get:81 http://172.17.4.1/private bookworm-staging/main armhf m4 armhf 1.4.19-1 [260 kB]
Get:82 http://172.17.4.1/private bookworm-staging/main armhf autoconf all 2.71-2 [343 kB]
Get:83 http://172.17.4.1/private bookworm-staging/main armhf autotools-dev all 20220109.1 [51.6 kB]
Get:84 http://172.17.4.1/private bookworm-staging/main armhf automake all 1:1.16.5-1.3 [823 kB]
Get:85 http://172.17.4.1/private bookworm-staging/main armhf autopoint all 0.21-8 [510 kB]
Get:86 http://172.17.4.1/private bookworm-staging/main armhf dbus-user-session armhf 1.14.0-2 [111 kB]
Get:87 http://172.17.4.1/private bookworm-staging/main armhf libdconf1 armhf 0.40.0-3 [42.5 kB]
Get:88 http://172.17.4.1/private bookworm-staging/main armhf dconf-service armhf 0.40.0-3 [35.4 kB]
Get:89 http://172.17.4.1/private bookworm-staging/main armhf dconf-gsettings-backend armhf 0.40.0-3 [29.4 kB]
Get:90 http://172.17.4.1/private bookworm-staging/main armhf libdebhelper-perl all 13.9 [195 kB]
Get:91 http://172.17.4.1/private bookworm-staging/main armhf libtool all 2.4.7-4 [526 kB]
Get:92 http://172.17.4.1/private bookworm-staging/main armhf dh-autoreconf all 20 [17.1 kB]
Get:93 http://172.17.4.1/private bookworm-staging/main armhf libarchive-zip-perl all 1.68-1 [104 kB]
Get:94 http://172.17.4.1/private bookworm-staging/main armhf libsub-override-perl all 0.09-3 [10.4 kB]
Get:95 http://172.17.4.1/private bookworm-staging/main armhf libfile-stripnondeterminism-perl all 1.13.0-1 [26.6 kB]
Get:96 http://172.17.4.1/private bookworm-staging/main armhf dh-strip-nondeterminism all 1.13.0-1 [15.8 kB]
Get:97 http://172.17.4.1/private bookworm-staging/main armhf libelf1 armhf 0.187-1 [175 kB]
Get:98 http://172.17.4.1/private bookworm-staging/main armhf dwz armhf 0.14-1 [83.0 kB]
Get:99 http://172.17.4.1/private bookworm-staging/main armhf gettext armhf 0.21-8 [1219 kB]
Get:100 http://172.17.4.1/private bookworm-staging/main armhf intltool-debian all 0.35.0+20060710.5 [26.8 kB]
Get:101 http://172.17.4.1/private bookworm-staging/main armhf po-debconf all 1.0.21+nmu1 [248 kB]
Get:102 http://172.17.4.1/private bookworm-staging/main armhf debhelper all 13.9 [1070 kB]
Get:103 http://172.17.4.1/private bookworm-staging/main armhf libgphobos3 armhf 12.1.0-8+rpi1 [1455 kB]
Get:104 http://172.17.4.1/private bookworm-staging/main armhf zlib1g-dev armhf 1:1.2.11.dfsg-4.1 [183 kB]
Get:105 http://172.17.4.1/private bookworm-staging/main armhf libgphobos-12-dev armhf 12.1.0-8+rpi1 [10.1 MB]
Get:106 http://172.17.4.1/private bookworm-staging/main armhf gdc-12 armhf 12.1.0-8+rpi1 [54.2 MB]
Get:107 http://172.17.4.1/private bookworm-staging/main armhf libgphobos-dev armhf 12.1.0-3+rpi1 [17.1 kB]
Get:108 http://172.17.4.1/private bookworm-staging/main armhf gdc armhf 4:12.1.0-3+rpi1 [20.2 kB]
Get:109 http://172.17.4.1/private bookworm-staging/main armhf default-d-compiler armhf 0.6.5+b4 [3300 B]
Get:110 http://172.17.4.1/private bookworm-staging/main armhf dh-dlang all 0.6.5 [5020 B]
Get:111 http://172.17.4.1/private bookworm-staging/main armhf libfreetype6 armhf 2.12.1+dfsg-3 [352 kB]
Get:112 http://172.17.4.1/private bookworm-staging/main armhf fonts-dejavu-core all 2.37-2 [1069 kB]
Get:113 http://172.17.4.1/private bookworm-staging/main armhf fontconfig-config all 2.13.1-4.4 [281 kB]
Get:114 http://172.17.4.1/private bookworm-staging/main armhf libfontconfig1 armhf 2.13.1-4.4 [331 kB]
Get:115 http://172.17.4.1/private bookworm-staging/main armhf fontconfig armhf 2.13.1-4.4 [416 kB]
Get:116 http://172.17.4.1/private bookworm-staging/main armhf gcc-11-base armhf 11.3.0-5+rpi1 [209 kB]
Get:117 http://172.17.4.1/private bookworm-staging/main armhf libgirepository-1.0-1 armhf 1.72.0-1+b1 [83.8 kB]
Get:118 http://172.17.4.1/private bookworm-staging/main armhf gir1.2-glib-2.0 armhf 1.72.0-1+b1 [155 kB]
Get:119 http://172.17.4.1/private bookworm-staging/main armhf libatk1.0-data all 2.38.0-1 [150 kB]
Get:120 http://172.17.4.1/private bookworm-staging/main armhf libatk1.0-0 armhf 2.38.0-1 [44.5 kB]
Get:121 http://172.17.4.1/private bookworm-staging/main armhf gir1.2-atk-1.0 armhf 2.38.0-1 [26.2 kB]
Get:122 http://172.17.4.1/private bookworm-staging/main armhf gir1.2-freedesktop armhf 1.72.0-1+b1 [34.2 kB]
Get:123 http://172.17.4.1/private bookworm-staging/main armhf libxau6 armhf 1:1.0.9-1 [19.1 kB]
Get:124 http://172.17.4.1/private bookworm-staging/main armhf libmd0 armhf 1.0.4-2 [28.6 kB]
Get:125 http://172.17.4.1/private bookworm-staging/main armhf libbsd0 armhf 0.11.6-1 [109 kB]
Get:126 http://172.17.4.1/private bookworm-staging/main armhf libxdmcp6 armhf 1:1.1.2-3 [25.0 kB]
Get:127 http://172.17.4.1/private bookworm-staging/main armhf libxcb1 armhf 1.15-1 [139 kB]
Get:128 http://172.17.4.1/private bookworm-staging/main armhf libx11-data all 2:1.8.1-2 [308 kB]
Get:129 http://172.17.4.1/private bookworm-staging/main armhf libx11-6 armhf 2:1.8.1-2 [704 kB]
Get:130 http://172.17.4.1/private bookworm-staging/main armhf libxext6 armhf 2:1.3.4-1 [48.0 kB]
Get:131 http://172.17.4.1/private bookworm-staging/main armhf libxi6 armhf 2:1.8-1 [78.1 kB]
Get:132 http://172.17.4.1/private bookworm-staging/main armhf libatspi2.0-0 armhf 2.44.1-1 [67.3 kB]
Get:133 http://172.17.4.1/private bookworm-staging/main armhf gir1.2-atspi-2.0 armhf 2.44.1-1 [24.1 kB]
Get:134 http://172.17.4.1/private bookworm-staging/main armhf gir1.2-gdkpixbuf-2.0 armhf 2.42.9+dfsg-1 [22.2 kB]
Get:135 http://172.17.4.1/private bookworm-staging/main armhf libgraphite2-3 armhf 1.3.14-1 [70.3 kB]
Get:136 http://172.17.4.1/private bookworm-staging/main armhf libharfbuzz0b armhf 2.7.4-1+b1 [1420 kB]
Get:137 http://172.17.4.1/private bookworm-staging/main armhf gir1.2-harfbuzz-0.0 armhf 2.7.4-1+b1 [1154 kB]
Get:138 http://172.17.4.1/private bookworm-staging/main armhf libfribidi0 armhf 1.0.8-2.1 [63.7 kB]
Get:139 http://172.17.4.1/private bookworm-staging/main armhf libthai-data all 0.1.29-1 [176 kB]
Get:140 http://172.17.4.1/private bookworm-staging/main armhf libdatrie1 armhf 0.2.13-2+b2 [39.9 kB]
Get:141 http://172.17.4.1/private bookworm-staging/main armhf libthai0 armhf 0.1.29-1 [54.5 kB]
Get:142 http://172.17.4.1/private bookworm-staging/main armhf libpango-1.0-0 armhf 1.50.9+ds-1 [214 kB]
Get:143 http://172.17.4.1/private bookworm-staging/main armhf libpixman-1-0 armhf 0.40.0-1 [463 kB]
Get:144 http://172.17.4.1/private bookworm-staging/main armhf libxcb-render0 armhf 1.15-1 [114 kB]
Get:145 http://172.17.4.1/private bookworm-staging/main armhf libxcb-shm0 armhf 1.15-1 [106 kB]
Get:146 http://172.17.4.1/private bookworm-staging/main armhf libxrender1 armhf 1:0.9.10-1.1 [30.0 kB]
Get:147 http://172.17.4.1/private bookworm-staging/main armhf libcairo2 armhf 1.16.0-6 [496 kB]
Get:148 http://172.17.4.1/private bookworm-staging/main armhf libpangoft2-1.0-0 armhf 1.50.9+ds-1 [68.6 kB]
Get:149 http://172.17.4.1/private bookworm-staging/main armhf libpangocairo-1.0-0 armhf 1.50.9+ds-1 [58.3 kB]
Get:150 http://172.17.4.1/private bookworm-staging/main armhf libxft2 armhf 2.3.4-1 [50.2 kB]
Get:151 http://172.17.4.1/private bookworm-staging/main armhf libpangoxft-1.0-0 armhf 1.50.9+ds-1 [52.3 kB]
Get:152 http://172.17.4.1/private bookworm-staging/main armhf gir1.2-pango-1.0 armhf 1.50.9+ds-1 [65.4 kB]
Get:153 http://172.17.4.1/private bookworm-staging/main armhf libatk-bridge2.0-0 armhf 2.38.0-4 [55.9 kB]
Get:154 http://172.17.4.1/private bookworm-staging/main armhf libcairo-gobject2 armhf 1.16.0-6 [125 kB]
Get:155 http://172.17.4.1/private bookworm-staging/main armhf liblcms2-2 armhf 2.13.1-1 [125 kB]
Get:156 http://172.17.4.1/private bookworm-staging/main armhf libcolord2 armhf 1.4.6-1 [122 kB]
Get:157 http://172.17.4.1/private bookworm-staging/main armhf libavahi-common-data armhf 0.8-6+b1 [124 kB]
Get:158 http://172.17.4.1/private bookworm-staging/main armhf libavahi-common3 armhf 0.8-6+b1 [55.8 kB]
Get:159 http://172.17.4.1/private bookworm-staging/main armhf libavahi-client3 armhf 0.8-6+b1 [58.5 kB]
Get:160 http://172.17.4.1/private bookworm-staging/main armhf libcups2 armhf 2.4.2-1 [311 kB]
Get:161 http://172.17.4.1/private bookworm-staging/main armhf libepoxy0 armhf 1.5.10-1 [172 kB]
Get:162 http://172.17.4.1/private bookworm-staging/main armhf libwayland-client0 armhf 1.21.0-1 [23.3 kB]
Get:163 http://172.17.4.1/private bookworm-staging/main armhf libwayland-cursor0 armhf 1.21.0-1 [13.2 kB]
Get:164 http://172.17.4.1/private bookworm-staging/main armhf libwayland-egl1 armhf 1.21.0-1 [8448 B]
Get:165 http://172.17.4.1/private bookworm-staging/main armhf libxcomposite1 armhf 1:0.4.5-1 [16.2 kB]
Get:166 http://172.17.4.1/private bookworm-staging/main armhf libxfixes3 armhf 1:6.0.0-1 [21.0 kB]
Get:167 http://172.17.4.1/private bookworm-staging/main armhf libxcursor1 armhf 1:1.2.1-1 [38.0 kB]
Get:168 http://172.17.4.1/private bookworm-staging/main armhf libxdamage1 armhf 1:1.1.5-2 [15.2 kB]
Get:169 http://172.17.4.1/private bookworm-staging/main armhf libxinerama1 armhf 2:1.1.4-3 [17.4 kB]
Get:170 http://172.17.4.1/private bookworm-staging/main armhf xkb-data all 2.35.1-1 [764 kB]
Get:171 http://172.17.4.1/private bookworm-staging/main armhf libxkbcommon0 armhf 1.4.1-1 [96.2 kB]
Get:172 http://172.17.4.1/private bookworm-staging/main armhf libxrandr2 armhf 2:1.5.2-2 [35.5 kB]
Get:173 http://172.17.4.1/private bookworm-staging/main armhf libgtk-3-common all 3.24.34-3 [3781 kB]
Get:174 http://172.17.4.1/private bookworm-staging/main armhf libgtk-3-0 armhf 3.24.34-3 [2473 kB]
Get:175 http://172.17.4.1/private bookworm-staging/main armhf gir1.2-gtk-3.0 armhf 3.24.34-3 [272 kB]
Get:176 http://172.17.4.1/private bookworm-staging/main armhf librsvg2-2 armhf 2.54.4+dfsg-1 [2262 kB]
Get:177 http://172.17.4.1/private bookworm-staging/main armhf gir1.2-rsvg-2.0 armhf 2.54.4+dfsg-1 [33.5 kB]
Get:178 http://172.17.4.1/private bookworm-staging/main armhf libsecret-common all 0.20.5-2 [28.3 kB]
Get:179 http://172.17.4.1/private bookworm-staging/main armhf libsecret-1-0 armhf 0.20.5-2 [97.2 kB]
Get:180 http://172.17.4.1/private bookworm-staging/main armhf gir1.2-secret-1 armhf 0.20.5-2 [13.4 kB]
Get:181 http://172.17.4.1/private bookworm-staging/main armhf libvte-2.91-common armhf 0.69.92-1 [652 kB]
Get:182 http://172.17.4.1/private bookworm-staging/main armhf libvte-2.91-0 armhf 0.69.92-1 [777 kB]
Get:183 http://172.17.4.1/private bookworm-staging/main armhf gir1.2-vte-2.91 armhf 0.69.92-1 [613 kB]
Get:184 http://172.17.4.1/private bookworm-staging/main armhf gnome-pkg-tools all 0.22.6 [24.2 kB]
Get:185 http://172.17.4.1/private bookworm-staging/main armhf icu-devtools armhf 71.1-3 [177 kB]
Get:186 http://172.17.4.1/private bookworm-staging/main armhf pkg-config armhf 0.29.2-1 [61.5 kB]
Get:187 http://172.17.4.1/private bookworm-staging/main armhf libffi-dev armhf 3.4.2-4 [61.7 kB]
Get:188 http://172.17.4.1/private bookworm-staging/main armhf libglib2.0-data all 2.72.3-1 [1217 kB]
Get:189 http://172.17.4.1/private bookworm-staging/main armhf libglib2.0-bin armhf 2.72.3-1 [140 kB]
Get:190 http://172.17.4.1/private bookworm-staging/main armhf python3-lib2to3 all 3.10.6-1 [79.9 kB]
Get:191 http://172.17.4.1/private bookworm-staging/main armhf python3-distutils all 3.10.6-1 [141 kB]
Get:192 http://172.17.4.1/private bookworm-staging/main armhf libglib2.0-dev-bin armhf 2.72.3-1 [184 kB]
Get:193 http://172.17.4.1/private bookworm-staging/main armhf uuid-dev armhf 2.38.1-1 [95.4 kB]
Get:194 http://172.17.4.1/private bookworm-staging/main armhf libblkid-dev armhf 2.38.1-1 [221 kB]
Get:195 http://172.17.4.1/private bookworm-staging/main armhf libsepol-dev armhf 3.4-2 [319 kB]
Get:196 http://172.17.4.1/private bookworm-staging/main armhf libpcre2-16-0 armhf 10.40-1+b2 [208 kB]
Get:197 http://172.17.4.1/private bookworm-staging/main armhf libpcre2-32-0 armhf 10.40-1+b2 [200 kB]
Get:198 http://172.17.4.1/private bookworm-staging/main armhf libpcre2-posix3 armhf 10.40-1+b2 [53.7 kB]
Get:199 http://172.17.4.1/private bookworm-staging/main armhf libpcre2-dev armhf 10.40-1+b2 [637 kB]
Get:200 http://172.17.4.1/private bookworm-staging/main armhf libselinux1-dev armhf 3.4-1 [162 kB]
Get:201 http://172.17.4.1/private bookworm-staging/main armhf libmount-dev armhf 2.38.1-1 [80.1 kB]
Get:202 http://172.17.4.1/private bookworm-staging/main armhf libpcre16-3 armhf 2:8.39-14 [239 kB]
Get:203 http://172.17.4.1/private bookworm-staging/main armhf libpcre32-3 armhf 2:8.39-14 [232 kB]
Get:204 http://172.17.4.1/private bookworm-staging/main armhf libpcrecpp0v5 armhf 2:8.39-14 [150 kB]
Get:205 http://172.17.4.1/private bookworm-staging/main armhf libpcre3-dev armhf 2:8.39-14 [569 kB]
Get:206 http://172.17.4.1/private bookworm-staging/main armhf libglib2.0-dev armhf 2.72.3-1 [1500 kB]
Get:207 http://172.17.4.1/private bookworm-staging/main armhf libatk1.0-dev armhf 2.38.0-1 [105 kB]
Get:208 http://172.17.4.1/private bookworm-staging/main armhf xml-core all 0.18+nmu1 [23.8 kB]
Get:209 http://172.17.4.1/private bookworm-staging/main armhf libdbus-1-dev armhf 1.14.0-2 [241 kB]
Get:210 http://172.17.4.1/private bookworm-staging/main armhf x11-common all 1:7.7+23 [252 kB]
Get:211 http://172.17.4.1/private bookworm-staging/main armhf libxtst6 armhf 2:1.2.3-1.1 [26.3 kB]
Get:212 http://172.17.4.1/private bookworm-staging/main armhf xorg-sgml-doctools all 1:1.11-1.1 [22.1 kB]
Get:213 http://172.17.4.1/private bookworm-staging/main armhf x11proto-dev all 2022.1-1 [599 kB]
Get:214 http://172.17.4.1/private bookworm-staging/main armhf libxau-dev armhf 1:1.0.9-1 [22.3 kB]
Get:215 http://172.17.4.1/private bookworm-staging/main armhf x11proto-core-dev all 2022.1-1 [3528 B]
Get:216 http://172.17.4.1/private bookworm-staging/main armhf libxdmcp-dev armhf 1:1.1.2-3 [40.9 kB]
Get:217 http://172.17.4.1/private bookworm-staging/main armhf xtrans-dev all 1.4.0-1 [98.7 kB]
Get:218 http://172.17.4.1/private bookworm-staging/main armhf libpthread-stubs0-dev armhf 0.4-1 [5344 B]
Get:219 http://172.17.4.1/private bookworm-staging/main armhf libxcb1-dev armhf 1.15-1 [175 kB]
Get:220 http://172.17.4.1/private bookworm-staging/main armhf libx11-dev armhf 2:1.8.1-2 [780 kB]
Get:221 http://172.17.4.1/private bookworm-staging/main armhf libxext-dev armhf 2:1.3.4-1 [102 kB]
Get:222 http://172.17.4.1/private bookworm-staging/main armhf libxfixes-dev armhf 1:6.0.0-1 [23.0 kB]
Get:223 http://172.17.4.1/private bookworm-staging/main armhf libxi-dev armhf 2:1.8-1 [238 kB]
Get:224 http://172.17.4.1/private bookworm-staging/main armhf libxtst-dev armhf 2:1.2.3-1.1 [30.6 kB]
Get:225 http://172.17.4.1/private bookworm-staging/main armhf libatspi2.0-dev armhf 2.44.1-1 [79.5 kB]
Get:226 http://172.17.4.1/private bookworm-staging/main armhf libatk-bridge2.0-dev armhf 2.38.0-4 [10.1 kB]
Get:227 http://172.17.4.1/private bookworm-staging/main armhf libbrotli-dev armhf 1.0.9-2+b2 [271 kB]
Get:228 http://172.17.4.1/private bookworm-staging/main armhf liblzo2-2 armhf 2.10-2 [50.2 kB]
Get:229 http://172.17.4.1/private bookworm-staging/main armhf libcairo-script-interpreter2 armhf 1.16.0-6 [154 kB]
Get:230 http://172.17.4.1/private bookworm-staging/main armhf libexpat1-dev armhf 2.4.8-1 [137 kB]
Get:231 http://172.17.4.1/private bookworm-staging/main armhf libpng-dev armhf 1.6.37-5 [272 kB]
Get:232 http://172.17.4.1/private bookworm-staging/main armhf libfreetype-dev armhf 2.12.1+dfsg-3 [516 kB]
Get:233 http://172.17.4.1/private bookworm-staging/main armhf libfreetype6-dev armhf 2.12.1+dfsg-3 [70.8 kB]
Get:234 http://172.17.4.1/private bookworm-staging/main armhf libfontconfig-dev armhf 2.13.1-4.4 [349 kB]
Get:235 http://172.17.4.1/private bookworm-staging/main armhf libpixman-1-dev armhf 0.40.0-1 [482 kB]
Get:236 http://172.17.4.1/private bookworm-staging/main armhf libice6 armhf 2:1.0.10-1 [51.7 kB]
Get:237 http://172.17.4.1/private bookworm-staging/main armhf libsm6 armhf 2:1.2.3-1 [32.9 kB]
Get:238 http://172.17.4.1/private bookworm-staging/main armhf libice-dev armhf 2:1.0.10-1 [58.7 kB]
Get:239 http://172.17.4.1/private bookworm-staging/main armhf libsm-dev armhf 2:1.2.3-1 [35.4 kB]
Get:240 http://172.17.4.1/private bookworm-staging/main armhf libxcb-render0-dev armhf 1.15-1 [117 kB]
Get:241 http://172.17.4.1/private bookworm-staging/main armhf libxcb-shm0-dev armhf 1.15-1 [107 kB]
Get:242 http://172.17.4.1/private bookworm-staging/main armhf libxrender-dev armhf 1:0.9.10-1.1 [37.6 kB]
Get:243 http://172.17.4.1/private bookworm-staging/main armhf libcairo2-dev armhf 1.16.0-6 [614 kB]
Get:244 http://172.17.4.1/private bookworm-staging/main armhf libdatrie-dev armhf 0.2.13-2+b2 [15.2 kB]
Get:245 http://172.17.4.1/private bookworm-staging/main armhf libdeflate-dev armhf 1.12-1 [51.8 kB]
Get:246 http://172.17.4.1/private bookworm-staging/main armhf libdrm-common all 2.4.112-3+rpi1 [15.7 kB]
Get:247 http://172.17.4.1/private bookworm-staging/main armhf libdrm2 armhf 2.4.112-3+rpi1 [41.2 kB]
Get:248 http://172.17.4.1/private bookworm-staging/main armhf libdrm-amdgpu1 armhf 2.4.112-3+rpi1 [28.3 kB]
Get:249 http://172.17.4.1/private bookworm-staging/main armhf libdrm-nouveau2 armhf 2.4.112-3+rpi1 [25.9 kB]
Get:250 http://172.17.4.1/private bookworm-staging/main armhf libdrm-radeon1 armhf 2.4.112-3+rpi1 [29.9 kB]
Get:251 http://172.17.4.1/private bookworm-staging/main armhf libedit2 armhf 3.1-20210910-1 [81.2 kB]
Get:252 http://172.17.4.1/private bookworm-staging/main armhf libglvnd0 armhf 1.5.0-1 [51.5 kB]
Get:253 http://172.17.4.1/private bookworm-staging/main armhf libwayland-server0 armhf 1.21.0-1 [29.3 kB]
Get:254 http://172.17.4.1/private bookworm-staging/main armhf libgbm1 armhf 22.2.0~rc2-1+rpi1 [74.8 kB]
Get:255 http://172.17.4.1/private bookworm-staging/main armhf libglapi-mesa armhf 22.2.0~rc2-1+rpi1 [84.4 kB]
Get:256 http://172.17.4.1/private bookworm-staging/main armhf libx11-xcb1 armhf 2:1.8.1-2 [203 kB]
Get:257 http://172.17.4.1/private bookworm-staging/main armhf libxcb-dri2-0 armhf 1.15-1 [107 kB]
Get:258 http://172.17.4.1/private bookworm-staging/main armhf libxcb-dri3-0 armhf 1.15-1 [107 kB]
Get:259 http://172.17.4.1/private bookworm-staging/main armhf libxcb-present0 armhf 1.15-1 [105 kB]
Get:260 http://172.17.4.1/private bookworm-staging/main armhf libxcb-sync1 armhf 1.15-1 [108 kB]
Get:261 http://172.17.4.1/private bookworm-staging/main armhf libxcb-xfixes0 armhf 1.15-1 [109 kB]
Get:262 http://172.17.4.1/private bookworm-staging/main armhf libxshmfence1 armhf 1.3-1 [8636 B]
Get:263 http://172.17.4.1/private bookworm-staging/main armhf libegl-mesa0 armhf 22.2.0~rc2-1+rpi1 [129 kB]
Get:264 http://172.17.4.1/private bookworm-staging/main armhf libegl1 armhf 1.5.0-1 [29.6 kB]
Get:265 http://172.17.4.1/private bookworm-staging/main armhf libxcb-glx0 armhf 1.15-1 [121 kB]
Get:266 http://172.17.4.1/private bookworm-staging/main armhf libxxf86vm1 armhf 1:1.1.4-1+b2 [20.1 kB]
Get:267 http://172.17.4.1/private bookworm-staging/main armhf libz3-4 armhf 4.8.12-1 [5758 kB]
Get:268 http://172.17.4.1/private bookworm-staging/main armhf libllvm14 armhf 1:14.0.6-2+rpi1 [19.5 MB]
Get:269 http://172.17.4.1/private bookworm-staging/main armhf libsensors-config all 1:3.6.0-7 [32.3 kB]
Get:270 http://172.17.4.1/private bookworm-staging/main armhf libsensors5 armhf 1:3.6.0-7 [49.6 kB]
Get:271 http://172.17.4.1/private bookworm-staging/main armhf libgl1-mesa-dri armhf 22.2.0~rc2-1+rpi1 [5465 kB]
Get:272 http://172.17.4.1/private bookworm-staging/main armhf libglx-mesa0 armhf 22.2.0~rc2-1+rpi1 [171 kB]
Get:273 http://172.17.4.1/private bookworm-staging/main armhf libglx0 armhf 1.5.0-1 [32.4 kB]
Get:274 http://172.17.4.1/private bookworm-staging/main armhf libgl1 armhf 1.5.0-1 [91.8 kB]
Get:275 http://172.17.4.1/private bookworm-staging/main armhf libglx-dev armhf 1.5.0-1 [16.7 kB]
Get:276 http://172.17.4.1/private bookworm-staging/main armhf libgl-dev armhf 1.5.0-1 [101 kB]
Get:277 http://172.17.4.1/private bookworm-staging/main armhf libegl-dev armhf 1.5.0-1 [20.4 kB]
Get:278 http://172.17.4.1/private bookworm-staging/main armhf libglvnd-core-dev armhf 1.5.0-1 [14.2 kB]
Get:279 http://172.17.4.1/private bookworm-staging/main armhf libgles1 armhf 1.5.0-1 [13.1 kB]
Get:280 http://172.17.4.1/private bookworm-staging/main armhf libgles2 armhf 1.5.0-1 [18.6 kB]
Get:281 http://172.17.4.1/private bookworm-staging/main armhf libgles-dev armhf 1.5.0-1 [50.7 kB]
Get:282 http://172.17.4.1/private bookworm-staging/main armhf libopengl0 armhf 1.5.0-1 [32.9 kB]
Get:283 http://172.17.4.1/private bookworm-staging/main armhf libopengl-dev armhf 1.5.0-1 [6248 B]
Get:284 http://172.17.4.1/private bookworm-staging/main armhf libglvnd-dev armhf 1.5.0-1 [6008 B]
Get:285 http://172.17.4.1/private bookworm-staging/main armhf libegl1-mesa-dev armhf 22.2.0~rc2-1+rpi1 [56.4 kB]
Get:286 http://172.17.4.1/private bookworm-staging/main armhf libepoxy-dev armhf 1.5.10-1 [128 kB]
Get:287 http://172.17.4.1/private bookworm-staging/main armhf libevent-2.1-7 armhf 2.1.12-stable-5+b1 [166 kB]
Get:288 http://172.17.4.1/private bookworm-staging/main armhf libfribidi-dev armhf 1.0.8-2.1 [103 kB]
Get:289 http://172.17.4.1/private bookworm-staging/main armhf libgpg-error-dev armhf 1.45-2 [126 kB]
Get:290 http://172.17.4.1/private bookworm-staging/main armhf libgcrypt20-dev armhf 1.10.1-2+b2 [699 kB]
Get:291 http://172.17.4.1/private bookworm-staging/main armhf libgdk-pixbuf2.0-bin armhf 2.42.9+dfsg-1 [26.2 kB]
Get:292 http://172.17.4.1/private bookworm-staging/main armhf libjpeg62-turbo-dev armhf 1:2.1.2-1 [261 kB]
Get:293 http://172.17.4.1/private bookworm-staging/main armhf libjpeg-dev armhf 1:2.1.2-1 [74.7 kB]
Get:294 http://172.17.4.1/private bookworm-staging/main armhf libjbig-dev armhf 2.1-3.1+b2 [27.7 kB]
Get:295 http://172.17.4.1/private bookworm-staging/main armhf liblzma-dev armhf 5.2.5-2.1 [218 kB]
Get:296 http://172.17.4.1/private bookworm-staging/main armhf libtiffxx5 armhf 4.4.0-4 [145 kB]
Get:297 http://172.17.4.1/private bookworm-staging/main armhf liblerc-dev armhf 4.0.0+ds-1 [136 kB]
Get:298 http://172.17.4.1/private bookworm-staging/main armhf libtiff-dev armhf 4.4.0-4 [401 kB]
Get:299 http://172.17.4.1/private bookworm-staging/main armhf libgdk-pixbuf-2.0-dev armhf 2.42.9+dfsg-1 [60.6 kB]
Get:300 http://172.17.4.1/private bookworm-staging/main armhf libgmpxx4ldbl armhf 2:6.2.1+dfsg1-1 [337 kB]
Get:301 http://172.17.4.1/private bookworm-staging/main armhf libgmp-dev armhf 2:6.2.1+dfsg1-1 [582 kB]
Get:302 http://172.17.4.1/private bookworm-staging/main armhf libunbound8 armhf 1.16.2-1 [480 kB]
Get:303 http://172.17.4.1/private bookworm-staging/main armhf libgnutls-dane0 armhf 3.7.7-2 [426 kB]
Get:304 http://172.17.4.1/private bookworm-staging/main armhf libgnutls-openssl27 armhf 3.7.7-2 [426 kB]
Get:305 http://172.17.4.1/private bookworm-staging/main armhf libgnutlsxx30 armhf 3.7.7-2 [12.0 kB]
Get:306 http://172.17.4.1/private bookworm-staging/main armhf libidn2-dev armhf 2.3.3-1 [117 kB]
Get:307 http://172.17.4.1/private bookworm-staging/main armhf libp11-kit-dev armhf 0.24.1-1 [178 kB]
Get:308 http://172.17.4.1/private bookworm-staging/main armhf libtasn1-6-dev armhf 4.18.0-4 [97.1 kB]
Get:309 http://172.17.4.1/private bookworm-staging/main armhf nettle-dev armhf 3.8.1-2 [1235 kB]
Get:310 http://172.17.4.1/private bookworm-staging/main armhf libgnutls28-dev armhf 3.7.7-2 [1256 kB]
Get:311 http://172.17.4.1/private bookworm-staging/main armhf libgphobos2 armhf 11.3.0-5+rpi1 [1263 kB]
Get:312 http://172.17.4.1/private bookworm-staging/main armhf libgraphite2-dev armhf 1.3.14-1 [24.0 kB]
Get:313 http://172.17.4.1/private bookworm-staging/main armhf libharfbuzz-icu0 armhf 2.7.4-1+b1 [1132 kB]
Get:314 http://172.17.4.1/private bookworm-staging/main armhf libharfbuzz-gobject0 armhf 2.7.4-1+b1 [1145 kB]
Get:315 http://172.17.4.1/private bookworm-staging/main armhf libicu-dev armhf 71.1-3 [9799 kB]
Get:316 http://172.17.4.1/private bookworm-staging/main armhf libharfbuzz-dev armhf 2.7.4-1+b1 [1560 kB]
Get:317 http://172.17.4.1/private bookworm-staging/main armhf libthai-dev armhf 0.1.29-1 [21.6 kB]
Get:318 http://172.17.4.1/private bookworm-staging/main armhf libxft-dev armhf 2.3.4-1 [60.6 kB]
Get:319 http://172.17.4.1/private bookworm-staging/main armhf pango1.0-tools armhf 1.50.9+ds-1 [65.1 kB]
Get:320 http://172.17.4.1/private bookworm-staging/main armhf libpango1.0-dev armhf 1.50.9+ds-1 [179 kB]
Get:321 http://172.17.4.1/private bookworm-staging/main armhf libwayland-bin armhf 1.21.0-1 [20.4 kB]
Get:322 http://172.17.4.1/private bookworm-staging/main armhf libwayland-dev armhf 1.21.0-1 [72.6 kB]
Get:323 http://172.17.4.1/private bookworm-staging/main armhf libxcomposite-dev armhf 1:0.4.5-1 [19.9 kB]
Get:324 http://172.17.4.1/private bookworm-staging/main armhf libxcursor-dev armhf 1:1.2.1-1 [48.7 kB]
Get:325 http://172.17.4.1/private bookworm-staging/main armhf libxdamage-dev armhf 1:1.1.5-2 [15.1 kB]
Get:326 http://172.17.4.1/private bookworm-staging/main armhf libxinerama-dev armhf 2:1.1.4-3 [19.7 kB]
Get:327 http://172.17.4.1/private bookworm-staging/main armhf libxkbcommon-dev armhf 1.4.1-1 [53.0 kB]
Get:328 http://172.17.4.1/private bookworm-staging/main armhf libxrandr-dev armhf 2:1.5.2-2 [43.2 kB]
Get:329 http://172.17.4.1/private bookworm-staging/main armhf wayland-protocols all 1.26-1 [70.6 kB]
Get:330 http://172.17.4.1/private bookworm-staging/main armhf libgtk-3-dev armhf 3.24.34-3 [1166 kB]
Get:331 http://172.17.4.1/private bookworm-staging/main armhf libgtkd-3-0 armhf 3.10.0-1 [3041 kB]
Get:332 http://172.17.4.1/private bookworm-staging/main armhf librsvg2-common armhf 2.54.4+dfsg-1 [33.7 kB]
Get:333 http://172.17.4.1/private bookworm-staging/main armhf librsvg2-dev armhf 2.54.4+dfsg-1 [68.9 kB]
Get:334 http://172.17.4.1/private bookworm-staging/main armhf libgtkd-3-dev armhf 3.10.0-1 [1505 kB]
Get:335 http://172.17.4.1/private bookworm-staging/main armhf libosp5 armhf 1.5.2-13 [880 kB]
Get:336 http://172.17.4.1/private bookworm-staging/main armhf libpod-parser-perl all 1.65-1 [96.3 kB]
Get:337 http://172.17.4.1/private bookworm-staging/main armhf libsecret-1-dev armhf 0.20.5-2 [143 kB]
Get:338 http://172.17.4.1/private bookworm-staging/main armhf libsgmls-perl all 1.03ii-37 [27.0 kB]
Get:339 http://172.17.4.1/private bookworm-staging/main armhf libxs-parse-keyword-perl armhf 0.25-1 [51.4 kB]
Get:340 http://172.17.4.1/private bookworm-staging/main armhf libsyntax-keyword-try-perl armhf 0.27-1 [27.5 kB]
Get:341 http://172.17.4.1/private bookworm-staging/main armhf libunwind8 armhf 1.3.2-2 [47.3 kB]
Get:342 http://172.17.4.1/private bookworm-staging/main armhf libunwind-dev armhf 1.3.2-2 [416 kB]
Get:343 http://172.17.4.1/private bookworm-staging/main armhf libvte-2.91-dev armhf 0.69.92-1 [643 kB]
Get:344 http://172.17.4.1/private bookworm-staging/main armhf libvted-3-0 armhf 3.10.0-1 [69.3 kB]
Get:345 http://172.17.4.1/private bookworm-staging/main armhf libvted-3-dev armhf 3.10.0-1 [26.6 kB]
Get:346 http://172.17.4.1/private bookworm-staging/main armhf libyaml-tiny-perl all 1.73-1 [32.3 kB]
Get:347 http://172.17.4.1/private bookworm-staging/main armhf ninja-build armhf 1.11.0-1 [109 kB]
Get:348 http://172.17.4.1/private bookworm-staging/main armhf python3-pkg-resources all 59.6.0-1.2 [196 kB]
Get:349 http://172.17.4.1/private bookworm-staging/main armhf python3-setuptools all 59.6.0-1.2 [401 kB]
Get:350 http://172.17.4.1/private bookworm-staging/main armhf meson all 0.62.2-1 [526 kB]
Get:351 http://172.17.4.1/private bookworm-staging/main armhf opensp armhf 1.5.2-13 [439 kB]
Get:352 http://172.17.4.1/private bookworm-staging/main armhf po4a all 0.67-2 [2198 kB]
debconf: delaying package configuration, since apt-utils is not installed
Fetched 377 MB in 1min 10s (5357 kB/s)
Selecting previously unselected package libargon2-1:armhf.
(Reading database ... 12802 files and directories currently installed.)
Preparing to unpack .../00-libargon2-1_0~20171227-0.3_armhf.deb ...
Unpacking libargon2-1:armhf (0~20171227-0.3) ...
Selecting previously unselected package dmsetup.
Preparing to unpack .../01-dmsetup_2%3a1.02.185-1_armhf.deb ...
Unpacking dmsetup (2:1.02.185-1) ...
Selecting previously unselected package libdevmapper1.02.1:armhf.
Preparing to unpack .../02-libdevmapper1.02.1_2%3a1.02.185-1_armhf.deb ...
Unpacking libdevmapper1.02.1:armhf (2:1.02.185-1) ...
Selecting previously unselected package libjson-c5:armhf.
Preparing to unpack .../03-libjson-c5_0.16-1_armhf.deb ...
Unpacking libjson-c5:armhf (0.16-1) ...
Selecting previously unselected package libcryptsetup12:armhf.
Preparing to unpack .../04-libcryptsetup12_2%3a2.5.0-2_armhf.deb ...
Unpacking libcryptsetup12:armhf (2:2.5.0-2) ...
Selecting previously unselected package libfdisk1:armhf.
Preparing to unpack .../05-libfdisk1_2.38.1-1_armhf.deb ...
Unpacking libfdisk1:armhf (2.38.1-1) ...
Selecting previously unselected package libkmod2:armhf.
Preparing to unpack .../06-libkmod2_30+20220630-3_armhf.deb ...
Unpacking libkmod2:armhf (30+20220630-3) ...
Selecting previously unselected package libapparmor1:armhf.
Preparing to unpack .../07-libapparmor1_3.0.7-1_armhf.deb ...
Unpacking libapparmor1:armhf (3.0.7-1) ...
Selecting previously unselected package libip4tc2:armhf.
Preparing to unpack .../08-libip4tc2_1.8.8-1_armhf.deb ...
Unpacking libip4tc2:armhf (1.8.8-1) ...
Selecting previously unselected package libsystemd-shared:armhf.
Preparing to unpack .../09-libsystemd-shared_251.3-1+rpi1_armhf.deb ...
Unpacking libsystemd-shared:armhf (251.3-1+rpi1) ...
Selecting previously unselected package systemd.
Preparing to unpack .../10-systemd_251.3-1+rpi1_armhf.deb ...
Unpacking systemd (251.3-1+rpi1) ...
Setting up libargon2-1:armhf (0~20171227-0.3) ...
Setting up libjson-c5:armhf (0.16-1) ...
Setting up libfdisk1:armhf (2.38.1-1) ...
Setting up libkmod2:armhf (30+20220630-3) ...
Setting up libapparmor1:armhf (3.0.7-1) ...
Setting up libip4tc2:armhf (1.8.8-1) ...
Setting up libsystemd-shared:armhf (251.3-1+rpi1) ...
Setting up libdevmapper1.02.1:armhf (2:1.02.185-1) ...
Setting up libcryptsetup12:armhf (2:2.5.0-2) ...
Setting up systemd (251.3-1+rpi1) ...
Created symlink /etc/systemd/system/getty.target.wants/getty@tty1.service -> /lib/systemd/system/getty@.service.
Created symlink /etc/systemd/system/multi-user.target.wants/remote-fs.target -> /lib/systemd/system/remote-fs.target.
Created symlink /etc/systemd/system/sysinit.target.wants/systemd-pstore.service -> /lib/systemd/system/systemd-pstore.service.
Initializing machine ID from random generator.
Setting up dmsetup (2:1.02.185-1) ...
Selecting previously unselected package systemd-sysv.
(Reading database ... 13698 files and directories currently installed.)
Preparing to unpack .../0-systemd-sysv_251.3-1+rpi1_armhf.deb ...
Unpacking systemd-sysv (251.3-1+rpi1) ...
Selecting previously unselected package libdbus-1-3:armhf.
Preparing to unpack .../1-libdbus-1-3_1.14.0-2_armhf.deb ...
Unpacking libdbus-1-3:armhf (1.14.0-2) ...
Selecting previously unselected package dbus-bin.
Preparing to unpack .../2-dbus-bin_1.14.0-2_armhf.deb ...
Unpacking dbus-bin (1.14.0-2) ...
Selecting previously unselected package dbus-session-bus-common.
Preparing to unpack .../3-dbus-session-bus-common_1.14.0-2_all.deb ...
Unpacking dbus-session-bus-common (1.14.0-2) ...
Preparing to unpack .../4-libubsan1_12.1.0-8+rpi1_armhf.deb ...
Unpacking libubsan1:armhf (12.1.0-8+rpi1) over (12.1.0-7+rpi1) ...
Preparing to unpack .../5-gcc-12-base_12.1.0-8+rpi1_armhf.deb ...
Unpacking gcc-12-base:armhf (12.1.0-8+rpi1) over (12.1.0-7+rpi1) ...
Setting up gcc-12-base:armhf (12.1.0-8+rpi1) ...
(Reading database ... 13749 files and directories currently installed.)
Preparing to unpack .../libgcc-s1_12.1.0-8+rpi1_armhf.deb ...
Unpacking libgcc-s1:armhf (12.1.0-8+rpi1) over (12.1.0-7+rpi1) ...
Setting up libgcc-s1:armhf (12.1.0-8+rpi1) ...
(Reading database ... 13749 files and directories currently installed.)
Preparing to unpack .../0-libgomp1_12.1.0-8+rpi1_armhf.deb ...
Unpacking libgomp1:armhf (12.1.0-8+rpi1) over (12.1.0-7+rpi1) ...
Preparing to unpack .../1-libatomic1_12.1.0-8+rpi1_armhf.deb ...
Unpacking libatomic1:armhf (12.1.0-8+rpi1) over (12.1.0-7+rpi1) ...
Preparing to unpack .../2-libasan8_12.1.0-8+rpi1_armhf.deb ...
Unpacking libasan8:armhf (12.1.0-8+rpi1) over (12.1.0-7+rpi1) ...
Preparing to unpack .../3-cpp-12_12.1.0-8+rpi1_armhf.deb ...
Unpacking cpp-12 (12.1.0-8+rpi1) over (12.1.0-7+rpi1) ...
Preparing to unpack .../4-libcc1-0_12.1.0-8+rpi1_armhf.deb ...
Unpacking libcc1-0:armhf (12.1.0-8+rpi1) over (12.1.0-7+rpi1) ...
Preparing to unpack .../5-g++-12_12.1.0-8+rpi1_armhf.deb ...
Unpacking g++-12 (12.1.0-8+rpi1) over (12.1.0-7+rpi1) ...
Preparing to unpack .../6-gcc-12_12.1.0-8+rpi1_armhf.deb ...
Unpacking gcc-12 (12.1.0-8+rpi1) over (12.1.0-7+rpi1) ...
Preparing to unpack .../7-libgcc-12-dev_12.1.0-8+rpi1_armhf.deb ...
Unpacking libgcc-12-dev:armhf (12.1.0-8+rpi1) over (12.1.0-7+rpi1) ...
Preparing to unpack .../8-libstdc++-12-dev_12.1.0-8+rpi1_armhf.deb ...
Unpacking libstdc++-12-dev:armhf (12.1.0-8+rpi1) over (12.1.0-7+rpi1) ...
Preparing to unpack .../9-libstdc++6_12.1.0-8+rpi1_armhf.deb ...
Unpacking libstdc++6:armhf (12.1.0-8+rpi1) over (12.1.0-7+rpi1) ...
Setting up libstdc++6:armhf (12.1.0-8+rpi1) ...
Selecting previously unselected package libexpat1:armhf.
(Reading database ... 13749 files and directories currently installed.)
Preparing to unpack .../0-libexpat1_2.4.8-1_armhf.deb ...
Unpacking libexpat1:armhf (2.4.8-1) ...
Selecting previously unselected package dbus-daemon.
Preparing to unpack .../1-dbus-daemon_1.14.0-2_armhf.deb ...
Unpacking dbus-daemon (1.14.0-2) ...
Selecting previously unselected package dbus-system-bus-common.
Preparing to unpack .../2-dbus-system-bus-common_1.14.0-2_all.deb ...
Unpacking dbus-system-bus-common (1.14.0-2) ...
Selecting previously unselected package dbus.
Preparing to unpack .../3-dbus_1.14.0-2_armhf.deb ...
Unpacking dbus (1.14.0-2) ...
Selecting previously unselected package libpython3.10-minimal:armhf.
Preparing to unpack .../4-libpython3.10-minimal_3.10.6-1_armhf.deb ...
Unpacking libpython3.10-minimal:armhf (3.10.6-1) ...
Selecting previously unselected package python3.10-minimal.
Preparing to unpack .../5-python3.10-minimal_3.10.6-1_armhf.deb ...
Unpacking python3.10-minimal (3.10.6-1) ...
Setting up libpython3.10-minimal:armhf (3.10.6-1) ...
Setting up libexpat1:armhf (2.4.8-1) ...
Setting up python3.10-minimal (3.10.6-1) ...
Selecting previously unselected package python3-minimal.
(Reading database ... 14092 files and directories currently installed.)
Preparing to unpack .../0-python3-minimal_3.10.6-1_armhf.deb ...
Unpacking python3-minimal (3.10.6-1) ...
Selecting previously unselected package media-types.
Preparing to unpack .../1-media-types_8.0.0_all.deb ...
Unpacking media-types (8.0.0) ...
Selecting previously unselected package libmpdec3:armhf.
Preparing to unpack .../2-libmpdec3_2.5.1-2+rpi1_armhf.deb ...
Unpacking libmpdec3:armhf (2.5.1-2+rpi1) ...
Selecting previously unselected package libpython3.10-stdlib:armhf.
Preparing to unpack .../3-libpython3.10-stdlib_3.10.6-1_armhf.deb ...
Unpacking libpython3.10-stdlib:armhf (3.10.6-1) ...
Selecting previously unselected package python3.10.
Preparing to unpack .../4-python3.10_3.10.6-1_armhf.deb ...
Unpacking python3.10 (3.10.6-1) ...
Selecting previously unselected package libpython3-stdlib:armhf.
Preparing to unpack .../5-libpython3-stdlib_3.10.6-1_armhf.deb ...
Unpacking libpython3-stdlib:armhf (3.10.6-1) ...
Setting up python3-minimal (3.10.6-1) ...
Selecting previously unselected package python3.
(Reading database ... 14494 files and directories currently installed.)
Preparing to unpack .../000-python3_3.10.6-1_armhf.deb ...
Unpacking python3 (3.10.6-1) ...
Selecting previously unselected package libuchardet0:armhf.
Preparing to unpack .../001-libuchardet0_0.0.7-1_armhf.deb ...
Unpacking libuchardet0:armhf (0.0.7-1) ...
Selecting previously unselected package groff-base.
Preparing to unpack .../002-groff-base_1.22.4-8_armhf.deb ...
Unpacking groff-base (1.22.4-8) ...
Selecting previously unselected package bsdextrautils.
Preparing to unpack .../003-bsdextrautils_2.38.1-1_armhf.deb ...
Unpacking bsdextrautils (2.38.1-1) ...
Selecting previously unselected package libpipeline1:armhf.
Preparing to unpack .../004-libpipeline1_1.5.6-2_armhf.deb ...
Unpacking libpipeline1:armhf (1.5.6-2) ...
Selecting previously unselected package man-db.
Preparing to unpack .../005-man-db_2.10.2-2_armhf.deb ...
Unpacking man-db (2.10.2-2) ...
Selecting previously unselected package libmagic-mgc.
Preparing to unpack .../006-libmagic-mgc_1%3a5.41-4_armhf.deb ...
Unpacking libmagic-mgc (1:5.41-4) ...
Selecting previously unselected package libmagic1:armhf.
Preparing to unpack .../007-libmagic1_1%3a5.41-4_armhf.deb ...
Unpacking libmagic1:armhf (1:5.41-4) ...
Selecting previously unselected package file.
Preparing to unpack .../008-file_1%3a5.41-4_armhf.deb ...
Unpacking file (1:5.41-4) ...
Selecting previously unselected package gettext-base.
Preparing to unpack .../009-gettext-base_0.21-8_armhf.deb ...
Unpacking gettext-base (0.21-8) ...
Selecting previously unselected package libpam-systemd:armhf.
Preparing to unpack .../010-libpam-systemd_251.3-1+rpi1_armhf.deb ...
Unpacking libpam-systemd:armhf (251.3-1+rpi1) ...
Selecting previously unselected package ucf.
Preparing to unpack .../011-ucf_3.0043_all.deb ...
Moving old data out of the way
Unpacking ucf (3.0043) ...
Selecting previously unselected package hicolor-icon-theme.
Preparing to unpack .../012-hicolor-icon-theme_0.17-2_all.deb ...
Unpacking hicolor-icon-theme (0.17-2) ...
Selecting previously unselected package libgdk-pixbuf2.0-common.
Preparing to unpack .../013-libgdk-pixbuf2.0-common_2.42.9+dfsg-1_all.deb ...
Unpacking libgdk-pixbuf2.0-common (2.42.9+dfsg-1) ...
Selecting previously unselected package libglib2.0-0:armhf.
Preparing to unpack .../014-libglib2.0-0_2.72.3-1_armhf.deb ...
Unpacking libglib2.0-0:armhf (2.72.3-1) ...
Selecting previously unselected package libicu71:armhf.
Preparing to unpack .../015-libicu71_71.1-3_armhf.deb ...
Unpacking libicu71:armhf (71.1-3) ...
Selecting previously unselected package libxml2:armhf.
Preparing to unpack .../016-libxml2_2.9.14+dfsg-1_armhf.deb ...
Unpacking libxml2:armhf (2.9.14+dfsg-1) ...
Selecting previously unselected package shared-mime-info.
Preparing to unpack .../017-shared-mime-info_2.2-1_armhf.deb ...
Unpacking shared-mime-info (2.2-1) ...
Selecting previously unselected package libjpeg62-turbo:armhf.
Preparing to unpack .../018-libjpeg62-turbo_1%3a2.1.2-1_armhf.deb ...
Unpacking libjpeg62-turbo:armhf (1:2.1.2-1) ...
Selecting previously unselected package libpng16-16:armhf.
Preparing to unpack .../019-libpng16-16_1.6.37-5_armhf.deb ...
Unpacking libpng16-16:armhf (1.6.37-5) ...
Selecting previously unselected package libdeflate0:armhf.
Preparing to unpack .../020-libdeflate0_1.12-1_armhf.deb ...
Unpacking libdeflate0:armhf (1.12-1) ...
Selecting previously unselected package libjbig0:armhf.
Preparing to unpack .../021-libjbig0_2.1-3.1+b2_armhf.deb ...
Unpacking libjbig0:armhf (2.1-3.1+b2) ...
Selecting previously unselected package liblerc4:armhf.
Preparing to unpack .../022-liblerc4_4.0.0+ds-1_armhf.deb ...
Unpacking liblerc4:armhf (4.0.0+ds-1) ...
Selecting previously unselected package libwebp7:armhf.
Preparing to unpack .../023-libwebp7_1.2.2-2_armhf.deb ...
Unpacking libwebp7:armhf (1.2.2-2) ...
Selecting previously unselected package libtiff5:armhf.
Preparing to unpack .../024-libtiff5_4.4.0-4_armhf.deb ...
Unpacking libtiff5:armhf (4.4.0-4) ...
Selecting previously unselected package libgdk-pixbuf-2.0-0:armhf.
Preparing to unpack .../025-libgdk-pixbuf-2.0-0_2.42.9+dfsg-1_armhf.deb ...
Unpacking libgdk-pixbuf-2.0-0:armhf (2.42.9+dfsg-1) ...
Selecting previously unselected package gtk-update-icon-cache.
Preparing to unpack .../026-gtk-update-icon-cache_3.24.34-3_armhf.deb ...
Unpacking gtk-update-icon-cache (3.24.34-3) ...
Selecting previously unselected package adwaita-icon-theme.
Preparing to unpack .../027-adwaita-icon-theme_43~beta.1-2_all.deb ...
Unpacking adwaita-icon-theme (43~beta.1-2) ...
Selecting previously unselected package libbrotli1:armhf.
Preparing to unpack .../028-libbrotli1_1.0.9-2+b2_armhf.deb ...
Unpacking libbrotli1:armhf (1.0.9-2+b2) ...
Selecting previously unselected package libnghttp2-14:armhf.
Preparing to unpack .../029-libnghttp2-14_1.49.0-1_armhf.deb ...
Unpacking libnghttp2-14:armhf (1.49.0-1) ...
Selecting previously unselected package libpsl5:armhf.
Preparing to unpack .../030-libpsl5_0.21.0-1.2_armhf.deb ...
Unpacking libpsl5:armhf (0.21.0-1.2) ...
Selecting previously unselected package librtmp1:armhf.
Preparing to unpack .../031-librtmp1_2.4+20151223.gitfa8646d.1-2+b2_armhf.deb ...
Unpacking librtmp1:armhf (2.4+20151223.gitfa8646d.1-2+b2) ...
Selecting previously unselected package libssh2-1:armhf.
Preparing to unpack .../032-libssh2-1_1.10.0-3+b1_armhf.deb ...
Unpacking libssh2-1:armhf (1.10.0-3+b1) ...
Selecting previously unselected package libcurl3-gnutls:armhf.
Preparing to unpack .../033-libcurl3-gnutls_7.84.0-2_armhf.deb ...
Unpacking libcurl3-gnutls:armhf (7.84.0-2) ...
Selecting previously unselected package libstemmer0d:armhf.
Preparing to unpack .../034-libstemmer0d_2.2.0-1_armhf.deb ...
Unpacking libstemmer0d:armhf (2.2.0-1) ...
Selecting previously unselected package libxmlb2:armhf.
Preparing to unpack .../035-libxmlb2_0.3.8-1_armhf.deb ...
Unpacking libxmlb2:armhf (0.3.8-1) ...
Selecting previously unselected package libyaml-0-2:armhf.
Preparing to unpack .../036-libyaml-0-2_0.2.5-1_armhf.deb ...
Unpacking libyaml-0-2:armhf (0.2.5-1) ...
Selecting previously unselected package libappstream4:armhf.
Preparing to unpack .../037-libappstream4_0.15.4-1_armhf.deb ...
Unpacking libappstream4:armhf (0.15.4-1) ...
Selecting previously unselected package appstream.
Preparing to unpack .../038-appstream_0.15.4-1_armhf.deb ...
Unpacking appstream (0.15.4-1) ...
Selecting previously unselected package m4.
Preparing to unpack .../039-m4_1.4.19-1_armhf.deb ...
Unpacking m4 (1.4.19-1) ...
Selecting previously unselected package autoconf.
Preparing to unpack .../040-autoconf_2.71-2_all.deb ...
Unpacking autoconf (2.71-2) ...
Selecting previously unselected package autotools-dev.
Preparing to unpack .../041-autotools-dev_20220109.1_all.deb ...
Unpacking autotools-dev (20220109.1) ...
Selecting previously unselected package automake.
Preparing to unpack .../042-automake_1%3a1.16.5-1.3_all.deb ...
Unpacking automake (1:1.16.5-1.3) ...
Selecting previously unselected package autopoint.
Preparing to unpack .../043-autopoint_0.21-8_all.deb ...
Unpacking autopoint (0.21-8) ...
Selecting previously unselected package dbus-user-session.
Preparing to unpack .../044-dbus-user-session_1.14.0-2_armhf.deb ...
Unpacking dbus-user-session (1.14.0-2) ...
Selecting previously unselected package libdconf1:armhf.
Preparing to unpack .../045-libdconf1_0.40.0-3_armhf.deb ...
Unpacking libdconf1:armhf (0.40.0-3) ...
Selecting previously unselected package dconf-service.
Preparing to unpack .../046-dconf-service_0.40.0-3_armhf.deb ...
Unpacking dconf-service (0.40.0-3) ...
Selecting previously unselected package dconf-gsettings-backend:armhf.
Preparing to unpack .../047-dconf-gsettings-backend_0.40.0-3_armhf.deb ...
Unpacking dconf-gsettings-backend:armhf (0.40.0-3) ...
Selecting previously unselected package libdebhelper-perl.
Preparing to unpack .../048-libdebhelper-perl_13.9_all.deb ...
Unpacking libdebhelper-perl (13.9) ...
Selecting previously unselected package libtool.
Preparing to unpack .../049-libtool_2.4.7-4_all.deb ...
Unpacking libtool (2.4.7-4) ...
Selecting previously unselected package dh-autoreconf.
Preparing to unpack .../050-dh-autoreconf_20_all.deb ...
Unpacking dh-autoreconf (20) ...
Selecting previously unselected package libarchive-zip-perl.
Preparing to unpack .../051-libarchive-zip-perl_1.68-1_all.deb ...
Unpacking libarchive-zip-perl (1.68-1) ...
Selecting previously unselected package libsub-override-perl.
Preparing to unpack .../052-libsub-override-perl_0.09-3_all.deb ...
Unpacking libsub-override-perl (0.09-3) ...
Selecting previously unselected package libfile-stripnondeterminism-perl.
Preparing to unpack .../053-libfile-stripnondeterminism-perl_1.13.0-1_all.deb ...
Unpacking libfile-stripnondeterminism-perl (1.13.0-1) ...
Selecting previously unselected package dh-strip-nondeterminism.
Preparing to unpack .../054-dh-strip-nondeterminism_1.13.0-1_all.deb ...
Unpacking dh-strip-nondeterminism (1.13.0-1) ...
Selecting previously unselected package libelf1:armhf.
Preparing to unpack .../055-libelf1_0.187-1_armhf.deb ...
Unpacking libelf1:armhf (0.187-1) ...
Selecting previously unselected package dwz.
Preparing to unpack .../056-dwz_0.14-1_armhf.deb ...
Unpacking dwz (0.14-1) ...
Selecting previously unselected package gettext.
Preparing to unpack .../057-gettext_0.21-8_armhf.deb ...
Unpacking gettext (0.21-8) ...
Selecting previously unselected package intltool-debian.
Preparing to unpack .../058-intltool-debian_0.35.0+20060710.5_all.deb ...
Unpacking intltool-debian (0.35.0+20060710.5) ...
Selecting previously unselected package po-debconf.
Preparing to unpack .../059-po-debconf_1.0.21+nmu1_all.deb ...
Unpacking po-debconf (1.0.21+nmu1) ...
Selecting previously unselected package debhelper.
Preparing to unpack .../060-debhelper_13.9_all.deb ...
Unpacking debhelper (13.9) ...
Selecting previously unselected package libgphobos3:armhf.
Preparing to unpack .../061-libgphobos3_12.1.0-8+rpi1_armhf.deb ...
Unpacking libgphobos3:armhf (12.1.0-8+rpi1) ...
Selecting previously unselected package zlib1g-dev:armhf.
Preparing to unpack .../062-zlib1g-dev_1%3a1.2.11.dfsg-4.1_armhf.deb ...
Unpacking zlib1g-dev:armhf (1:1.2.11.dfsg-4.1) ...
Selecting previously unselected package libgphobos-12-dev:armhf.
Preparing to unpack .../063-libgphobos-12-dev_12.1.0-8+rpi1_armhf.deb ...
Unpacking libgphobos-12-dev:armhf (12.1.0-8+rpi1) ...
Selecting previously unselected package gdc-12.
Preparing to unpack .../064-gdc-12_12.1.0-8+rpi1_armhf.deb ...
Unpacking gdc-12 (12.1.0-8+rpi1) ...
Selecting previously unselected package libgphobos-dev:armhf.
Preparing to unpack .../065-libgphobos-dev_12.1.0-3+rpi1_armhf.deb ...
Unpacking libgphobos-dev:armhf (12.1.0-3+rpi1) ...
Selecting previously unselected package gdc.
Preparing to unpack .../066-gdc_4%3a12.1.0-3+rpi1_armhf.deb ...
Unpacking gdc (4:12.1.0-3+rpi1) ...
Selecting previously unselected package default-d-compiler.
Preparing to unpack .../067-default-d-compiler_0.6.5+b4_armhf.deb ...
Unpacking default-d-compiler (0.6.5+b4) ...
Selecting previously unselected package dh-dlang.
Preparing to unpack .../068-dh-dlang_0.6.5_all.deb ...
Unpacking dh-dlang (0.6.5) ...
Selecting previously unselected package libfreetype6:armhf.
Preparing to unpack .../069-libfreetype6_2.12.1+dfsg-3_armhf.deb ...
Unpacking libfreetype6:armhf (2.12.1+dfsg-3) ...
Selecting previously unselected package fonts-dejavu-core.
Preparing to unpack .../070-fonts-dejavu-core_2.37-2_all.deb ...
Unpacking fonts-dejavu-core (2.37-2) ...
Selecting previously unselected package fontconfig-config.
Preparing to unpack .../071-fontconfig-config_2.13.1-4.4_all.deb ...
Unpacking fontconfig-config (2.13.1-4.4) ...
Selecting previously unselected package libfontconfig1:armhf.
Preparing to unpack .../072-libfontconfig1_2.13.1-4.4_armhf.deb ...
Unpacking libfontconfig1:armhf (2.13.1-4.4) ...
Selecting previously unselected package fontconfig.
Preparing to unpack .../073-fontconfig_2.13.1-4.4_armhf.deb ...
Unpacking fontconfig (2.13.1-4.4) ...
Selecting previously unselected package gcc-11-base:armhf.
Preparing to unpack .../074-gcc-11-base_11.3.0-5+rpi1_armhf.deb ...
Unpacking gcc-11-base:armhf (11.3.0-5+rpi1) ...
Selecting previously unselected package libgirepository-1.0-1:armhf.
Preparing to unpack .../075-libgirepository-1.0-1_1.72.0-1+b1_armhf.deb ...
Unpacking libgirepository-1.0-1:armhf (1.72.0-1+b1) ...
Selecting previously unselected package gir1.2-glib-2.0:armhf.
Preparing to unpack .../076-gir1.2-glib-2.0_1.72.0-1+b1_armhf.deb ...
Unpacking gir1.2-glib-2.0:armhf (1.72.0-1+b1) ...
Selecting previously unselected package libatk1.0-data.
Preparing to unpack .../077-libatk1.0-data_2.38.0-1_all.deb ...
Unpacking libatk1.0-data (2.38.0-1) ...
Selecting previously unselected package libatk1.0-0:armhf.
Preparing to unpack .../078-libatk1.0-0_2.38.0-1_armhf.deb ...
Unpacking libatk1.0-0:armhf (2.38.0-1) ...
Selecting previously unselected package gir1.2-atk-1.0:armhf.
Preparing to unpack .../079-gir1.2-atk-1.0_2.38.0-1_armhf.deb ...
Unpacking gir1.2-atk-1.0:armhf (2.38.0-1) ...
Selecting previously unselected package gir1.2-freedesktop:armhf.
Preparing to unpack .../080-gir1.2-freedesktop_1.72.0-1+b1_armhf.deb ...
Unpacking gir1.2-freedesktop:armhf (1.72.0-1+b1) ...
Selecting previously unselected package libxau6:armhf.
Preparing to unpack .../081-libxau6_1%3a1.0.9-1_armhf.deb ...
Unpacking libxau6:armhf (1:1.0.9-1) ...
Selecting previously unselected package libmd0:armhf.
Preparing to unpack .../082-libmd0_1.0.4-2_armhf.deb ...
Unpacking libmd0:armhf (1.0.4-2) ...
Selecting previously unselected package libbsd0:armhf.
Preparing to unpack .../083-libbsd0_0.11.6-1_armhf.deb ...
Unpacking libbsd0:armhf (0.11.6-1) ...
Selecting previously unselected package libxdmcp6:armhf.
Preparing to unpack .../084-libxdmcp6_1%3a1.1.2-3_armhf.deb ...
Unpacking libxdmcp6:armhf (1:1.1.2-3) ...
Selecting previously unselected package libxcb1:armhf.
Preparing to unpack .../085-libxcb1_1.15-1_armhf.deb ...
Unpacking libxcb1:armhf (1.15-1) ...
Selecting previously unselected package libx11-data.
Preparing to unpack .../086-libx11-data_2%3a1.8.1-2_all.deb ...
Unpacking libx11-data (2:1.8.1-2) ...
Selecting previously unselected package libx11-6:armhf.
Preparing to unpack .../087-libx11-6_2%3a1.8.1-2_armhf.deb ...
Unpacking libx11-6:armhf (2:1.8.1-2) ...
Selecting previously unselected package libxext6:armhf.
Preparing to unpack .../088-libxext6_2%3a1.3.4-1_armhf.deb ...
Unpacking libxext6:armhf (2:1.3.4-1) ...
Selecting previously unselected package libxi6:armhf.
Preparing to unpack .../089-libxi6_2%3a1.8-1_armhf.deb ...
Unpacking libxi6:armhf (2:1.8-1) ...
Selecting previously unselected package libatspi2.0-0:armhf.
Preparing to unpack .../090-libatspi2.0-0_2.44.1-1_armhf.deb ...
Unpacking libatspi2.0-0:armhf (2.44.1-1) ...
Selecting previously unselected package gir1.2-atspi-2.0:armhf.
Preparing to unpack .../091-gir1.2-atspi-2.0_2.44.1-1_armhf.deb ...
Unpacking gir1.2-atspi-2.0:armhf (2.44.1-1) ...
Selecting previously unselected package gir1.2-gdkpixbuf-2.0:armhf.
Preparing to unpack .../092-gir1.2-gdkpixbuf-2.0_2.42.9+dfsg-1_armhf.deb ...
Unpacking gir1.2-gdkpixbuf-2.0:armhf (2.42.9+dfsg-1) ...
Selecting previously unselected package libgraphite2-3:armhf.
Preparing to unpack .../093-libgraphite2-3_1.3.14-1_armhf.deb ...
Unpacking libgraphite2-3:armhf (1.3.14-1) ...
Selecting previously unselected package libharfbuzz0b:armhf.
Preparing to unpack .../094-libharfbuzz0b_2.7.4-1+b1_armhf.deb ...
Unpacking libharfbuzz0b:armhf (2.7.4-1+b1) ...
Selecting previously unselected package gir1.2-harfbuzz-0.0:armhf.
Preparing to unpack .../095-gir1.2-harfbuzz-0.0_2.7.4-1+b1_armhf.deb ...
Unpacking gir1.2-harfbuzz-0.0:armhf (2.7.4-1+b1) ...
Selecting previously unselected package libfribidi0:armhf.
Preparing to unpack .../096-libfribidi0_1.0.8-2.1_armhf.deb ...
Unpacking libfribidi0:armhf (1.0.8-2.1) ...
Selecting previously unselected package libthai-data.
Preparing to unpack .../097-libthai-data_0.1.29-1_all.deb ...
Unpacking libthai-data (0.1.29-1) ...
Selecting previously unselected package libdatrie1:armhf.
Preparing to unpack .../098-libdatrie1_0.2.13-2+b2_armhf.deb ...
Unpacking libdatrie1:armhf (0.2.13-2+b2) ...
Selecting previously unselected package libthai0:armhf.
Preparing to unpack .../099-libthai0_0.1.29-1_armhf.deb ...
Unpacking libthai0:armhf (0.1.29-1) ...
Selecting previously unselected package libpango-1.0-0:armhf.
Preparing to unpack .../100-libpango-1.0-0_1.50.9+ds-1_armhf.deb ...
Unpacking libpango-1.0-0:armhf (1.50.9+ds-1) ...
Selecting previously unselected package libpixman-1-0:armhf.
Preparing to unpack .../101-libpixman-1-0_0.40.0-1_armhf.deb ...
Unpacking libpixman-1-0:armhf (0.40.0-1) ...
Selecting previously unselected package libxcb-render0:armhf.
Preparing to unpack .../102-libxcb-render0_1.15-1_armhf.deb ...
Unpacking libxcb-render0:armhf (1.15-1) ...
Selecting previously unselected package libxcb-shm0:armhf.
Preparing to unpack .../103-libxcb-shm0_1.15-1_armhf.deb ...
Unpacking libxcb-shm0:armhf (1.15-1) ...
Selecting previously unselected package libxrender1:armhf.
Preparing to unpack .../104-libxrender1_1%3a0.9.10-1.1_armhf.deb ...
Unpacking libxrender1:armhf (1:0.9.10-1.1) ...
Selecting previously unselected package libcairo2:armhf.
Preparing to unpack .../105-libcairo2_1.16.0-6_armhf.deb ...
Unpacking libcairo2:armhf (1.16.0-6) ...
Selecting previously unselected package libpangoft2-1.0-0:armhf.
Preparing to unpack .../106-libpangoft2-1.0-0_1.50.9+ds-1_armhf.deb ...
Unpacking libpangoft2-1.0-0:armhf (1.50.9+ds-1) ...
Selecting previously unselected package libpangocairo-1.0-0:armhf.
Preparing to unpack .../107-libpangocairo-1.0-0_1.50.9+ds-1_armhf.deb ...
Unpacking libpangocairo-1.0-0:armhf (1.50.9+ds-1) ...
Selecting previously unselected package libxft2:armhf.
Preparing to unpack .../108-libxft2_2.3.4-1_armhf.deb ...
Unpacking libxft2:armhf (2.3.4-1) ...
Selecting previously unselected package libpangoxft-1.0-0:armhf.
Preparing to unpack .../109-libpangoxft-1.0-0_1.50.9+ds-1_armhf.deb ...
Unpacking libpangoxft-1.0-0:armhf (1.50.9+ds-1) ...
Selecting previously unselected package gir1.2-pango-1.0:armhf.
Preparing to unpack .../110-gir1.2-pango-1.0_1.50.9+ds-1_armhf.deb ...
Unpacking gir1.2-pango-1.0:armhf (1.50.9+ds-1) ...
Selecting previously unselected package libatk-bridge2.0-0:armhf.
Preparing to unpack .../111-libatk-bridge2.0-0_2.38.0-4_armhf.deb ...
Unpacking libatk-bridge2.0-0:armhf (2.38.0-4) ...
Selecting previously unselected package libcairo-gobject2:armhf.
Preparing to unpack .../112-libcairo-gobject2_1.16.0-6_armhf.deb ...
Unpacking libcairo-gobject2:armhf (1.16.0-6) ...
Selecting previously unselected package liblcms2-2:armhf.
Preparing to unpack .../113-liblcms2-2_2.13.1-1_armhf.deb ...
Unpacking liblcms2-2:armhf (2.13.1-1) ...
Selecting previously unselected package libcolord2:armhf.
Preparing to unpack .../114-libcolord2_1.4.6-1_armhf.deb ...
Unpacking libcolord2:armhf (1.4.6-1) ...
Selecting previously unselected package libavahi-common-data:armhf.
Preparing to unpack .../115-libavahi-common-data_0.8-6+b1_armhf.deb ...
Unpacking libavahi-common-data:armhf (0.8-6+b1) ...
Selecting previously unselected package libavahi-common3:armhf.
Preparing to unpack .../116-libavahi-common3_0.8-6+b1_armhf.deb ...
Unpacking libavahi-common3:armhf (0.8-6+b1) ...
Selecting previously unselected package libavahi-client3:armhf.
Preparing to unpack .../117-libavahi-client3_0.8-6+b1_armhf.deb ...
Unpacking libavahi-client3:armhf (0.8-6+b1) ...
Selecting previously unselected package libcups2:armhf.
Preparing to unpack .../118-libcups2_2.4.2-1_armhf.deb ...
Unpacking libcups2:armhf (2.4.2-1) ...
Selecting previously unselected package libepoxy0:armhf.
Preparing to unpack .../119-libepoxy0_1.5.10-1_armhf.deb ...
Unpacking libepoxy0:armhf (1.5.10-1) ...
Selecting previously unselected package libwayland-client0:armhf.
Preparing to unpack .../120-libwayland-client0_1.21.0-1_armhf.deb ...
Unpacking libwayland-client0:armhf (1.21.0-1) ...
Selecting previously unselected package libwayland-cursor0:armhf.
Preparing to unpack .../121-libwayland-cursor0_1.21.0-1_armhf.deb ...
Unpacking libwayland-cursor0:armhf (1.21.0-1) ...
Selecting previously unselected package libwayland-egl1:armhf.
Preparing to unpack .../122-libwayland-egl1_1.21.0-1_armhf.deb ...
Unpacking libwayland-egl1:armhf (1.21.0-1) ...
Selecting previously unselected package libxcomposite1:armhf.
Preparing to unpack .../123-libxcomposite1_1%3a0.4.5-1_armhf.deb ...
Unpacking libxcomposite1:armhf (1:0.4.5-1) ...
Selecting previously unselected package libxfixes3:armhf.
Preparing to unpack .../124-libxfixes3_1%3a6.0.0-1_armhf.deb ...
Unpacking libxfixes3:armhf (1:6.0.0-1) ...
Selecting previously unselected package libxcursor1:armhf.
Preparing to unpack .../125-libxcursor1_1%3a1.2.1-1_armhf.deb ...
Unpacking libxcursor1:armhf (1:1.2.1-1) ...
Selecting previously unselected package libxdamage1:armhf.
Preparing to unpack .../126-libxdamage1_1%3a1.1.5-2_armhf.deb ...
Unpacking libxdamage1:armhf (1:1.1.5-2) ...
Selecting previously unselected package libxinerama1:armhf.
Preparing to unpack .../127-libxinerama1_2%3a1.1.4-3_armhf.deb ...
Unpacking libxinerama1:armhf (2:1.1.4-3) ...
Selecting previously unselected package xkb-data.
Preparing to unpack .../128-xkb-data_2.35.1-1_all.deb ...
Unpacking xkb-data (2.35.1-1) ...
Selecting previously unselected package libxkbcommon0:armhf.
Preparing to unpack .../129-libxkbcommon0_1.4.1-1_armhf.deb ...
Unpacking libxkbcommon0:armhf (1.4.1-1) ...
Selecting previously unselected package libxrandr2:armhf.
Preparing to unpack .../130-libxrandr2_2%3a1.5.2-2_armhf.deb ...
Unpacking libxrandr2:armhf (2:1.5.2-2) ...
Selecting previously unselected package libgtk-3-common.
Preparing to unpack .../131-libgtk-3-common_3.24.34-3_all.deb ...
Unpacking libgtk-3-common (3.24.34-3) ...
Selecting previously unselected package libgtk-3-0:armhf.
Preparing to unpack .../132-libgtk-3-0_3.24.34-3_armhf.deb ...
Unpacking libgtk-3-0:armhf (3.24.34-3) ...
Selecting previously unselected package gir1.2-gtk-3.0:armhf.
Preparing to unpack .../133-gir1.2-gtk-3.0_3.24.34-3_armhf.deb ...
Unpacking gir1.2-gtk-3.0:armhf (3.24.34-3) ...
Selecting previously unselected package librsvg2-2:armhf.
Preparing to unpack .../134-librsvg2-2_2.54.4+dfsg-1_armhf.deb ...
Unpacking librsvg2-2:armhf (2.54.4+dfsg-1) ...
Selecting previously unselected package gir1.2-rsvg-2.0:armhf.
Preparing to unpack .../135-gir1.2-rsvg-2.0_2.54.4+dfsg-1_armhf.deb ...
Unpacking gir1.2-rsvg-2.0:armhf (2.54.4+dfsg-1) ...
Selecting previously unselected package libsecret-common.
Preparing to unpack .../136-libsecret-common_0.20.5-2_all.deb ...
Unpacking libsecret-common (0.20.5-2) ...
Selecting previously unselected package libsecret-1-0:armhf.
Preparing to unpack .../137-libsecret-1-0_0.20.5-2_armhf.deb ...
Unpacking libsecret-1-0:armhf (0.20.5-2) ...
Selecting previously unselected package gir1.2-secret-1:armhf.
Preparing to unpack .../138-gir1.2-secret-1_0.20.5-2_armhf.deb ...
Unpacking gir1.2-secret-1:armhf (0.20.5-2) ...
Selecting previously unselected package libvte-2.91-common.
Preparing to unpack .../139-libvte-2.91-common_0.69.92-1_armhf.deb ...
Unpacking libvte-2.91-common (0.69.92-1) ...
Selecting previously unselected package libvte-2.91-0:armhf.
Preparing to unpack .../140-libvte-2.91-0_0.69.92-1_armhf.deb ...
Unpacking libvte-2.91-0:armhf (0.69.92-1) ...
Selecting previously unselected package gir1.2-vte-2.91:armhf.
Preparing to unpack .../141-gir1.2-vte-2.91_0.69.92-1_armhf.deb ...
Unpacking gir1.2-vte-2.91:armhf (0.69.92-1) ...
Selecting previously unselected package gnome-pkg-tools.
Preparing to unpack .../142-gnome-pkg-tools_0.22.6_all.deb ...
Unpacking gnome-pkg-tools (0.22.6) ...
Selecting previously unselected package icu-devtools.
Preparing to unpack .../143-icu-devtools_71.1-3_armhf.deb ...
Unpacking icu-devtools (71.1-3) ...
Selecting previously unselected package pkg-config.
Preparing to unpack .../144-pkg-config_0.29.2-1_armhf.deb ...
Unpacking pkg-config (0.29.2-1) ...
Selecting previously unselected package libffi-dev:armhf.
Preparing to unpack .../145-libffi-dev_3.4.2-4_armhf.deb ...
Unpacking libffi-dev:armhf (3.4.2-4) ...
Selecting previously unselected package libglib2.0-data.
Preparing to unpack .../146-libglib2.0-data_2.72.3-1_all.deb ...
Unpacking libglib2.0-data (2.72.3-1) ...
Selecting previously unselected package libglib2.0-bin.
Preparing to unpack .../147-libglib2.0-bin_2.72.3-1_armhf.deb ...
Unpacking libglib2.0-bin (2.72.3-1) ...
Selecting previously unselected package python3-lib2to3.
Preparing to unpack .../148-python3-lib2to3_3.10.6-1_all.deb ...
Unpacking python3-lib2to3 (3.10.6-1) ...
Selecting previously unselected package python3-distutils.
Preparing to unpack .../149-python3-distutils_3.10.6-1_all.deb ...
Unpacking python3-distutils (3.10.6-1) ...
Selecting previously unselected package libglib2.0-dev-bin.
Preparing to unpack .../150-libglib2.0-dev-bin_2.72.3-1_armhf.deb ...
Unpacking libglib2.0-dev-bin (2.72.3-1) ...
Selecting previously unselected package uuid-dev:armhf.
Preparing to unpack .../151-uuid-dev_2.38.1-1_armhf.deb ...
Unpacking uuid-dev:armhf (2.38.1-1) ...
Selecting previously unselected package libblkid-dev:armhf.
Preparing to unpack .../152-libblkid-dev_2.38.1-1_armhf.deb ...
Unpacking libblkid-dev:armhf (2.38.1-1) ...
Selecting previously unselected package libsepol-dev:armhf.
Preparing to unpack .../153-libsepol-dev_3.4-2_armhf.deb ...
Unpacking libsepol-dev:armhf (3.4-2) ...
Selecting previously unselected package libpcre2-16-0:armhf.
Preparing to unpack .../154-libpcre2-16-0_10.40-1+b2_armhf.deb ...
Unpacking libpcre2-16-0:armhf (10.40-1+b2) ...
Selecting previously unselected package libpcre2-32-0:armhf.
Preparing to unpack .../155-libpcre2-32-0_10.40-1+b2_armhf.deb ...
Unpacking libpcre2-32-0:armhf (10.40-1+b2) ...
Selecting previously unselected package libpcre2-posix3:armhf.
Preparing to unpack .../156-libpcre2-posix3_10.40-1+b2_armhf.deb ...
Unpacking libpcre2-posix3:armhf (10.40-1+b2) ...
Selecting previously unselected package libpcre2-dev:armhf.
Preparing to unpack .../157-libpcre2-dev_10.40-1+b2_armhf.deb ...
Unpacking libpcre2-dev:armhf (10.40-1+b2) ...
Selecting previously unselected package libselinux1-dev:armhf.
Preparing to unpack .../158-libselinux1-dev_3.4-1_armhf.deb ...
Unpacking libselinux1-dev:armhf (3.4-1) ...
Selecting previously unselected package libmount-dev:armhf.
Preparing to unpack .../159-libmount-dev_2.38.1-1_armhf.deb ...
Unpacking libmount-dev:armhf (2.38.1-1) ...
Selecting previously unselected package libpcre16-3:armhf.
Preparing to unpack .../160-libpcre16-3_2%3a8.39-14_armhf.deb ...
Unpacking libpcre16-3:armhf (2:8.39-14) ...
Selecting previously unselected package libpcre32-3:armhf.
Preparing to unpack .../161-libpcre32-3_2%3a8.39-14_armhf.deb ...
Unpacking libpcre32-3:armhf (2:8.39-14) ...
Selecting previously unselected package libpcrecpp0v5:armhf.
Preparing to unpack .../162-libpcrecpp0v5_2%3a8.39-14_armhf.deb ...
Unpacking libpcrecpp0v5:armhf (2:8.39-14) ...
Selecting previously unselected package libpcre3-dev:armhf.
Preparing to unpack .../163-libpcre3-dev_2%3a8.39-14_armhf.deb ...
Unpacking libpcre3-dev:armhf (2:8.39-14) ...
Selecting previously unselected package libglib2.0-dev:armhf.
Preparing to unpack .../164-libglib2.0-dev_2.72.3-1_armhf.deb ...
Unpacking libglib2.0-dev:armhf (2.72.3-1) ...
Selecting previously unselected package libatk1.0-dev:armhf.
Preparing to unpack .../165-libatk1.0-dev_2.38.0-1_armhf.deb ...
Unpacking libatk1.0-dev:armhf (2.38.0-1) ...
Selecting previously unselected package xml-core.
Preparing to unpack .../166-xml-core_0.18+nmu1_all.deb ...
Unpacking xml-core (0.18+nmu1) ...
Selecting previously unselected package libdbus-1-dev:armhf.
Preparing to unpack .../167-libdbus-1-dev_1.14.0-2_armhf.deb ...
Unpacking libdbus-1-dev:armhf (1.14.0-2) ...
Selecting previously unselected package x11-common.
Preparing to unpack .../168-x11-common_1%3a7.7+23_all.deb ...
Unpacking x11-common (1:7.7+23) ...
Selecting previously unselected package libxtst6:armhf.
Preparing to unpack .../169-libxtst6_2%3a1.2.3-1.1_armhf.deb ...
Unpacking libxtst6:armhf (2:1.2.3-1.1) ...
Selecting previously unselected package xorg-sgml-doctools.
Preparing to unpack .../170-xorg-sgml-doctools_1%3a1.11-1.1_all.deb ...
Unpacking xorg-sgml-doctools (1:1.11-1.1) ...
Selecting previously unselected package x11proto-dev.
Preparing to unpack .../171-x11proto-dev_2022.1-1_all.deb ...
Unpacking x11proto-dev (2022.1-1) ...
Selecting previously unselected package libxau-dev:armhf.
Preparing to unpack .../172-libxau-dev_1%3a1.0.9-1_armhf.deb ...
Unpacking libxau-dev:armhf (1:1.0.9-1) ...
Selecting previously unselected package x11proto-core-dev.
Preparing to unpack .../173-x11proto-core-dev_2022.1-1_all.deb ...
Unpacking x11proto-core-dev (2022.1-1) ...
Selecting previously unselected package libxdmcp-dev:armhf.
Preparing to unpack .../174-libxdmcp-dev_1%3a1.1.2-3_armhf.deb ...
Unpacking libxdmcp-dev:armhf (1:1.1.2-3) ...
Selecting previously unselected package xtrans-dev.
Preparing to unpack .../175-xtrans-dev_1.4.0-1_all.deb ...
Unpacking xtrans-dev (1.4.0-1) ...
Selecting previously unselected package libpthread-stubs0-dev:armhf.
Preparing to unpack .../176-libpthread-stubs0-dev_0.4-1_armhf.deb ...
Unpacking libpthread-stubs0-dev:armhf (0.4-1) ...
Selecting previously unselected package libxcb1-dev:armhf.
Preparing to unpack .../177-libxcb1-dev_1.15-1_armhf.deb ...
Unpacking libxcb1-dev:armhf (1.15-1) ...
Selecting previously unselected package libx11-dev:armhf.
Preparing to unpack .../178-libx11-dev_2%3a1.8.1-2_armhf.deb ...
Unpacking libx11-dev:armhf (2:1.8.1-2) ...
Selecting previously unselected package libxext-dev:armhf.
Preparing to unpack .../179-libxext-dev_2%3a1.3.4-1_armhf.deb ...
Unpacking libxext-dev:armhf (2:1.3.4-1) ...
Selecting previously unselected package libxfixes-dev:armhf.
Preparing to unpack .../180-libxfixes-dev_1%3a6.0.0-1_armhf.deb ...
Unpacking libxfixes-dev:armhf (1:6.0.0-1) ...
Selecting previously unselected package libxi-dev:armhf.
Preparing to unpack .../181-libxi-dev_2%3a1.8-1_armhf.deb ...
Unpacking libxi-dev:armhf (2:1.8-1) ...
Selecting previously unselected package libxtst-dev:armhf.
Preparing to unpack .../182-libxtst-dev_2%3a1.2.3-1.1_armhf.deb ...
Unpacking libxtst-dev:armhf (2:1.2.3-1.1) ...
Selecting previously unselected package libatspi2.0-dev:armhf.
Preparing to unpack .../183-libatspi2.0-dev_2.44.1-1_armhf.deb ...
Unpacking libatspi2.0-dev:armhf (2.44.1-1) ...
Selecting previously unselected package libatk-bridge2.0-dev:armhf.
Preparing to unpack .../184-libatk-bridge2.0-dev_2.38.0-4_armhf.deb ...
Unpacking libatk-bridge2.0-dev:armhf (2.38.0-4) ...
Selecting previously unselected package libbrotli-dev:armhf.
Preparing to unpack .../185-libbrotli-dev_1.0.9-2+b2_armhf.deb ...
Unpacking libbrotli-dev:armhf (1.0.9-2+b2) ...
Selecting previously unselected package liblzo2-2:armhf.
Preparing to unpack .../186-liblzo2-2_2.10-2_armhf.deb ...
Unpacking liblzo2-2:armhf (2.10-2) ...
Selecting previously unselected package libcairo-script-interpreter2:armhf.
Preparing to unpack .../187-libcairo-script-interpreter2_1.16.0-6_armhf.deb ...
Unpacking libcairo-script-interpreter2:armhf (1.16.0-6) ...
Selecting previously unselected package libexpat1-dev:armhf.
Preparing to unpack .../188-libexpat1-dev_2.4.8-1_armhf.deb ...
Unpacking libexpat1-dev:armhf (2.4.8-1) ...
Selecting previously unselected package libpng-dev:armhf.
Preparing to unpack .../189-libpng-dev_1.6.37-5_armhf.deb ...
Unpacking libpng-dev:armhf (1.6.37-5) ...
Selecting previously unselected package libfreetype-dev:armhf.
Preparing to unpack .../190-libfreetype-dev_2.12.1+dfsg-3_armhf.deb ...
Unpacking libfreetype-dev:armhf (2.12.1+dfsg-3) ...
Selecting previously unselected package libfreetype6-dev:armhf.
Preparing to unpack .../191-libfreetype6-dev_2.12.1+dfsg-3_armhf.deb ...
Unpacking libfreetype6-dev:armhf (2.12.1+dfsg-3) ...
Selecting previously unselected package libfontconfig-dev:armhf.
Preparing to unpack .../192-libfontconfig-dev_2.13.1-4.4_armhf.deb ...
Unpacking libfontconfig-dev:armhf (2.13.1-4.4) ...
Selecting previously unselected package libpixman-1-dev:armhf.
Preparing to unpack .../193-libpixman-1-dev_0.40.0-1_armhf.deb ...
Unpacking libpixman-1-dev:armhf (0.40.0-1) ...
Selecting previously unselected package libice6:armhf.
Preparing to unpack .../194-libice6_2%3a1.0.10-1_armhf.deb ...
Unpacking libice6:armhf (2:1.0.10-1) ...
Selecting previously unselected package libsm6:armhf.
Preparing to unpack .../195-libsm6_2%3a1.2.3-1_armhf.deb ...
Unpacking libsm6:armhf (2:1.2.3-1) ...
Selecting previously unselected package libice-dev:armhf.
Preparing to unpack .../196-libice-dev_2%3a1.0.10-1_armhf.deb ...
Unpacking libice-dev:armhf (2:1.0.10-1) ...
Selecting previously unselected package libsm-dev:armhf.
Preparing to unpack .../197-libsm-dev_2%3a1.2.3-1_armhf.deb ...
Unpacking libsm-dev:armhf (2:1.2.3-1) ...
Selecting previously unselected package libxcb-render0-dev:armhf.
Preparing to unpack .../198-libxcb-render0-dev_1.15-1_armhf.deb ...
Unpacking libxcb-render0-dev:armhf (1.15-1) ...
Selecting previously unselected package libxcb-shm0-dev:armhf.
Preparing to unpack .../199-libxcb-shm0-dev_1.15-1_armhf.deb ...
Unpacking libxcb-shm0-dev:armhf (1.15-1) ...
Selecting previously unselected package libxrender-dev:armhf.
Preparing to unpack .../200-libxrender-dev_1%3a0.9.10-1.1_armhf.deb ...
Unpacking libxrender-dev:armhf (1:0.9.10-1.1) ...
Selecting previously unselected package libcairo2-dev:armhf.
Preparing to unpack .../201-libcairo2-dev_1.16.0-6_armhf.deb ...
Unpacking libcairo2-dev:armhf (1.16.0-6) ...
Selecting previously unselected package libdatrie-dev:armhf.
Preparing to unpack .../202-libdatrie-dev_0.2.13-2+b2_armhf.deb ...
Unpacking libdatrie-dev:armhf (0.2.13-2+b2) ...
Selecting previously unselected package libdeflate-dev:armhf.
Preparing to unpack .../203-libdeflate-dev_1.12-1_armhf.deb ...
Unpacking libdeflate-dev:armhf (1.12-1) ...
Selecting previously unselected package libdrm-common.
Preparing to unpack .../204-libdrm-common_2.4.112-3+rpi1_all.deb ...
Unpacking libdrm-common (2.4.112-3+rpi1) ...
Selecting previously unselected package libdrm2:armhf.
Preparing to unpack .../205-libdrm2_2.4.112-3+rpi1_armhf.deb ...
Unpacking libdrm2:armhf (2.4.112-3+rpi1) ...
Selecting previously unselected package libdrm-amdgpu1:armhf.
Preparing to unpack .../206-libdrm-amdgpu1_2.4.112-3+rpi1_armhf.deb ...
Unpacking libdrm-amdgpu1:armhf (2.4.112-3+rpi1) ...
Selecting previously unselected package libdrm-nouveau2:armhf.
Preparing to unpack .../207-libdrm-nouveau2_2.4.112-3+rpi1_armhf.deb ...
Unpacking libdrm-nouveau2:armhf (2.4.112-3+rpi1) ...
Selecting previously unselected package libdrm-radeon1:armhf.
Preparing to unpack .../208-libdrm-radeon1_2.4.112-3+rpi1_armhf.deb ...
Unpacking libdrm-radeon1:armhf (2.4.112-3+rpi1) ...
Selecting previously unselected package libedit2:armhf.
Preparing to unpack .../209-libedit2_3.1-20210910-1_armhf.deb ...
Unpacking libedit2:armhf (3.1-20210910-1) ...
Selecting previously unselected package libglvnd0:armhf.
Preparing to unpack .../210-libglvnd0_1.5.0-1_armhf.deb ...
Unpacking libglvnd0:armhf (1.5.0-1) ...
Selecting previously unselected package libwayland-server0:armhf.
Preparing to unpack .../211-libwayland-server0_1.21.0-1_armhf.deb ...
Unpacking libwayland-server0:armhf (1.21.0-1) ...
Selecting previously unselected package libgbm1:armhf.
Preparing to unpack .../212-libgbm1_22.2.0~rc2-1+rpi1_armhf.deb ...
Unpacking libgbm1:armhf (22.2.0~rc2-1+rpi1) ...
Selecting previously unselected package libglapi-mesa:armhf.
Preparing to unpack .../213-libglapi-mesa_22.2.0~rc2-1+rpi1_armhf.deb ...
Unpacking libglapi-mesa:armhf (22.2.0~rc2-1+rpi1) ...
Selecting previously unselected package libx11-xcb1:armhf.
Preparing to unpack .../214-libx11-xcb1_2%3a1.8.1-2_armhf.deb ...
Unpacking libx11-xcb1:armhf (2:1.8.1-2) ...
Selecting previously unselected package libxcb-dri2-0:armhf.
Preparing to unpack .../215-libxcb-dri2-0_1.15-1_armhf.deb ...
Unpacking libxcb-dri2-0:armhf (1.15-1) ...
Selecting previously unselected package libxcb-dri3-0:armhf.
Preparing to unpack .../216-libxcb-dri3-0_1.15-1_armhf.deb ...
Unpacking libxcb-dri3-0:armhf (1.15-1) ...
Selecting previously unselected package libxcb-present0:armhf.
Preparing to unpack .../217-libxcb-present0_1.15-1_armhf.deb ...
Unpacking libxcb-present0:armhf (1.15-1) ...
Selecting previously unselected package libxcb-sync1:armhf.
Preparing to unpack .../218-libxcb-sync1_1.15-1_armhf.deb ...
Unpacking libxcb-sync1:armhf (1.15-1) ...
Selecting previously unselected package libxcb-xfixes0:armhf.
Preparing to unpack .../219-libxcb-xfixes0_1.15-1_armhf.deb ...
Unpacking libxcb-xfixes0:armhf (1.15-1) ...
Selecting previously unselected package libxshmfence1:armhf.
Preparing to unpack .../220-libxshmfence1_1.3-1_armhf.deb ...
Unpacking libxshmfence1:armhf (1.3-1) ...
Selecting previously unselected package libegl-mesa0:armhf.
Preparing to unpack .../221-libegl-mesa0_22.2.0~rc2-1+rpi1_armhf.deb ...
Unpacking libegl-mesa0:armhf (22.2.0~rc2-1+rpi1) ...
Selecting previously unselected package libegl1:armhf.
Preparing to unpack .../222-libegl1_1.5.0-1_armhf.deb ...
Unpacking libegl1:armhf (1.5.0-1) ...
Selecting previously unselected package libxcb-glx0:armhf.
Preparing to unpack .../223-libxcb-glx0_1.15-1_armhf.deb ...
Unpacking libxcb-glx0:armhf (1.15-1) ...
Selecting previously unselected package libxxf86vm1:armhf.
Preparing to unpack .../224-libxxf86vm1_1%3a1.1.4-1+b2_armhf.deb ...
Unpacking libxxf86vm1:armhf (1:1.1.4-1+b2) ...
Selecting previously unselected package libz3-4:armhf.
Preparing to unpack .../225-libz3-4_4.8.12-1_armhf.deb ...
Unpacking libz3-4:armhf (4.8.12-1) ...
Selecting previously unselected package libllvm14:armhf.
Preparing to unpack .../226-libllvm14_1%3a14.0.6-2+rpi1_armhf.deb ...
Unpacking libllvm14:armhf (1:14.0.6-2+rpi1) ...
Selecting previously unselected package libsensors-config.
Preparing to unpack .../227-libsensors-config_1%3a3.6.0-7_all.deb ...
Unpacking libsensors-config (1:3.6.0-7) ...
Selecting previously unselected package libsensors5:armhf.
Preparing to unpack .../228-libsensors5_1%3a3.6.0-7_armhf.deb ...
Unpacking libsensors5:armhf (1:3.6.0-7) ...
Selecting previously unselected package libgl1-mesa-dri:armhf.
Preparing to unpack .../229-libgl1-mesa-dri_22.2.0~rc2-1+rpi1_armhf.deb ...
Unpacking libgl1-mesa-dri:armhf (22.2.0~rc2-1+rpi1) ...
Selecting previously unselected package libglx-mesa0:armhf.
Preparing to unpack .../230-libglx-mesa0_22.2.0~rc2-1+rpi1_armhf.deb ...
Unpacking libglx-mesa0:armhf (22.2.0~rc2-1+rpi1) ...
Selecting previously unselected package libglx0:armhf.
Preparing to unpack .../231-libglx0_1.5.0-1_armhf.deb ...
Unpacking libglx0:armhf (1.5.0-1) ...
Selecting previously unselected package libgl1:armhf.
Preparing to unpack .../232-libgl1_1.5.0-1_armhf.deb ...
Unpacking libgl1:armhf (1.5.0-1) ...
Selecting previously unselected package libglx-dev:armhf.
Preparing to unpack .../233-libglx-dev_1.5.0-1_armhf.deb ...
Unpacking libglx-dev:armhf (1.5.0-1) ...
Selecting previously unselected package libgl-dev:armhf.
Preparing to unpack .../234-libgl-dev_1.5.0-1_armhf.deb ...
Unpacking libgl-dev:armhf (1.5.0-1) ...
Selecting previously unselected package libegl-dev:armhf.
Preparing to unpack .../235-libegl-dev_1.5.0-1_armhf.deb ...
Unpacking libegl-dev:armhf (1.5.0-1) ...
Selecting previously unselected package libglvnd-core-dev:armhf.
Preparing to unpack .../236-libglvnd-core-dev_1.5.0-1_armhf.deb ...
Unpacking libglvnd-core-dev:armhf (1.5.0-1) ...
Selecting previously unselected package libgles1:armhf.
Preparing to unpack .../237-libgles1_1.5.0-1_armhf.deb ...
Unpacking libgles1:armhf (1.5.0-1) ...
Selecting previously unselected package libgles2:armhf.
Preparing to unpack .../238-libgles2_1.5.0-1_armhf.deb ...
Unpacking libgles2:armhf (1.5.0-1) ...
Selecting previously unselected package libgles-dev:armhf.
Preparing to unpack .../239-libgles-dev_1.5.0-1_armhf.deb ...
Unpacking libgles-dev:armhf (1.5.0-1) ...
Selecting previously unselected package libopengl0:armhf.
Preparing to unpack .../240-libopengl0_1.5.0-1_armhf.deb ...
Unpacking libopengl0:armhf (1.5.0-1) ...
Selecting previously unselected package libopengl-dev:armhf.
Preparing to unpack .../241-libopengl-dev_1.5.0-1_armhf.deb ...
Unpacking libopengl-dev:armhf (1.5.0-1) ...
Selecting previously unselected package libglvnd-dev:armhf.
Preparing to unpack .../242-libglvnd-dev_1.5.0-1_armhf.deb ...
Unpacking libglvnd-dev:armhf (1.5.0-1) ...
Selecting previously unselected package libegl1-mesa-dev:armhf.
Preparing to unpack .../243-libegl1-mesa-dev_22.2.0~rc2-1+rpi1_armhf.deb ...
Unpacking libegl1-mesa-dev:armhf (22.2.0~rc2-1+rpi1) ...
Selecting previously unselected package libepoxy-dev:armhf.
Preparing to unpack .../244-libepoxy-dev_1.5.10-1_armhf.deb ...
Unpacking libepoxy-dev:armhf (1.5.10-1) ...
Selecting previously unselected package libevent-2.1-7:armhf.
Preparing to unpack .../245-libevent-2.1-7_2.1.12-stable-5+b1_armhf.deb ...
Unpacking libevent-2.1-7:armhf (2.1.12-stable-5+b1) ...
Selecting previously unselected package libfribidi-dev:armhf.
Preparing to unpack .../246-libfribidi-dev_1.0.8-2.1_armhf.deb ...
Unpacking libfribidi-dev:armhf (1.0.8-2.1) ...
Selecting previously unselected package libgpg-error-dev.
Preparing to unpack .../247-libgpg-error-dev_1.45-2_armhf.deb ...
Unpacking libgpg-error-dev (1.45-2) ...
Selecting previously unselected package libgcrypt20-dev.
Preparing to unpack .../248-libgcrypt20-dev_1.10.1-2+b2_armhf.deb ...
Unpacking libgcrypt20-dev (1.10.1-2+b2) ...
Selecting previously unselected package libgdk-pixbuf2.0-bin.
Preparing to unpack .../249-libgdk-pixbuf2.0-bin_2.42.9+dfsg-1_armhf.deb ...
Unpacking libgdk-pixbuf2.0-bin (2.42.9+dfsg-1) ...
Selecting previously unselected package libjpeg62-turbo-dev:armhf.
Preparing to unpack .../250-libjpeg62-turbo-dev_1%3a2.1.2-1_armhf.deb ...
Unpacking libjpeg62-turbo-dev:armhf (1:2.1.2-1) ...
Selecting previously unselected package libjpeg-dev:armhf.
Preparing to unpack .../251-libjpeg-dev_1%3a2.1.2-1_armhf.deb ...
Unpacking libjpeg-dev:armhf (1:2.1.2-1) ...
Selecting previously unselected package libjbig-dev:armhf.
Preparing to unpack .../252-libjbig-dev_2.1-3.1+b2_armhf.deb ...
Unpacking libjbig-dev:armhf (2.1-3.1+b2) ...
Selecting previously unselected package liblzma-dev:armhf.
Preparing to unpack .../253-liblzma-dev_5.2.5-2.1_armhf.deb ...
Unpacking liblzma-dev:armhf (5.2.5-2.1) ...
Selecting previously unselected package libtiffxx5:armhf.
Preparing to unpack .../254-libtiffxx5_4.4.0-4_armhf.deb ...
Unpacking libtiffxx5:armhf (4.4.0-4) ...
Selecting previously unselected package liblerc-dev:armhf.
Preparing to unpack .../255-liblerc-dev_4.0.0+ds-1_armhf.deb ...
Unpacking liblerc-dev:armhf (4.0.0+ds-1) ...
Selecting previously unselected package libtiff-dev:armhf.
Preparing to unpack .../256-libtiff-dev_4.4.0-4_armhf.deb ...
Unpacking libtiff-dev:armhf (4.4.0-4) ...
Selecting previously unselected package libgdk-pixbuf-2.0-dev:armhf.
Preparing to unpack .../257-libgdk-pixbuf-2.0-dev_2.42.9+dfsg-1_armhf.deb ...
Unpacking libgdk-pixbuf-2.0-dev:armhf (2.42.9+dfsg-1) ...
Selecting previously unselected package libgmpxx4ldbl:armhf.
Preparing to unpack .../258-libgmpxx4ldbl_2%3a6.2.1+dfsg1-1_armhf.deb ...
Unpacking libgmpxx4ldbl:armhf (2:6.2.1+dfsg1-1) ...
Selecting previously unselected package libgmp-dev:armhf.
Preparing to unpack .../259-libgmp-dev_2%3a6.2.1+dfsg1-1_armhf.deb ...
Unpacking libgmp-dev:armhf (2:6.2.1+dfsg1-1) ...
Selecting previously unselected package libunbound8:armhf.
Preparing to unpack .../260-libunbound8_1.16.2-1_armhf.deb ...
Unpacking libunbound8:armhf (1.16.2-1) ...
Selecting previously unselected package libgnutls-dane0:armhf.
Preparing to unpack .../261-libgnutls-dane0_3.7.7-2_armhf.deb ...
Unpacking libgnutls-dane0:armhf (3.7.7-2) ...
Selecting previously unselected package libgnutls-openssl27:armhf.
Preparing to unpack .../262-libgnutls-openssl27_3.7.7-2_armhf.deb ...
Unpacking libgnutls-openssl27:armhf (3.7.7-2) ...
Selecting previously unselected package libgnutlsxx30:armhf.
Preparing to unpack .../263-libgnutlsxx30_3.7.7-2_armhf.deb ...
Unpacking libgnutlsxx30:armhf (3.7.7-2) ...
Selecting previously unselected package libidn2-dev:armhf.
Preparing to unpack .../264-libidn2-dev_2.3.3-1_armhf.deb ...
Unpacking libidn2-dev:armhf (2.3.3-1) ...
Selecting previously unselected package libp11-kit-dev:armhf.
Preparing to unpack .../265-libp11-kit-dev_0.24.1-1_armhf.deb ...
Unpacking libp11-kit-dev:armhf (0.24.1-1) ...
Selecting previously unselected package libtasn1-6-dev:armhf.
Preparing to unpack .../266-libtasn1-6-dev_4.18.0-4_armhf.deb ...
Unpacking libtasn1-6-dev:armhf (4.18.0-4) ...
Selecting previously unselected package nettle-dev:armhf.
Preparing to unpack .../267-nettle-dev_3.8.1-2_armhf.deb ...
Unpacking nettle-dev:armhf (3.8.1-2) ...
Selecting previously unselected package libgnutls28-dev:armhf.
Preparing to unpack .../268-libgnutls28-dev_3.7.7-2_armhf.deb ...
Unpacking libgnutls28-dev:armhf (3.7.7-2) ...
Selecting previously unselected package libgphobos2:armhf.
Preparing to unpack .../269-libgphobos2_11.3.0-5+rpi1_armhf.deb ...
Unpacking libgphobos2:armhf (11.3.0-5+rpi1) ...
Selecting previously unselected package libgraphite2-dev:armhf.
Preparing to unpack .../270-libgraphite2-dev_1.3.14-1_armhf.deb ...
Unpacking libgraphite2-dev:armhf (1.3.14-1) ...
Selecting previously unselected package libharfbuzz-icu0:armhf.
Preparing to unpack .../271-libharfbuzz-icu0_2.7.4-1+b1_armhf.deb ...
Unpacking libharfbuzz-icu0:armhf (2.7.4-1+b1) ...
Selecting previously unselected package libharfbuzz-gobject0:armhf.
Preparing to unpack .../272-libharfbuzz-gobject0_2.7.4-1+b1_armhf.deb ...
Unpacking libharfbuzz-gobject0:armhf (2.7.4-1+b1) ...
Selecting previously unselected package libicu-dev:armhf.
Preparing to unpack .../273-libicu-dev_71.1-3_armhf.deb ...
Unpacking libicu-dev:armhf (71.1-3) ...
Selecting previously unselected package libharfbuzz-dev:armhf.
Preparing to unpack .../274-libharfbuzz-dev_2.7.4-1+b1_armhf.deb ...
Unpacking libharfbuzz-dev:armhf (2.7.4-1+b1) ...
Selecting previously unselected package libthai-dev:armhf.
Preparing to unpack .../275-libthai-dev_0.1.29-1_armhf.deb ...
Unpacking libthai-dev:armhf (0.1.29-1) ...
Selecting previously unselected package libxft-dev:armhf.
Preparing to unpack .../276-libxft-dev_2.3.4-1_armhf.deb ...
Unpacking libxft-dev:armhf (2.3.4-1) ...
Selecting previously unselected package pango1.0-tools.
Preparing to unpack .../277-pango1.0-tools_1.50.9+ds-1_armhf.deb ...
Unpacking pango1.0-tools (1.50.9+ds-1) ...
Selecting previously unselected package libpango1.0-dev:armhf.
Preparing to unpack .../278-libpango1.0-dev_1.50.9+ds-1_armhf.deb ...
Unpacking libpango1.0-dev:armhf (1.50.9+ds-1) ...
Selecting previously unselected package libwayland-bin.
Preparing to unpack .../279-libwayland-bin_1.21.0-1_armhf.deb ...
Unpacking libwayland-bin (1.21.0-1) ...
Selecting previously unselected package libwayland-dev:armhf.
Preparing to unpack .../280-libwayland-dev_1.21.0-1_armhf.deb ...
Unpacking libwayland-dev:armhf (1.21.0-1) ...
Selecting previously unselected package libxcomposite-dev:armhf.
Preparing to unpack .../281-libxcomposite-dev_1%3a0.4.5-1_armhf.deb ...
Unpacking libxcomposite-dev:armhf (1:0.4.5-1) ...
Selecting previously unselected package libxcursor-dev:armhf.
Preparing to unpack .../282-libxcursor-dev_1%3a1.2.1-1_armhf.deb ...
Unpacking libxcursor-dev:armhf (1:1.2.1-1) ...
Selecting previously unselected package libxdamage-dev:armhf.
Preparing to unpack .../283-libxdamage-dev_1%3a1.1.5-2_armhf.deb ...
Unpacking libxdamage-dev:armhf (1:1.1.5-2) ...
Selecting previously unselected package libxinerama-dev:armhf.
Preparing to unpack .../284-libxinerama-dev_2%3a1.1.4-3_armhf.deb ...
Unpacking libxinerama-dev:armhf (2:1.1.4-3) ...
Selecting previously unselected package libxkbcommon-dev:armhf.
Preparing to unpack .../285-libxkbcommon-dev_1.4.1-1_armhf.deb ...
Unpacking libxkbcommon-dev:armhf (1.4.1-1) ...
Selecting previously unselected package libxrandr-dev:armhf.
Preparing to unpack .../286-libxrandr-dev_2%3a1.5.2-2_armhf.deb ...
Unpacking libxrandr-dev:armhf (2:1.5.2-2) ...
Selecting previously unselected package wayland-protocols.
Preparing to unpack .../287-wayland-protocols_1.26-1_all.deb ...
Unpacking wayland-protocols (1.26-1) ...
Selecting previously unselected package libgtk-3-dev:armhf.
Preparing to unpack .../288-libgtk-3-dev_3.24.34-3_armhf.deb ...
Unpacking libgtk-3-dev:armhf (3.24.34-3) ...
Selecting previously unselected package libgtkd-3-0:armhf.
Preparing to unpack .../289-libgtkd-3-0_3.10.0-1_armhf.deb ...
Unpacking libgtkd-3-0:armhf (3.10.0-1) ...
Selecting previously unselected package librsvg2-common:armhf.
Preparing to unpack .../290-librsvg2-common_2.54.4+dfsg-1_armhf.deb ...
Unpacking librsvg2-common:armhf (2.54.4+dfsg-1) ...
Selecting previously unselected package librsvg2-dev:armhf.
Preparing to unpack .../291-librsvg2-dev_2.54.4+dfsg-1_armhf.deb ...
Unpacking librsvg2-dev:armhf (2.54.4+dfsg-1) ...
Selecting previously unselected package libgtkd-3-dev:armhf.
Preparing to unpack .../292-libgtkd-3-dev_3.10.0-1_armhf.deb ...
Unpacking libgtkd-3-dev:armhf (3.10.0-1) ...
Selecting previously unselected package libosp5.
Preparing to unpack .../293-libosp5_1.5.2-13_armhf.deb ...
Unpacking libosp5 (1.5.2-13) ...
Selecting previously unselected package libpod-parser-perl.
Preparing to unpack .../294-libpod-parser-perl_1.65-1_all.deb ...
Adding 'diversion of /usr/bin/podselect to /usr/bin/podselect.bundled by libpod-parser-perl'
Adding 'diversion of /usr/share/man/man1/podselect.1.gz to /usr/share/man/man1/podselect.bundled.1.gz by libpod-parser-perl'
Unpacking libpod-parser-perl (1.65-1) ...
Selecting previously unselected package libsecret-1-dev:armhf.
Preparing to unpack .../295-libsecret-1-dev_0.20.5-2_armhf.deb ...
Unpacking libsecret-1-dev:armhf (0.20.5-2) ...
Selecting previously unselected package libsgmls-perl.
Preparing to unpack .../296-libsgmls-perl_1.03ii-37_all.deb ...
Unpacking libsgmls-perl (1.03ii-37) ...
Selecting previously unselected package libxs-parse-keyword-perl.
Preparing to unpack .../297-libxs-parse-keyword-perl_0.25-1_armhf.deb ...
Unpacking libxs-parse-keyword-perl (0.25-1) ...
Selecting previously unselected package libsyntax-keyword-try-perl.
Preparing to unpack .../298-libsyntax-keyword-try-perl_0.27-1_armhf.deb ...
Unpacking libsyntax-keyword-try-perl (0.27-1) ...
Selecting previously unselected package libunwind8:armhf.
Preparing to unpack .../299-libunwind8_1.3.2-2_armhf.deb ...
Unpacking libunwind8:armhf (1.3.2-2) ...
Selecting previously unselected package libunwind-dev:armhf.
Preparing to unpack .../300-libunwind-dev_1.3.2-2_armhf.deb ...
Unpacking libunwind-dev:armhf (1.3.2-2) ...
Selecting previously unselected package libvte-2.91-dev:armhf.
Preparing to unpack .../301-libvte-2.91-dev_0.69.92-1_armhf.deb ...
Unpacking libvte-2.91-dev:armhf (0.69.92-1) ...
Selecting previously unselected package libvted-3-0:armhf.
Preparing to unpack .../302-libvted-3-0_3.10.0-1_armhf.deb ...
Unpacking libvted-3-0:armhf (3.10.0-1) ...
Selecting previously unselected package libvted-3-dev:armhf.
Preparing to unpack .../303-libvted-3-dev_3.10.0-1_armhf.deb ...
Unpacking libvted-3-dev:armhf (3.10.0-1) ...
Selecting previously unselected package libyaml-tiny-perl.
Preparing to unpack .../304-libyaml-tiny-perl_1.73-1_all.deb ...
Unpacking libyaml-tiny-perl (1.73-1) ...
Selecting previously unselected package ninja-build.
Preparing to unpack .../305-ninja-build_1.11.0-1_armhf.deb ...
Unpacking ninja-build (1.11.0-1) ...
Selecting previously unselected package python3-pkg-resources.
Preparing to unpack .../306-python3-pkg-resources_59.6.0-1.2_all.deb ...
Unpacking python3-pkg-resources (59.6.0-1.2) ...
Selecting previously unselected package python3-setuptools.
Preparing to unpack .../307-python3-setuptools_59.6.0-1.2_all.deb ...
Unpacking python3-setuptools (59.6.0-1.2) ...
Selecting previously unselected package meson.
Preparing to unpack .../308-meson_0.62.2-1_all.deb ...
Unpacking meson (0.62.2-1) ...
Selecting previously unselected package opensp.
Preparing to unpack .../309-opensp_1.5.2-13_armhf.deb ...
Unpacking opensp (1.5.2-13) ...
Selecting previously unselected package po4a.
Preparing to unpack .../310-po4a_0.67-2_all.deb ...
Unpacking po4a (0.67-2) ...
Selecting previously unselected package sbuild-build-depends-tilix-dummy.
Preparing to unpack .../311-sbuild-build-depends-tilix-dummy_0.invalid.0_armhf.deb ...
Unpacking sbuild-build-depends-tilix-dummy (0.invalid.0) ...
Setting up media-types (8.0.0) ...
Setting up libpcrecpp0v5:armhf (2:8.39-14) ...
Setting up libpipeline1:armhf (1.5.6-2) ...
Setting up libgraphite2-3:armhf (1.3.14-1) ...
Setting up liblcms2-2:armhf (2.13.1-1) ...
Setting up libpixman-1-0:armhf (0.40.0-1) ...
Setting up libicu71:armhf (71.1-3) ...
Setting up gcc-11-base:armhf (11.3.0-5+rpi1) ...
Setting up libwayland-server0:armhf (1.21.0-1) ...
Setting up systemd-sysv (251.3-1+rpi1) ...
Setting up libxau6:armhf (1:1.0.9-1) ...
Setting up libsgmls-perl (1.03ii-37) ...
Setting up libpsl5:armhf (0.21.0-1.2) ...
Setting up cpp-12 (12.1.0-8+rpi1) ...
Setting up libgnutls-openssl27:armhf (3.7.7-2) ...
Setting up libpixman-1-dev:armhf (0.40.0-1) ...
Setting up liblerc4:armhf (4.0.0+ds-1) ...
Setting up bsdextrautils (2.38.1-1) ...
Setting up libglvnd-core-dev:armhf (1.5.0-1) ...
Setting up libpcre16-3:armhf (2:8.39-14) ...
Setting up hicolor-icon-theme (0.17-2) ...
Setting up libvte-2.91-common (0.69.92-1) ...
Setting up libdatrie1:armhf (0.2.13-2+b2) ...
Setting up libmagic-mgc (1:5.41-4) ...
Setting up libarchive-zip-perl (1.68-1) ...
Setting up libyaml-0-2:armhf (0.2.5-1) ...
Setting up libglib2.0-0:armhf (2.72.3-1) ...
Setting up libglvnd0:armhf (1.5.0-1) ...
Setting up libxmlb2:armhf (0.3.8-1) ...
Setting up libdebhelper-perl (13.9) ...
Setting up libbrotli1:armhf (1.0.9-2+b2) ...
Setting up libgphobos2:armhf (11.3.0-5+rpi1) ...
Setting up libgdk-pixbuf2.0-common (2.42.9+dfsg-1) ...
Setting up x11-common (1:7.7+23) ...
Running in chroot, ignoring request.
Setting up libsensors-config (1:3.6.0-7) ...
Setting up libnghttp2-14:armhf (1.49.0-1) ...
Setting up libmagic1:armhf (1:5.41-4) ...
Setting up libdeflate0:armhf (1.12-1) ...
Setting up gettext-base (0.21-8) ...
Setting up m4 (1.4.19-1) ...
Setting up libgphobos3:armhf (12.1.0-8+rpi1) ...
Setting up xkb-data (2.35.1-1) ...
Setting up liblzo2-2:armhf (2.10-2) ...
Setting up file (1:5.41-4) ...
Setting up libgomp1:armhf (12.1.0-8+rpi1) ...
Setting up libffi-dev:armhf (3.4.2-4) ...
Setting up libunwind8:armhf (1.3.2-2) ...
Setting up libyaml-tiny-perl (1.73-1) ...
Setting up libpthread-stubs0-dev:armhf (0.4-1) ...
Setting up libjbig0:armhf (2.1-3.1+b2) ...
Setting up libpcre2-16-0:armhf (10.40-1+b2) ...
Setting up libcolord2:armhf (1.4.6-1) ...
Setting up libopengl0:armhf (1.5.0-1) ...
Setting up ninja-build (1.11.0-1) ...
Setting up libosp5 (1.5.2-13) ...
Setting up libdconf1:armhf (0.40.0-3) ...
Setting up xtrans-dev (1.4.0-1) ...
Setting up libgraphite2-dev:armhf (1.3.14-1) ...
Setting up autotools-dev (20220109.1) ...
Setting up libz3-4:armhf (4.8.12-1) ...
Setting up libpcre2-32-0:armhf (10.40-1+b2) ...
Setting up libxs-parse-keyword-perl (0.25-1) ...
Setting up libglib2.0-data (2.72.3-1) ...
Setting up libgmpxx4ldbl:armhf (2:6.2.1+dfsg1-1) ...
Setting up libgles2:armhf (1.5.0-1) ...
Setting up libexpat1-dev:armhf (2.4.8-1) ...
Setting up libjpeg62-turbo:armhf (1:2.1.2-1) ...
Setting up libx11-data (2:1.8.1-2) ...
Setting up libgpg-error-dev (1.45-2) ...
Setting up libjpeg62-turbo-dev:armhf (1:2.1.2-1) ...
Setting up libepoxy0:armhf (1.5.10-1) ...
Setting up librtmp1:armhf (2.4+20151223.gitfa8646d.1-2+b2) ...
Setting up libgnutlsxx30:armhf (3.7.7-2) ...
Setting up uuid-dev:armhf (2.38.1-1) ...
Setting up libavahi-common-data:armhf (0.8-6+b1) ...
Setting up libgles1:armhf (1.5.0-1) ...
Setting up libdbus-1-3:armhf (1.14.0-2) ...
Setting up gnome-pkg-tools (0.22.6) ...
Setting up libfribidi0:armhf (1.0.8-2.1) ...
Setting up libpng16-16:armhf (1.6.37-5) ...
Setting up libpcre32-3:armhf (2:8.39-14) ...
Setting up libatomic1:armhf (12.1.0-8+rpi1) ...
Setting up libevent-2.1-7:armhf (2.1.12-stable-5+b1) ...
Setting up libpod-parser-perl (1.65-1) ...
Setting up autopoint (0.21-8) ...
Setting up icu-devtools (71.1-3) ...
Setting up pkg-config (0.29.2-1) ...
Setting up fonts-dejavu-core (2.37-2) ...
Setting up libsepol-dev:armhf (3.4-2) ...
Setting up ucf (3.0043) ...
Setting up libsensors5:armhf (1:3.6.0-7) ...
Setting up liblerc-dev:armhf (4.0.0+ds-1) ...
Setting up libidn2-dev:armhf (2.3.3-1) ...
Setting up libglapi-mesa:armhf (22.2.0~rc2-1+rpi1) ...
Setting up autoconf (2.71-2) ...
Setting up libwebp7:armhf (1.2.2-2) ...
Setting up liblzma-dev:armhf (5.2.5-2.1) ...
Setting up libubsan1:armhf (12.1.0-8+rpi1) ...
Setting up zlib1g-dev:armhf (1:1.2.11.dfsg-4.1) ...
Setting up libatk1.0-data (2.38.0-1) ...
Setting up libsyntax-keyword-try-perl (0.27-1) ...
Setting up libpcre2-posix3:armhf (10.40-1+b2) ...
Setting up libmd0:armhf (1.0.4-2) ...
Setting up wayland-protocols (1.26-1) ...
Setting up libdatrie-dev:armhf (0.2.13-2+b2) ...
Setting up libxshmfence1:armhf (1.3-1) ...
Setting up dbus-session-bus-common (1.14.0-2) ...
Setting up xml-core (0.18+nmu1) ...
Setting up libasan8:armhf (12.1.0-8+rpi1) ...
Setting up libuchardet0:armhf (0.0.7-1) ...
Setting up libmpdec3:armhf (2.5.1-2+rpi1) ...
Setting up libsub-override-perl (0.09-3) ...
Setting up libthai-data (0.1.29-1) ...
Setting up libgirepository-1.0-1:armhf (1.72.0-1+b1) ...
Setting up libssh2-1:armhf (1.10.0-3+b1) ...
Setting up xorg-sgml-doctools (1:1.11-1.1) ...
Setting up libatk1.0-0:armhf (2.38.0-1) ...
Setting up libtiff5:armhf (4.4.0-4) ...
Setting up libwayland-egl1:armhf (1.21.0-1) ...
Setting up libstemmer0d:armhf (2.2.0-1) ...
Setting up libopengl-dev:armhf (1.5.0-1) ...
Setting up dbus-system-bus-common (1.14.0-2) ...
Setting up libtasn1-6-dev:armhf (4.18.0-4) ...
Setting up libbsd0:armhf (0.11.6-1) ...
Setting up libdeflate-dev:armhf (1.12-1) ...
Setting up libdrm-common (2.4.112-3+rpi1) ...
Setting up libelf1:armhf (0.187-1) ...
Setting up libicu-dev:armhf (71.1-3) ...
Setting up libxml2:armhf (2.9.14+dfsg-1) ...
Setting up libcc1-0:armhf (12.1.0-8+rpi1) ...
Setting up dbus-bin (1.14.0-2) ...
Setting up libbrotli-dev:armhf (1.0.9-2+b2) ...
Setting up libsecret-common (0.20.5-2) ...
Setting up libp11-kit-dev:armhf (0.24.1-1) ...
Setting up libtiffxx5:armhf (4.4.0-4) ...
Setting up libxkbcommon0:armhf (1.4.1-1) ...
Setting up libwayland-client0:armhf (1.21.0-1) ...
Setting up automake (1:1.16.5-1.3) ...
update-alternatives: using /usr/bin/automake-1.16 to provide /usr/bin/automake (automake) in auto mode
Setting up libfile-stripnondeterminism-perl (1.13.0-1) ...
Setting up libblkid-dev:armhf (2.38.1-1) ...
Setting up libice6:armhf (2:1.0.10-1) ...
Setting up libxdmcp6:armhf (1:1.1.2-3) ...
Setting up libxcb1:armhf (1.15-1) ...
Setting up gettext (0.21-8) ...
Setting up libgmp-dev:armhf (2:6.2.1+dfsg1-1) ...
Setting up libxcb-xfixes0:armhf (1.15-1) ...
Setting up libunwind-dev:armhf (1.3.2-2) ...
Setting up libpcre2-dev:armhf (10.40-1+b2) ...
Setting up nettle-dev:armhf (3.8.1-2) ...
Setting up libtool (2.4.7-4) ...
Setting up libxcb-render0:armhf (1.15-1) ...
Setting up libselinux1-dev:armhf (3.4-1) ...
Setting up libpcre3-dev:armhf (2:8.39-14) ...
Setting up fontconfig-config (2.13.1-4.4) ...
Setting up libgphobos-12-dev:armhf (12.1.0-8+rpi1) ...
Setting up libfribidi-dev:armhf (1.0.8-2.1) ...
Setting up libxcb-glx0:armhf (1.15-1) ...
Setting up libxkbcommon-dev:armhf (1.4.1-1) ...
Setting up libedit2:armhf (3.1-20210910-1) ...
Setting up libpng-dev:armhf (1.6.37-5) ...
Setting up libavahi-common3:armhf (0.8-6+b1) ...
Setting up libjpeg-dev:armhf (1:2.1.2-1) ...
Setting up libjbig-dev:armhf (2.1-3.1+b2) ...
Setting up libglib2.0-bin (2.72.3-1) ...
Setting up libcurl3-gnutls:armhf (7.84.0-2) ...
Setting up libxcb-shm0:armhf (1.15-1) ...
Setting up dbus-daemon (1.14.0-2) ...
Setting up opensp (1.5.2-13) ...
Setting up libappstream4:armhf (0.15.4-1) ...
Setting up intltool-debian (0.35.0+20060710.5) ...
Setting up libxcb-present0:armhf (1.15-1) ...
Setting up libpython3.10-stdlib:armhf (3.10.6-1) ...
Setting up dh-autoreconf (20) ...
Setting up libthai0:armhf (0.1.29-1) ...
Setting up libwayland-bin (1.21.0-1) ...
Setting up libsecret-1-0:armhf (0.20.5-2) ...
Setting up libunbound8:armhf (1.16.2-1) ...
Setting up libgcrypt20-dev (1.10.1-2+b2) ...
Setting up libfreetype6:armhf (2.12.1+dfsg-3) ...
Setting up libtiff-dev:armhf (4.4.0-4) ...
Setting up libxcb-sync1:armhf (1.15-1) ...
Setting up dbus (1.14.0-2) ...
Running in chroot, ignoring request.
Setting up libgcc-12-dev:armhf (12.1.0-8+rpi1) ...
Setting up shared-mime-info (2.2-1) ...
Setting up gir1.2-glib-2.0:armhf (1.72.0-1+b1) ...
Setting up libgphobos-dev:armhf (12.1.0-3+rpi1) ...
Setting up libthai-dev:armhf (0.1.29-1) ...
Setting up libxcb-dri2-0:armhf (1.15-1) ...
Setting up dh-strip-nondeterminism (1.13.0-1) ...
Setting up libllvm14:armhf (1:14.0.6-2+rpi1) ...
Setting up libdrm2:armhf (2.4.112-3+rpi1) ...
Setting up dwz (0.14-1) ...
Setting up groff-base (1.22.4-8) ...
Setting up libwayland-cursor0:armhf (1.21.0-1) ...
Setting up libpam-systemd:armhf (251.3-1+rpi1) ...
Setting up libx11-6:armhf (2:1.8.1-2) ...
Setting up libharfbuzz0b:armhf (2.7.4-1+b1) ...
Setting up libgdk-pixbuf-2.0-0:armhf (2.42.9+dfsg-1) ...
Setting up libxcomposite1:armhf (1:0.4.5-1) ...
Setting up libsm6:armhf (2:1.2.3-1) ...
Setting up libavahi-client3:armhf (0.8-6+b1) ...
Setting up libmount-dev:armhf (2.38.1-1) ...
Setting up libpython3-stdlib:armhf (3.10.6-1) ...
Setting up libdrm-amdgpu1:armhf (2.4.112-3+rpi1) ...
Setting up libxcb-dri3-0:armhf (1.15-1) ...
Setting up gtk-update-icon-cache (3.24.34-3) ...
Setting up libx11-xcb1:armhf (2:1.8.1-2) ...
Setting up libgnutls-dane0:armhf (3.7.7-2) ...
Setting up libdrm-nouveau2:armhf (2.4.112-3+rpi1) ...
Setting up gir1.2-freedesktop:armhf (1.72.0-1+b1) ...
Setting up libharfbuzz-icu0:armhf (2.7.4-1+b1) ...
Setting up libxdamage1:armhf (1:1.1.5-2) ...
Setting up python3.10 (3.10.6-1) ...
Setting up libxrender1:armhf (1:0.9.10-1.1) ...
Setting up gir1.2-gdkpixbuf-2.0:armhf (2.42.9+dfsg-1) ...
Setting up libstdc++-12-dev:armhf (12.1.0-8+rpi1) ...
Setting up libgbm1:armhf (22.2.0~rc2-1+rpi1) ...
Setting up gir1.2-atk-1.0:armhf (2.38.0-1) ...
Setting up libdrm-radeon1:armhf (2.4.112-3+rpi1) ...
Setting up po-debconf (1.0.21+nmu1) ...
Setting up libgl1-mesa-dri:armhf (22.2.0~rc2-1+rpi1) ...
Setting up libxext6:armhf (2:1.3.4-1) ...
Setting up python3 (3.10.6-1) ...
Setting up libharfbuzz-gobject0:armhf (2.7.4-1+b1) ...
Setting up man-db (2.10.2-2) ...
Not building database; man-db/auto-update is not 'true'.
Created symlink /etc/systemd/system/timers.target.wants/man-db.timer -> /lib/systemd/system/man-db.timer.
Setting up libwayland-dev:armhf (1.21.0-1) ...
Setting up gir1.2-harfbuzz-0.0:armhf (2.7.4-1+b1) ...
Setting up libxxf86vm1:armhf (1:1.1.4-1+b2) ...
Setting up libfreetype-dev:armhf (2.12.1+dfsg-3) ...
Setting up dbus-user-session (1.14.0-2) ...
Setting up libegl-mesa0:armhf (22.2.0~rc2-1+rpi1) ...
Setting up gir1.2-secret-1:armhf (0.20.5-2) ...
Setting up appstream (0.15.4-1) ...
? Metadata cache was updated successfully.
Setting up adwaita-icon-theme (43~beta.1-2) ...
update-alternatives: using /usr/share/icons/Adwaita/cursor.theme to provide /usr/share/icons/default/index.theme (x-cursor-theme) in auto mode
Setting up gcc-12 (12.1.0-8+rpi1) ...
Setting up libxfixes3:armhf (1:6.0.0-1) ...
Setting up libxinerama1:armhf (2:1.1.4-3) ...
Setting up libxrandr2:armhf (2:1.5.2-2) ...
Setting up libcups2:armhf (2.4.2-1) ...
Setting up libgdk-pixbuf2.0-bin (2.42.9+dfsg-1) ...
Setting up libegl1:armhf (1.5.0-1) ...
Setting up python3-lib2to3 (3.10.6-1) ...
Setting up g++-12 (12.1.0-8+rpi1) ...
Setting up python3-pkg-resources (59.6.0-1.2) ...
Setting up python3-distutils (3.10.6-1) ...
Setting up libgnutls28-dev:armhf (3.7.7-2) ...
Setting up libglib2.0-dev-bin (2.72.3-1) ...
Setting up libglx-mesa0:armhf (22.2.0~rc2-1+rpi1) ...
Setting up python3-setuptools (59.6.0-1.2) ...
Setting up libxi6:armhf (2:1.8-1) ...
Setting up libglx0:armhf (1.5.0-1) ...
Setting up libxtst6:armhf (2:1.2.3-1.1) ...
Setting up libxcursor1:armhf (1:1.2.1-1) ...
Setting up meson (0.62.2-1) ...
Setting up debhelper (13.9) ...
Setting up dconf-service (0.40.0-3) ...
Setting up libatspi2.0-0:armhf (2.44.1-1) ...
Setting up libfreetype6-dev:armhf (2.12.1+dfsg-3) ...
Setting up libatk-bridge2.0-0:armhf (2.38.0-4) ...
Setting up libgl1:armhf (1.5.0-1) ...
Setting up libglib2.0-dev:armhf (2.72.3-1) ...
Setting up gdc-12 (12.1.0-8+rpi1) ...
Setting up libatk1.0-dev:armhf (2.38.0-1) ...
Setting up libgdk-pixbuf-2.0-dev:armhf (2.42.9+dfsg-1) ...
Setting up libharfbuzz-dev:armhf (2.7.4-1+b1) ...
Setting up dconf-gsettings-backend:armhf (0.40.0-3) ...
Setting up gir1.2-atspi-2.0:armhf (2.44.1-1) ...
Setting up libsecret-1-dev:armhf (0.20.5-2) ...
Setting up gdc (4:12.1.0-3+rpi1) ...
Setting up libgtk-3-common (3.24.34-3) ...
Setting up default-d-compiler (0.6.5+b4) ...
Setting up dh-dlang (0.6.5) ...
Processing triggers for sgml-base (1.30) ...
Setting up libfontconfig1:armhf (2.13.1-4.4) ...
Setting up x11proto-dev (2022.1-1) ...
Setting up fontconfig (2.13.1-4.4) ...
Regenerating fonts cache... done.
Setting up libxft2:armhf (2.3.4-1) ...
Setting up po4a (0.67-2) ...
Setting up libxau-dev:armhf (1:1.0.9-1) ...
Setting up libice-dev:armhf (2:1.0.10-1) ...
Setting up libfontconfig-dev:armhf (2.13.1-4.4) ...
Setting up libsm-dev:armhf (2:1.2.3-1) ...
Processing triggers for libc-bin (2.33-8+rpi1) ...
Setting up libpango-1.0-0:armhf (1.50.9+ds-1) ...
Setting up libcairo2:armhf (1.16.0-6) ...
Setting up libxdmcp-dev:armhf (1:1.1.2-3) ...
Setting up libdbus-1-dev:armhf (1.14.0-2) ...
Setting up x11proto-core-dev (2022.1-1) ...
Setting up libcairo-gobject2:armhf (1.16.0-6) ...
Setting up libpangoft2-1.0-0:armhf (1.50.9+ds-1) ...
Setting up libpangocairo-1.0-0:armhf (1.50.9+ds-1) ...
Setting up libcairo-script-interpreter2:armhf (1.16.0-6) ...
Setting up libxcb1-dev:armhf (1.15-1) ...
Setting up libpangoxft-1.0-0:armhf (1.50.9+ds-1) ...
Setting up libgtk-3-0:armhf (3.24.34-3) ...
Setting up pango1.0-tools (1.50.9+ds-1) ...
Setting up libx11-dev:armhf (2:1.8.1-2) ...
Setting up libvte-2.91-0:armhf (0.69.92-1) ...
Setting up librsvg2-2:armhf (2.54.4+dfsg-1) ...
Setting up libxfixes-dev:armhf (1:6.0.0-1) ...
Setting up libxcb-shm0-dev:armhf (1.15-1) ...
Setting up gir1.2-pango-1.0:armhf (1.50.9+ds-1) ...
Setting up libxcb-render0-dev:armhf (1.15-1) ...
Setting up librsvg2-common:armhf (2.54.4+dfsg-1) ...
Setting up libvted-3-0:armhf (3.10.0-1) ...
Setting up libxext-dev:armhf (2:1.3.4-1) ...
Setting up libgtkd-3-0:armhf (3.10.0-1) ...
Setting up libglx-dev:armhf (1.5.0-1) ...
Setting up libxi-dev:armhf (2:1.8-1) ...
Setting up gir1.2-rsvg-2.0:armhf (2.54.4+dfsg-1) ...
Setting up libxrender-dev:armhf (1:0.9.10-1.1) ...
Setting up libgl-dev:armhf (1.5.0-1) ...
Setting up libxft-dev:armhf (2.3.4-1) ...
Setting up libxtst-dev:armhf (2:1.2.3-1.1) ...
Setting up libxdamage-dev:armhf (1:1.1.5-2) ...
Setting up libatspi2.0-dev:armhf (2.44.1-1) ...
Setting up libegl-dev:armhf (1.5.0-1) ...
Setting up libxcomposite-dev:armhf (1:0.4.5-1) ...
Setting up libxcursor-dev:armhf (1:1.2.1-1) ...
Setting up libepoxy-dev:armhf (1.5.10-1) ...
Setting up gir1.2-gtk-3.0:armhf (3.24.34-3) ...
Setting up libatk-bridge2.0-dev:armhf (2.38.0-4) ...
Setting up libxrandr-dev:armhf (2:1.5.2-2) ...
Setting up libxinerama-dev:armhf (2:1.1.4-3) ...
Setting up libcairo2-dev:armhf (1.16.0-6) ...
Setting up gir1.2-vte-2.91:armhf (0.69.92-1) ...
Setting up libgles-dev:armhf (1.5.0-1) ...
Setting up libglvnd-dev:armhf (1.5.0-1) ...
Setting up libpango1.0-dev:armhf (1.50.9+ds-1) ...
Setting up librsvg2-dev:armhf (2.54.4+dfsg-1) ...
Setting up libegl1-mesa-dev:armhf (22.2.0~rc2-1+rpi1) ...
Setting up libgtk-3-dev:armhf (3.24.34-3) ...
Setting up libgtkd-3-dev:armhf (3.10.0-1) ...
Setting up libvte-2.91-dev:armhf (0.69.92-1) ...
Setting up libvted-3-dev:armhf (3.10.0-1) ...
Setting up sbuild-build-depends-tilix-dummy (0.invalid.0) ...
Processing triggers for libc-bin (2.33-8+rpi1) ...
Processing triggers for libgdk-pixbuf-2.0-0:armhf (2.42.9+dfsg-1) ...
W: No sandbox user '_apt' on the system, can not drop privileges

+------------------------------------------------------------------------------+
| Build environment                                                            |
+------------------------------------------------------------------------------+

Kernel: Linux 4.9.0-0.bpo.6-armmp armhf (armv7l)
Toolchain package versions: binutils_2.38.90.20220713-2+rpi1 dpkg-dev_1.21.9+rpi1 g++-12_12.1.0-8+rpi1 gcc-12_12.1.0-8+rpi1 libc6-dev_2.33-8+rpi1 libstdc++-12-dev_12.1.0-8+rpi1 libstdc++6_12.1.0-8+rpi1 linux-libc-dev_5.18.14-1+rpi1
Package versions: adduser_3.123 adwaita-icon-theme_43~beta.1-2 appstream_0.15.4-1 apt_2.5.2 autoconf_2.71-2 automake_1:1.16.5-1.3 autopoint_0.21-8 autotools-dev_20220109.1 base-files_12.2+rpi1 base-passwd_3.6.0 bash_5.1-6.1 binutils_2.38.90.20220713-2+rpi1 binutils-arm-linux-gnueabihf_2.38.90.20220713-2+rpi1 binutils-common_2.38.90.20220713-2+rpi1 bsdextrautils_2.38.1-1 bsdutils_1:2.38.1-1 build-essential_12.9 bzip2_1.0.8-5+b2 coreutils_8.32-4.1 cpp_4:12.1.0-3+rpi1 cpp-12_12.1.0-8+rpi1 dash_0.5.11+git20210903+057cd650a4ed-8 dbus_1.14.0-2 dbus-bin_1.14.0-2 dbus-daemon_1.14.0-2 dbus-session-bus-common_1.14.0-2 dbus-system-bus-common_1.14.0-2 dbus-user-session_1.14.0-2 dconf-gsettings-backend_0.40.0-3 dconf-service_0.40.0-3 debconf_1.5.79 debhelper_13.9 debianutils_5.7-0.3 default-d-compiler_0.6.5+b4 dh-autoreconf_20 dh-dlang_0.6.5 dh-strip-nondeterminism_1.13.0-1 diffutils_1:3.8-1 dirmngr_2.2.35-3 dmsetup_2:1.02.185-1 dpkg_1.21.9+rpi1 dpkg-dev_1.21.9+rpi1 dwz_0.14-1 e2fsprogs_1.46.5-2 fakeroot_1.29-1 file_1:5.41-4 findutils_4.9.0-3 fontconfig_2.13.1-4.4 fontconfig-config_2.13.1-4.4 fonts-dejavu-core_2.37-2 g++_4:12.1.0-3+rpi1 g++-12_12.1.0-8+rpi1 gcc_4:12.1.0-3+rpi1 gcc-11-base_11.3.0-5+rpi1 gcc-12_12.1.0-8+rpi1 gcc-12-base_12.1.0-8+rpi1 gcc-7-base_7.5.0-6+rpi1+b2 gcc-8-base_8.4.0-7+rpi1 gcc-9-base_9.4.0-2+rpi1 gdc_4:12.1.0-3+rpi1 gdc-12_12.1.0-8+rpi1 gettext_0.21-8 gettext-base_0.21-8 gir1.2-atk-1.0_2.38.0-1 gir1.2-atspi-2.0_2.44.1-1 gir1.2-freedesktop_1.72.0-1+b1 gir1.2-gdkpixbuf-2.0_2.42.9+dfsg-1 gir1.2-glib-2.0_1.72.0-1+b1 gir1.2-gtk-3.0_3.24.34-3 gir1.2-harfbuzz-0.0_2.7.4-1+b1 gir1.2-pango-1.0_1.50.9+ds-1 gir1.2-rsvg-2.0_2.54.4+dfsg-1 gir1.2-secret-1_0.20.5-2 gir1.2-vte-2.91_0.69.92-1 gnome-pkg-tools_0.22.6 gnupg_2.2.35-3 gnupg-l10n_2.2.35-3 gnupg-utils_2.2.35-3 gpg_2.2.35-3 gpg-agent_2.2.35-3 gpg-wks-client_2.2.35-3 gpg-wks-server_2.2.35-3 gpgconf_2.2.35-3 gpgsm_2.2.35-3 gpgv_2.2.35-3 grep_3.7-1 groff-base_1.22.4-8 gtk-update-icon-cache_3.24.34-3 gzip_1.12-1 hicolor-icon-theme_0.17-2 hostname_3.23 icu-devtools_71.1-3 init-system-helpers_1.64 intltool-debian_0.35.0+20060710.5 iputils-ping_3:20211215-1 krb5-locales_1.20-1 libacl1_2.3.1-1 libapparmor1_3.0.7-1 libappstream4_0.15.4-1 libapt-pkg6.0_2.5.2 libarchive-zip-perl_1.68-1 libargon2-1_0~20171227-0.3 libasan8_12.1.0-8+rpi1 libassuan0_2.5.5-4 libatk-bridge2.0-0_2.38.0-4 libatk-bridge2.0-dev_2.38.0-4 libatk1.0-0_2.38.0-1 libatk1.0-data_2.38.0-1 libatk1.0-dev_2.38.0-1 libatomic1_12.1.0-8+rpi1 libatspi2.0-0_2.44.1-1 libatspi2.0-dev_2.44.1-1 libattr1_1:2.5.1-1 libaudit-common_1:3.0.7-1 libaudit1_1:3.0.7-1+b1 libavahi-client3_0.8-6+b1 libavahi-common-data_0.8-6+b1 libavahi-common3_0.8-6+b1 libbinutils_2.38.90.20220713-2+rpi1 libblkid-dev_2.38.1-1 libblkid1_2.38.1-1 libbrotli-dev_1.0.9-2+b2 libbrotli1_1.0.9-2+b2 libbsd0_0.11.6-1 libbz2-1.0_1.0.8-5+b2 libc-bin_2.33-8+rpi1 libc-dev-bin_2.33-8+rpi1 libc6_2.33-8+rpi1 libc6-dev_2.33-8+rpi1 libcairo-gobject2_1.16.0-6 libcairo-script-interpreter2_1.16.0-6 libcairo2_1.16.0-6 libcairo2-dev_1.16.0-6 libcap-ng0_0.8.3-1 libcap2_1:2.44-1 libcap2-bin_1:2.44-1 libcc1-0_12.1.0-8+rpi1 libcolord2_1.4.6-1 libcom-err2_1.46.5-2 libcrypt-dev_1:4.4.28-2 libcrypt1_1:4.4.28-2 libcryptsetup12_2:2.5.0-2 libctf-nobfd0_2.38.90.20220713-2+rpi1 libctf0_2.38.90.20220713-2+rpi1 libcups2_2.4.2-1 libcurl3-gnutls_7.84.0-2 libdatrie-dev_0.2.13-2+b2 libdatrie1_0.2.13-2+b2 libdb5.3_5.3.28+dfsg1-0.10 libdbus-1-3_1.14.0-2 libdbus-1-dev_1.14.0-2 libdconf1_0.40.0-3 libdebconfclient0_0.263 libdebhelper-perl_13.9 libdeflate-dev_1.12-1 libdeflate0_1.12-1 libdevmapper1.02.1_2:1.02.185-1 libdpkg-perl_1.21.9+rpi1 libdrm-amdgpu1_2.4.112-3+rpi1 libdrm-common_2.4.112-3+rpi1 libdrm-nouveau2_2.4.112-3+rpi1 libdrm-radeon1_2.4.112-3+rpi1 libdrm2_2.4.112-3+rpi1 libedit2_3.1-20210910-1 libegl-dev_1.5.0-1 libegl-mesa0_22.2.0~rc2-1+rpi1 libegl1_1.5.0-1 libegl1-mesa-dev_22.2.0~rc2-1+rpi1 libelf1_0.187-1 libepoxy-dev_1.5.10-1 libepoxy0_1.5.10-1 libevent-2.1-7_2.1.12-stable-5+b1 libexpat1_2.4.8-1 libexpat1-dev_2.4.8-1 libext2fs2_1.46.5-2 libfakeroot_1.29-1 libfdisk1_2.38.1-1 libffi-dev_3.4.2-4 libffi8_3.4.2-4 libfile-stripnondeterminism-perl_1.13.0-1 libfontconfig-dev_2.13.1-4.4 libfontconfig1_2.13.1-4.4 libfreetype-dev_2.12.1+dfsg-3 libfreetype6_2.12.1+dfsg-3 libfreetype6-dev_2.12.1+dfsg-3 libfribidi-dev_1.0.8-2.1 libfribidi0_1.0.8-2.1 libgbm1_22.2.0~rc2-1+rpi1 libgcc-12-dev_12.1.0-8+rpi1 libgcc-s1_12.1.0-8+rpi1 libgcrypt20_1.10.1-2+b2 libgcrypt20-dev_1.10.1-2+b2 libgdbm-compat4_1.23-1 libgdbm6_1.23-1 libgdk-pixbuf-2.0-0_2.42.9+dfsg-1 libgdk-pixbuf-2.0-dev_2.42.9+dfsg-1 libgdk-pixbuf2.0-bin_2.42.9+dfsg-1 libgdk-pixbuf2.0-common_2.42.9+dfsg-1 libgirepository-1.0-1_1.72.0-1+b1 libgl-dev_1.5.0-1 libgl1_1.5.0-1 libgl1-mesa-dri_22.2.0~rc2-1+rpi1 libglapi-mesa_22.2.0~rc2-1+rpi1 libgles-dev_1.5.0-1 libgles1_1.5.0-1 libgles2_1.5.0-1 libglib2.0-0_2.72.3-1 libglib2.0-bin_2.72.3-1 libglib2.0-data_2.72.3-1 libglib2.0-dev_2.72.3-1 libglib2.0-dev-bin_2.72.3-1 libglvnd-core-dev_1.5.0-1 libglvnd-dev_1.5.0-1 libglvnd0_1.5.0-1 libglx-dev_1.5.0-1 libglx-mesa0_22.2.0~rc2-1+rpi1 libglx0_1.5.0-1 libgmp-dev_2:6.2.1+dfsg1-1 libgmp10_2:6.2.1+dfsg1-1 libgmpxx4ldbl_2:6.2.1+dfsg1-1 libgnutls-dane0_3.7.7-2 libgnutls-openssl27_3.7.7-2 libgnutls28-dev_3.7.7-2 libgnutls30_3.7.7-2 libgnutlsxx30_3.7.7-2 libgomp1_12.1.0-8+rpi1 libgpg-error-dev_1.45-2 libgpg-error0_1.45-2 libgphobos-12-dev_12.1.0-8+rpi1 libgphobos-dev_12.1.0-3+rpi1 libgphobos2_11.3.0-5+rpi1 libgphobos3_12.1.0-8+rpi1 libgraphite2-3_1.3.14-1 libgraphite2-dev_1.3.14-1 libgssapi-krb5-2_1.20-1 libgtk-3-0_3.24.34-3 libgtk-3-common_3.24.34-3 libgtk-3-dev_3.24.34-3 libgtkd-3-0_3.10.0-1 libgtkd-3-dev_3.10.0-1 libharfbuzz-dev_2.7.4-1+b1 libharfbuzz-gobject0_2.7.4-1+b1 libharfbuzz-icu0_2.7.4-1+b1 libharfbuzz0b_2.7.4-1+b1 libhogweed6_3.8.1-2 libice-dev_2:1.0.10-1 libice6_2:1.0.10-1 libicu-dev_71.1-3 libicu71_71.1-3 libidn2-0_2.3.3-1 libidn2-dev_2.3.3-1 libip4tc2_1.8.8-1 libisl23_0.25-1 libjbig-dev_2.1-3.1+b2 libjbig0_2.1-3.1+b2 libjpeg-dev_1:2.1.2-1 libjpeg62-turbo_1:2.1.2-1 libjpeg62-turbo-dev_1:2.1.2-1 libjson-c5_0.16-1 libk5crypto3_1.20-1 libkeyutils1_1.6.3-1 libkmod2_30+20220630-3 libkrb5-3_1.20-1 libkrb5support0_1.20-1 libksba8_1.6.0-3 liblcms2-2_2.13.1-1 libldap-2.5-0_2.5.12+dfsg-2 liblerc-dev_4.0.0+ds-1 liblerc4_4.0.0+ds-1 libllvm14_1:14.0.6-2+rpi1 liblz4-1_1.9.3-2 liblzma-dev_5.2.5-2.1 liblzma5_5.2.5-2.1 liblzo2-2_2.10-2 libmagic-mgc_1:5.41-4 libmagic1_1:5.41-4 libmd0_1.0.4-2 libmount-dev_2.38.1-1 libmount1_2.38.1-1 libmpc3_1.2.1-2 libmpdec3_2.5.1-2+rpi1 libmpfr6_4.1.0-3 libncursesw6_6.3+20220423-2 libnettle8_3.8.1-2 libnghttp2-14_1.49.0-1 libnpth0_1.6-3 libnsl-dev_1.3.0-2 libnsl2_1.3.0-2 libopengl-dev_1.5.0-1 libopengl0_1.5.0-1 libosp5_1.5.2-13 libp11-kit-dev_0.24.1-1 libp11-kit0_0.24.1-1 libpam-cap_1:2.44-1 libpam-modules_1.5.2-2 libpam-modules-bin_1.5.2-2 libpam-runtime_1.5.2-2 libpam-systemd_251.3-1+rpi1 libpam0g_1.5.2-2 libpango-1.0-0_1.50.9+ds-1 libpango1.0-dev_1.50.9+ds-1 libpangocairo-1.0-0_1.50.9+ds-1 libpangoft2-1.0-0_1.50.9+ds-1 libpangoxft-1.0-0_1.50.9+ds-1 libpcre16-3_2:8.39-14 libpcre2-16-0_10.40-1+b2 libpcre2-32-0_10.40-1+b2 libpcre2-8-0_10.40-1+b2 libpcre2-dev_10.40-1+b2 libpcre2-posix3_10.40-1+b2 libpcre3_2:8.39-14 libpcre3-dev_2:8.39-14 libpcre32-3_2:8.39-14 libpcrecpp0v5_2:8.39-14 libperl5.34_5.34.0-5 libpipeline1_1.5.6-2 libpixman-1-0_0.40.0-1 libpixman-1-dev_0.40.0-1 libpng-dev_1.6.37-5 libpng16-16_1.6.37-5 libpod-parser-perl_1.65-1 libpsl5_0.21.0-1.2 libpthread-stubs0-dev_0.4-1 libpython3-stdlib_3.10.6-1 libpython3.10-minimal_3.10.6-1 libpython3.10-stdlib_3.10.6-1 libreadline8_8.1.2-1.2 librsvg2-2_2.54.4+dfsg-1 librsvg2-common_2.54.4+dfsg-1 librsvg2-dev_2.54.4+dfsg-1 librtmp1_2.4+20151223.gitfa8646d.1-2+b2 libsasl2-2_2.1.28+dfsg-7 libsasl2-modules-db_2.1.28+dfsg-7 libseccomp2_2.5.4-1+rpi1 libsecret-1-0_0.20.5-2 libsecret-1-dev_0.20.5-2 libsecret-common_0.20.5-2 libselinux1_3.4-1 libselinux1-dev_3.4-1 libsemanage-common_3.4-1 libsemanage2_3.4-1 libsensors-config_1:3.6.0-7 libsensors5_1:3.6.0-7 libsepol-dev_3.4-2 libsepol1_3.1-1 libsepol2_3.4-2 libsgmls-perl_1.03ii-37 libsm-dev_2:1.2.3-1 libsm6_2:1.2.3-1 libsmartcols1_2.38.1-1 libsqlite3-0_3.39.2-1 libss2_1.46.5-2 libssh2-1_1.10.0-3+b1 libssl1.1_1.1.1o-1 libssl3_3.0.5-2 libstdc++-12-dev_12.1.0-8+rpi1 libstdc++6_12.1.0-8+rpi1 libstemmer0d_2.2.0-1 libsub-override-perl_0.09-3 libsyntax-keyword-try-perl_0.27-1 libsystemd-shared_251.3-1+rpi1 libsystemd0_251.3-1+rpi1 libtasn1-6_4.18.0-4 libtasn1-6-dev_4.18.0-4 libthai-data_0.1.29-1 libthai-dev_0.1.29-1 libthai0_0.1.29-1 libtiff-dev_4.4.0-4 libtiff5_4.4.0-4 libtiffxx5_4.4.0-4 libtinfo6_6.3+20220423-2 libtirpc-common_1.3.3+ds-1 libtirpc-dev_1.3.3+ds-1 libtirpc3_1.3.3+ds-1 libtool_2.4.7-4 libubsan1_12.1.0-8+rpi1 libuchardet0_0.0.7-1 libudev1_251.3-1+rpi1 libunbound8_1.16.2-1 libunistring2_1.0-1 libunwind-dev_1.3.2-2 libunwind8_1.3.2-2 libuuid1_2.38.1-1 libvte-2.91-0_0.69.92-1 libvte-2.91-common_0.69.92-1 libvte-2.91-dev_0.69.92-1 libvted-3-0_3.10.0-1 libvted-3-dev_3.10.0-1 libwayland-bin_1.21.0-1 libwayland-client0_1.21.0-1 libwayland-cursor0_1.21.0-1 libwayland-dev_1.21.0-1 libwayland-egl1_1.21.0-1 libwayland-server0_1.21.0-1 libwebp7_1.2.2-2 libx11-6_2:1.8.1-2 libx11-data_2:1.8.1-2 libx11-dev_2:1.8.1-2 libx11-xcb1_2:1.8.1-2 libxau-dev_1:1.0.9-1 libxau6_1:1.0.9-1 libxcb-dri2-0_1.15-1 libxcb-dri3-0_1.15-1 libxcb-glx0_1.15-1 libxcb-present0_1.15-1 libxcb-render0_1.15-1 libxcb-render0-dev_1.15-1 libxcb-shm0_1.15-1 libxcb-shm0-dev_1.15-1 libxcb-sync1_1.15-1 libxcb-xfixes0_1.15-1 libxcb1_1.15-1 libxcb1-dev_1.15-1 libxcomposite-dev_1:0.4.5-1 libxcomposite1_1:0.4.5-1 libxcursor-dev_1:1.2.1-1 libxcursor1_1:1.2.1-1 libxdamage-dev_1:1.1.5-2 libxdamage1_1:1.1.5-2 libxdmcp-dev_1:1.1.2-3 libxdmcp6_1:1.1.2-3 libxext-dev_2:1.3.4-1 libxext6_2:1.3.4-1 libxfixes-dev_1:6.0.0-1 libxfixes3_1:6.0.0-1 libxft-dev_2.3.4-1 libxft2_2.3.4-1 libxi-dev_2:1.8-1 libxi6_2:1.8-1 libxinerama-dev_2:1.1.4-3 libxinerama1_2:1.1.4-3 libxkbcommon-dev_1.4.1-1 libxkbcommon0_1.4.1-1 libxml2_2.9.14+dfsg-1 libxmlb2_0.3.8-1 libxrandr-dev_2:1.5.2-2 libxrandr2_2:1.5.2-2 libxrender-dev_1:0.9.10-1.1 libxrender1_1:0.9.10-1.1 libxs-parse-keyword-perl_0.25-1 libxshmfence1_1.3-1 libxtst-dev_2:1.2.3-1.1 libxtst6_2:1.2.3-1.1 libxxf86vm1_1:1.1.4-1+b2 libxxhash0_0.8.1-1 libyaml-0-2_0.2.5-1 libyaml-tiny-perl_1.73-1 libz3-4_4.8.12-1 libzstd1_1.5.2+dfsg-1 linux-libc-dev_5.18.14-1+rpi1 login_1:4.11.1+dfsg1-2 logsave_1.46.5-2 lsb-base_11.2+rpi1 m4_1.4.19-1 make_4.3-4.1 man-db_2.10.2-2 mawk_1.3.4.20200120-3.1 media-types_8.0.0 meson_0.62.2-1 mount_2.38.1-1 nano_6.4-1 ncurses-base_6.3+20220423-2 ncurses-bin_6.3+20220423-2 netbase_6.3 nettle-dev_3.8.1-2 ninja-build_1.11.0-1 opensp_1.5.2-13 pango1.0-tools_1.50.9+ds-1 passwd_1:4.11.1+dfsg1-2 patch_2.7.6-7 perl_5.34.0-5 perl-base_5.34.0-5 perl-modules-5.34_5.34.0-5 pinentry-curses_1.2.0-2 pkg-config_0.29.2-1 po-debconf_1.0.21+nmu1 po4a_0.67-2 python3_3.10.6-1 python3-distutils_3.10.6-1 python3-lib2to3_3.10.6-1 python3-minimal_3.10.6-1 python3-pkg-resources_59.6.0-1.2 python3-setuptools_59.6.0-1.2 python3.10_3.10.6-1 python3.10-minimal_3.10.6-1 raspbian-archive-keyring_20120528.2 readline-common_8.1.2-1.2 rpcsvc-proto_1.4.2-4 sbuild-build-depends-core-dummy_0.invalid.0 sbuild-build-depends-tilix-dummy_0.invalid.0 sed_4.8-1 sensible-utils_0.0.17 sgml-base_1.30 shared-mime-info_2.2-1 systemd_251.3-1+rpi1 systemd-sysv_251.3-1+rpi1 sysvinit-utils_3.04-1 tar_1.34+dfsg-1 tzdata_2022c-1 ucf_3.0043 util-linux_2.38.1-1 util-linux-extra_2.38.1-1 uuid-dev_2.38.1-1 wayland-protocols_1.26-1 x11-common_1:7.7+23 x11proto-core-dev_2022.1-1 x11proto-dev_2022.1-1 xkb-data_2.35.1-1 xml-core_0.18+nmu1 xorg-sgml-doctools_1:1.11-1.1 xtrans-dev_1.4.0-1 xz-utils_5.2.5-2.1 zlib1g_1:1.2.11.dfsg-4.1 zlib1g-dev_1:1.2.11.dfsg-4.1

+------------------------------------------------------------------------------+
| Build                                                                        |
+------------------------------------------------------------------------------+


Unpack source
-------------

gpgv: unknown type of key resource 'trustedkeys.kbx'
gpgv: keyblock resource '/tmp/dpkg-verify-sig.auEisnv6/trustedkeys.kbx': General error
gpgv: Signature made Tue Feb 16 21:27:45 2021 UTC
gpgv:                using RSA key D33A3F0CA16B0ACC51A60738494C8A5FBF4DECEB
gpgv:                issuer "mak@debian.org"
gpgv: Can't check signature: No public key
dpkg-source: warning: cannot verify signature ./tilix_1.9.4-2.dsc
dpkg-source: info: extracting tilix in /<<PKGBUILDDIR>>
dpkg-source: info: unpacking tilix_1.9.4.orig.tar.gz
dpkg-source: info: unpacking tilix_1.9.4-2.debian.tar.xz
dpkg-source: info: using patch list from debian/patches/series
dpkg-source: info: applying 01_move-vte-config-warning.patch
dpkg-source: info: applying 02_fix-build-with-gdc-10.patch

Check disc space
----------------

Sufficient free space for build

User Environment
----------------

APT_CONFIG=/var/lib/sbuild/apt.conf
DEB_BUILD_OPTIONS=parallel=4
HOME=/sbuild-nonexistent
LC_ALL=POSIX
LOGNAME=buildd
PATH=/usr/local/sbin:/usr/local/bin:/usr/sbin:/usr/bin:/sbin:/bin:/usr/games
SCHROOT_ALIAS_NAME=bookworm-staging-armhf-sbuild
SCHROOT_CHROOT_NAME=bookworm-staging-armhf-sbuild
SCHROOT_COMMAND=env
SCHROOT_GID=109
SCHROOT_GROUP=buildd
SCHROOT_SESSION_ID=bookworm-staging-armhf-sbuild-8248995e-b0c8-48d7-b139-4f056d926498
SCHROOT_UID=104
SCHROOT_USER=buildd
SHELL=/bin/sh
TERM=xterm
USER=buildd

dpkg-buildpackage
-----------------

dpkg-buildpackage: info: source package tilix
dpkg-buildpackage: info: source version 1.9.4-2
dpkg-buildpackage: info: source distribution unstable
 dpkg-source --before-build .
dpkg-buildpackage: info: host architecture armhf
 fakeroot debian/rules clean
dh clean --with gnome --buildsystem=meson
   dh_auto_clean -O--buildsystem=meson
   dh_autoreconf_clean -O--buildsystem=meson
   dh_gnome_clean -O--buildsystem=meson
   dh_clean -O--buildsystem=meson
 debian/rules build-arch
dh build-arch --with gnome --buildsystem=meson
   dh_update_autotools_config -a -O--buildsystem=meson
   dh_autoreconf -a -O--buildsystem=meson
   dh_auto_configure -a -O--buildsystem=meson
	cd obj-arm-linux-gnueabihf && LC_ALL=C.UTF-8 meson .. --wrap-mode=nodownload --buildtype=plain --prefix=/usr --sysconfdir=/etc --localstatedir=/var --libdir=lib/arm-linux-gnueabihf
The Meson build system
Version: 0.62.2
Source dir: /<<PKGBUILDDIR>>
Build dir: /<<PKGBUILDDIR>>/obj-arm-linux-gnueabihf
Build type: native build
Project name: Tilix
Project version: 1.9.4
D compiler for the host machine: gdc (gcc 12.1.0-8 "gdc (Raspbian 12.1.0-8+rpi1) 12.1.0")
D linker for the host machine: gdc ld.bfd 2.38.90.20220713
Host machine cpu family: arm
Host machine cpu: armv7l
Found pkg-config: /usr/bin/pkg-config (0.29.2)
Run-time dependency gtkd-3 found: YES 3.10.0
Run-time dependency vted-3 found: YES 3.10.0
Run-time dependency x11 found: YES 1.8.1
Run-time dependency libunwind found: YES 1.3.2
Run-time dependency libsecret-1 found: YES 0.20.5
Program msgfmt found: YES (/usr/bin/msgfmt)
Program msginit found: YES (/usr/bin/msginit)
Program msgmerge found: YES (/usr/bin/msgmerge)
Program xgettext found: YES (/usr/bin/xgettext)

../data/meson.build:13:0: ERROR: Function does not take positional arguments.

A full log can be found at /<<PKGBUILDDIR>>/obj-arm-linux-gnueabihf/meson-logs/meson-log.txt
	cd obj-arm-linux-gnueabihf && tail -v -n \+0 meson-logs/meson-log.txt
==> meson-logs/meson-log.txt <==
Build started at 2022-08-30T06:56:29.252615
Main binary: /usr/bin/python3
Build Options: -Dprefix=/usr -Dlibdir=lib/arm-linux-gnueabihf -Dlocalstatedir=/var -Dsysconfdir=/etc -Dbuildtype=plain -Dwrap_mode=nodownload
Python system: Linux
The Meson build system
Version: 0.62.2
Source dir: /<<PKGBUILDDIR>>
Build dir: /<<PKGBUILDDIR>>/obj-arm-linux-gnueabihf
Build type: native build
Project name: Tilix
Project version: 1.9.4
D compiler for the host machine: gdc (gcc 12.1.0-8 "gdc (Raspbian 12.1.0-8+rpi1) 12.1.0")
D linker for the host machine: gdc ld.bfd 2.38.90.20220713
D compiler for the build machine: gdc (gcc 12.1.0-8 "gdc (Raspbian 12.1.0-8+rpi1) 12.1.0")
D linker for the build machine: gdc ld.bfd 2.38.90.20220713
Build machine cpu family: arm
Build machine cpu: armv7l
Host machine cpu family: arm
Host machine cpu: armv7l
Target machine cpu family: arm
Target machine cpu: armv7l
Pkg-config binary for 1 is not cached.
Pkg-config binary missing from cross or native file, or env var undefined.
Trying a default Pkg-config fallback at pkg-config
Found pkg-config: /usr/bin/pkg-config (0.29.2)
Determining dependency 'gtkd-3' with pkg-config executable '/usr/bin/pkg-config'
env[PKG_CONFIG_PATH]: 
Called `/usr/bin/pkg-config --modversion gtkd-3` -> 0
3.10.0
env[PKG_CONFIG_PATH]: 
Called `/usr/bin/pkg-config --cflags gtkd-3` -> 0
-pthread -I/usr/include/d/gtkd-3/ -I/usr/include/gtk-3.0 -I/usr/include/at-spi2-atk/2.0 -I/usr/include/at-spi-2.0 -I/usr/include/dbus-1.0 -I/usr/lib/arm-linux-gnueabihf/dbus-1.0/include -I/usr/include/gtk-3.0 -I/usr/include/gio-unix-2.0 -I/usr/include/cairo -I/usr/include/atk-1.0 -I/usr/include/cairo -I/usr/include/pango-1.0 -I/usr/include/harfbuzz -I/usr/include/pango-1.0 -I/usr/include/fribidi -I/usr/include/harfbuzz -I/usr/include/librsvg-2.0 -I/usr/include/gdk-pixbuf-2.0 -I/usr/include/arm-linux-gnueabihf -I/usr/include/cairo -I/usr/include/pixman-1 -I/usr/include/uuid -I/usr/include/freetype2 -I/usr/include/libpng16 -I/usr/include/libmount -I/usr/include/blkid -I/usr/include/glib-2.0 -I/usr/lib/arm-linux-gnueabihf/glib-2.0/include
env[PKG_CONFIG_ALLOW_SYSTEM_LIBS]: 1
env[PKG_CONFIG_PATH]: 
Called `/usr/bin/pkg-config --libs gtkd-3` -> 0
-L/usr/lib/arm-linux-gnueabihf -Wl,-L/usr/lib/arm-linux-gnueabihf/ -Wl,-lgtkd-3 -Wl,-ldl -lgtk-3 -lgdk-3 -latk-1.0 -lcairo-gobject -lpangocairo-1.0 -lpango-1.0 -lharfbuzz -lrsvg-2 -lm -lgdk_pixbuf-2.0 -lcairo -lgio-2.0 -lgobject-2.0 -lglib-2.0
env[PKG_CONFIG_PATH]: 
Called `/usr/bin/pkg-config --libs gtkd-3` -> 0
-Wl,-L/usr/lib/arm-linux-gnueabihf/ -Wl,-lgtkd-3 -Wl,-ldl -lgtk-3 -lgdk-3 -latk-1.0 -lcairo-gobject -lpangocairo-1.0 -lpango-1.0 -lharfbuzz -lrsvg-2 -lm -lgdk_pixbuf-2.0 -lcairo -lgio-2.0 -lgobject-2.0 -lglib-2.0
Run-time dependency gtkd-3 found: YES 3.10.0
Pkg-config binary for 1 is cached.
Determining dependency 'vted-3' with pkg-config executable '/usr/bin/pkg-config'
env[PKG_CONFIG_PATH]: 
Called `/usr/bin/pkg-config --modversion vted-3` -> 0
3.10.0
env[PKG_CONFIG_PATH]: 
Called `/usr/bin/pkg-config --cflags vted-3` -> 0
-pthread -I/usr/include/d/gtkd-3/ -I/usr/include/librsvg-2.0 -I/usr/include/vte-2.91 -I/usr/include/gtk-3.0 -I/usr/include/at-spi2-atk/2.0 -I/usr/include/at-spi-2.0 -I/usr/include/dbus-1.0 -I/usr/lib/arm-linux-gnueabihf/dbus-1.0/include -I/usr/include/gtk-3.0 -I/usr/include/gio-unix-2.0 -I/usr/include/cairo -I/usr/include/pango-1.0 -I/usr/include/harfbuzz -I/usr/include/pango-1.0 -I/usr/include/fribidi -I/usr/include/harfbuzz -I/usr/include/atk-1.0 -I/usr/include/cairo -I/usr/include/pixman-1 -I/usr/include/uuid -I/usr/include/freetype2 -I/usr/include/gdk-pixbuf-2.0 -I/usr/include/libpng16 -I/usr/include/arm-linux-gnueabihf -I/usr/include/libmount -I/usr/include/blkid -I/usr/include/glib-2.0 -I/usr/lib/arm-linux-gnueabihf/glib-2.0/include
env[PKG_CONFIG_ALLOW_SYSTEM_LIBS]: 1
env[PKG_CONFIG_PATH]: 
Called `/usr/bin/pkg-config --libs vted-3` -> 0
-L/usr/lib/arm-linux-gnueabihf -Wl,-lvted-3 -Wl,-L/usr/lib/arm-linux-gnueabihf/ -Wl,-lgtkd-3 -Wl,-ldl -lrsvg-2 -lm -lvte-2.91 -lgtk-3 -lgdk-3 -lpangocairo-1.0 -lpango-1.0 -lharfbuzz -latk-1.0 -lcairo-gobject -lcairo -lgdk_pixbuf-2.0 -lgio-2.0 -lgobject-2.0 -lglib-2.0
env[PKG_CONFIG_PATH]: 
Called `/usr/bin/pkg-config --libs vted-3` -> 0
-Wl,-lvted-3 -Wl,-L/usr/lib/arm-linux-gnueabihf/ -Wl,-lgtkd-3 -Wl,-ldl -lrsvg-2 -lm -lvte-2.91 -lgtk-3 -lgdk-3 -lpangocairo-1.0 -lpango-1.0 -lharfbuzz -latk-1.0 -lcairo-gobject -lcairo -lgdk_pixbuf-2.0 -lgio-2.0 -lgobject-2.0 -lglib-2.0
Run-time dependency vted-3 found: YES 3.10.0
Pkg-config binary for 1 is cached.
Determining dependency 'x11' with pkg-config executable '/usr/bin/pkg-config'
env[PKG_CONFIG_PATH]: 
Called `/usr/bin/pkg-config --modversion x11` -> 0
1.8.1
env[PKG_CONFIG_PATH]: 
Called `/usr/bin/pkg-config --cflags x11` -> 0

env[PKG_CONFIG_ALLOW_SYSTEM_LIBS]: 1
env[PKG_CONFIG_PATH]: 
Called `/usr/bin/pkg-config --libs x11` -> 0
-L/usr/lib/arm-linux-gnueabihf -lX11
env[PKG_CONFIG_PATH]: 
Called `/usr/bin/pkg-config --libs x11` -> 0
-lX11
Run-time dependency x11 found: YES 1.8.1
Pkg-config binary for 1 is cached.
Determining dependency 'libunwind' with pkg-config executable '/usr/bin/pkg-config'
env[PKG_CONFIG_PATH]: 
Called `/usr/bin/pkg-config --modversion libunwind` -> 0
1.3.2
env[PKG_CONFIG_PATH]: 
Called `/usr/bin/pkg-config --cflags libunwind` -> 0
-I/usr/include/arm-linux-gnueabihf
env[PKG_CONFIG_ALLOW_SYSTEM_LIBS]: 1
env[PKG_CONFIG_PATH]: 
Called `/usr/bin/pkg-config --libs libunwind` -> 0
-L/usr/lib/arm-linux-gnueabihf -lunwind
env[PKG_CONFIG_PATH]: 
Called `/usr/bin/pkg-config --libs libunwind` -> 0
-lunwind
Run-time dependency libunwind found: YES 1.3.2
Pkg-config binary for 1 is cached.
Determining dependency 'libsecret-1' with pkg-config executable '/usr/bin/pkg-config'
env[PKG_CONFIG_PATH]: 
Called `/usr/bin/pkg-config --modversion libsecret-1` -> 0
0.20.5
env[PKG_CONFIG_PATH]: 
Called `/usr/bin/pkg-config --cflags libsecret-1` -> 0
-pthread -I/usr/include/libsecret-1 -I/usr/include/gio-unix-2.0 -I/usr/include/libmount -I/usr/include/blkid -I/usr/include/glib-2.0 -I/usr/lib/arm-linux-gnueabihf/glib-2.0/include
env[PKG_CONFIG_ALLOW_SYSTEM_LIBS]: 1
env[PKG_CONFIG_PATH]: 
Called `/usr/bin/pkg-config --libs libsecret-1` -> 0
-L/usr/lib/arm-linux-gnueabihf -lsecret-1 -lgio-2.0 -lgobject-2.0 -lglib-2.0
env[PKG_CONFIG_PATH]: 
Called `/usr/bin/pkg-config --libs libsecret-1` -> 0
-lsecret-1 -lgio-2.0 -lgobject-2.0 -lglib-2.0
Run-time dependency libsecret-1 found: YES 0.20.5
Program msgfmt found: YES (/usr/bin/msgfmt)
Program msginit found: YES (/usr/bin/msginit)
Program msgmerge found: YES (/usr/bin/msgmerge)
Program xgettext found: YES (/usr/bin/xgettext)

../data/meson.build:13:0: ERROR: Function does not take positional arguments.
dh_auto_configure: error: cd obj-arm-linux-gnueabihf && LC_ALL=C.UTF-8 meson .. --wrap-mode=nodownload --buildtype=plain --prefix=/usr --sysconfdir=/etc --localstatedir=/var --libdir=lib/arm-linux-gnueabihf returned exit code 1
make: *** [debian/rules:11: build-arch] Error 25
dpkg-buildpackage: error: debian/rules build-arch subprocess returned exit status 2
--------------------------------------------------------------------------------
Build finished at 2022-08-30T06:56:34Z

Finished
--------


+------------------------------------------------------------------------------+
| Cleanup                                                                      |
+------------------------------------------------------------------------------+

Purging /<<BUILDDIR>>
Not cleaning session: cloned chroot in use
E: Build failure (dpkg-buildpackage died)

+------------------------------------------------------------------------------+
| Summary                                                                      |
+------------------------------------------------------------------------------+

Build Architecture: armhf
Build-Space: 0
Build-Time: 19
Distribution: bookworm-staging
Fail-Stage: build
Host Architecture: armhf
Install-Time: 2176
Job: tilix_1.9.4-2
Machine Architecture: armhf
Package: tilix
Package-Time: 2259
Source-Version: 1.9.4-2
Space: 0
Status: failed
Version: 1.9.4-2
--------------------------------------------------------------------------------
Finished at 2022-08-30T06:56:34Z
Build needed 00:00:00, 0k disc space