Raspbian Package Auto-Building

Build log for python-rocksdb (0.8.0~rc3-2) on armhf

python-rocksdb0.8.0~rc3-2armhf → 2022-09-14 01:03:47

sbuild (Debian sbuild) 0.72.0 (25 Oct 2016) on mb-lxc-01

+==============================================================================+
| python-rocksdb 0.8.0~rc3-2 (armhf)           Wed, 14 Sep 2022 00:52:11 +0000 |
+==============================================================================+

Package: python-rocksdb
Version: 0.8.0~rc3-2
Source Version: 0.8.0~rc3-2
Distribution: bookworm-staging
Machine Architecture: armhf
Host Architecture: armhf
Build Architecture: armhf

I: NOTICE: Log filtering will replace 'var/lib/schroot/mount/bookworm-staging-armhf-sbuild-a8be2f09-2af2-44db-9b0b-23ea29c50bbc' with '<<CHROOT>>'

+------------------------------------------------------------------------------+
| Update chroot                                                                |
+------------------------------------------------------------------------------+

Get:1 http://172.17.4.1/private bookworm-staging InRelease [11.3 kB]
Get:2 http://172.17.4.1/private bookworm-staging/main Sources [13.3 MB]
Get:3 http://172.17.4.1/private bookworm-staging/main armhf Packages [14.1 MB]
Fetched 27.4 MB in 10s (2853 kB/s)
Reading package lists...
W: No sandbox user '_apt' on the system, can not drop privileges
W: http://172.17.4.1/private/dists/bookworm-staging/InRelease: Key is stored in legacy trusted.gpg keyring (/etc/apt/trusted.gpg), see the DEPRECATION section in apt-key(8) for details.

+------------------------------------------------------------------------------+
| Fetch source files                                                           |
+------------------------------------------------------------------------------+


Check APT
---------

Checking available source versions...

Download source files with APT
------------------------------

Reading package lists...
NOTICE: 'python-rocksdb' packaging is maintained in the 'Git' version control system at:
https://salsa.debian.org/python-team/packages/python-rocksdb.git
Please use:
git clone https://salsa.debian.org/python-team/packages/python-rocksdb.git
to retrieve the latest (possibly unreleased) updates to the package.
Need to get 65.0 kB of source archives.
Get:1 http://172.17.4.1/private bookworm-staging/main python-rocksdb 0.8.0~rc3-2 (dsc) [2243 B]
Get:2 http://172.17.4.1/private bookworm-staging/main python-rocksdb 0.8.0~rc3-2 (tar) [59.8 kB]
Get:3 http://172.17.4.1/private bookworm-staging/main python-rocksdb 0.8.0~rc3-2 (diff) [3020 B]
Fetched 65.0 kB in 0s (1882 kB/s)
Download complete and in download only mode
I: NOTICE: Log filtering will replace 'build/python-rocksdb-YG1r4N/python-rocksdb-0.8.0~rc3' with '<<PKGBUILDDIR>>'
I: NOTICE: Log filtering will replace 'build/python-rocksdb-YG1r4N' with '<<BUILDDIR>>'

+------------------------------------------------------------------------------+
| Install build-essential                                                      |
+------------------------------------------------------------------------------+


Setup apt archive
-----------------

Merged Build-Depends: build-essential, fakeroot
Filtered Build-Depends: build-essential, fakeroot
dpkg-deb: building package 'sbuild-build-depends-core-dummy' in '/<<BUILDDIR>>/resolver-d5vXhr/apt_archive/sbuild-build-depends-core-dummy.deb'.
dpkg-scanpackages: warning: Packages in archive but missing from override file:
dpkg-scanpackages: warning:   sbuild-build-depends-core-dummy
dpkg-scanpackages: info: Wrote 1 entries to output Packages file.
gpg: keybox '/<<BUILDDIR>>/resolver-d5vXhr/gpg/pubring.kbx' created
gpg: /<<BUILDDIR>>/resolver-d5vXhr/gpg/trustdb.gpg: trustdb created
gpg: key 37145E60F90AF620: public key "Sbuild Signer (Sbuild Build Dependency Archive Key) <buildd-tools-devel@lists.alioth.debian.org>" imported
gpg: Total number processed: 1
gpg:               imported: 1
gpg: key 37145E60F90AF620: "Sbuild Signer (Sbuild Build Dependency Archive Key) <buildd-tools-devel@lists.alioth.debian.org>" not changed
gpg: key 37145E60F90AF620: secret key imported
gpg: Total number processed: 1
gpg:              unchanged: 1
gpg:       secret keys read: 1
gpg:   secret keys imported: 1
gpg: using "Sbuild Signer" as default secret key for signing
Ign:1 copy:/<<BUILDDIR>>/resolver-d5vXhr/apt_archive ./ InRelease
Get:2 copy:/<<BUILDDIR>>/resolver-d5vXhr/apt_archive ./ Release [957 B]
Get:3 copy:/<<BUILDDIR>>/resolver-d5vXhr/apt_archive ./ Release.gpg [370 B]
Get:4 copy:/<<BUILDDIR>>/resolver-d5vXhr/apt_archive ./ Sources [349 B]
Get:5 copy:/<<BUILDDIR>>/resolver-d5vXhr/apt_archive ./ Packages [432 B]
Fetched 2108 B in 0s (8234 B/s)
Reading package lists...
W: No sandbox user '_apt' on the system, can not drop privileges
Reading package lists...

Install core build dependencies (apt-based resolver)
----------------------------------------------------

Installing build dependencies
Reading package lists...
Building dependency tree...
Reading state information...
The following packages were automatically installed and are no longer required:
  krb5-locales libpam-cap netbase sensible-utils
Use 'apt autoremove' to remove them.
The following NEW packages will be installed:
  sbuild-build-depends-core-dummy
0 upgraded, 1 newly installed, 0 to remove and 37 not upgraded.
Need to get 848 B of archives.
After this operation, 0 B of additional disk space will be used.
Get:1 copy:/<<BUILDDIR>>/resolver-d5vXhr/apt_archive ./ sbuild-build-depends-core-dummy 0.invalid.0 [848 B]
debconf: delaying package configuration, since apt-utils is not installed
Fetched 848 B in 0s (71.2 kB/s)
Selecting previously unselected package sbuild-build-depends-core-dummy.
(Reading database ... 12802 files and directories currently installed.)
Preparing to unpack .../sbuild-build-depends-core-dummy_0.invalid.0_armhf.deb ...
Unpacking sbuild-build-depends-core-dummy (0.invalid.0) ...
Setting up sbuild-build-depends-core-dummy (0.invalid.0) ...
W: No sandbox user '_apt' on the system, can not drop privileges

+------------------------------------------------------------------------------+
| Check architectures                                                          |
+------------------------------------------------------------------------------+

Arch check ok (armhf included in any)

+------------------------------------------------------------------------------+
| Install package build dependencies                                           |
+------------------------------------------------------------------------------+


Setup apt archive
-----------------

Merged Build-Depends: cython3, debhelper-compat (= 13), dh-python, libbz2-dev, liblz4-dev, librocksdb-dev, libsnappy-dev, libz-dev, python3-all-dev, python3-all-dbg, python3-docutils, python3-pytest, python3-setuptools, python3-sphinx
Filtered Build-Depends: cython3, debhelper-compat (= 13), dh-python, libbz2-dev, liblz4-dev, librocksdb-dev, libsnappy-dev, libz-dev, python3-all-dev, python3-all-dbg, python3-docutils, python3-pytest, python3-setuptools, python3-sphinx
dpkg-deb: building package 'sbuild-build-depends-python-rocksdb-dummy' in '/<<BUILDDIR>>/resolver-d5vXhr/apt_archive/sbuild-build-depends-python-rocksdb-dummy.deb'.
dpkg-scanpackages: warning: Packages in archive but missing from override file:
dpkg-scanpackages: warning:   sbuild-build-depends-core-dummy sbuild-build-depends-python-rocksdb-dummy
dpkg-scanpackages: info: Wrote 2 entries to output Packages file.
gpg: using "Sbuild Signer" as default secret key for signing
Ign:1 copy:/<<BUILDDIR>>/resolver-d5vXhr/apt_archive ./ InRelease
Get:2 copy:/<<BUILDDIR>>/resolver-d5vXhr/apt_archive ./ Release [963 B]
Get:3 copy:/<<BUILDDIR>>/resolver-d5vXhr/apt_archive ./ Release.gpg [370 B]
Get:4 copy:/<<BUILDDIR>>/resolver-d5vXhr/apt_archive ./ Sources [573 B]
Get:5 copy:/<<BUILDDIR>>/resolver-d5vXhr/apt_archive ./ Packages [651 B]
Fetched 2557 B in 0s (12.4 kB/s)
Reading package lists...
W: No sandbox user '_apt' on the system, can not drop privileges
Reading package lists...

Install python-rocksdb build dependencies (apt-based resolver)
--------------------------------------------------------------

Installing build dependencies
Reading package lists...
Building dependency tree...
Reading state information...
The following packages were automatically installed and are no longer required:
  krb5-locales libpam-cap netbase
Use 'apt autoremove' to remove them.
The following additional packages will be installed:
  autoconf automake autopoint autotools-dev bsdextrautils ca-certificates
  cython3 debhelper dh-autoreconf dh-python dh-strip-nondeterminism
  docutils-common dwz file gettext gettext-base groff-base intltool-debian
  libarchive-zip-perl libbz2-dev libdebhelper-perl libelf1 libexpat1
  libexpat1-dev libfile-stripnondeterminism-perl libgflags-dev libgflags2.2
  libicu71 libjs-jquery libjs-sphinxdoc libjs-underscore libjson-perl liblz4-1
  liblz4-dev libmagic-mgc libmagic1 libmpdec3 libpipeline1 libpython3-all-dbg
  libpython3-all-dev libpython3-dbg libpython3-dev libpython3-stdlib
  libpython3.10 libpython3.10-dbg libpython3.10-dev libpython3.10-minimal
  libpython3.10-stdlib librocksdb-dev librocksdb7.3 libsnappy-dev libsnappy1v5
  libsub-override-perl libtool libuchardet0 libxml2 libzstd-dev m4 man-db
  media-types openssl po-debconf python-babel-localedata python3
  python3-alabaster python3-all python3-all-dbg python3-all-dev python3-attr
  python3-babel python3-certifi python3-chardet python3-charset-normalizer
  python3-dbg python3-dev python3-distutils python3-docutils python3-idna
  python3-imagesize python3-importlib-metadata python3-iniconfig
  python3-jinja2 python3-lib2to3 python3-markupsafe python3-minimal
  python3-more-itertools python3-packaging python3-pkg-resources
  python3-pluggy python3-py python3-pygments python3-pyparsing python3-pytest
  python3-requests python3-roman python3-setuptools python3-six
  python3-snowballstemmer python3-sphinx python3-tomli python3-tz
  python3-urllib3 python3-zipp python3.10 python3.10-dbg python3.10-dev
  python3.10-minimal sphinx-common xml-core zlib1g-dev
Suggested packages:
  autoconf-archive gnu-standards autoconf-doc cython-doc dh-make flit
  python3-build python3-installer gettext-doc libasprintf-dev libgettextpo-dev
  groff libtool-doc gfortran | fortran95-compiler gcj-jdk m4-doc apparmor less
  www-browser libmail-box-perl python3-doc python3-tk python3-venv
  python-attr-doc docutils-doc fonts-linuxlibertine | ttf-linux-libertine
  texlive-lang-french texlive-latex-base texlive-latex-recommended
  python-jinja2-doc subversion python-pygments-doc ttf-bitstream-vera
  python-pyparsing-doc python3-cryptography python3-openssl python3-socks
  python-requests-doc python-setuptools-doc python3-stemmer dvipng
  fonts-freefont-otf imagemagick-6.q16 latexmk libjs-mathjax
  python3-sphinx-rtd-theme sphinx-doc tex-gyre texlive-fonts-recommended
  texlive-latex-extra texlive-plain-generic python3-brotli python3.10-venv
  python3.10-doc python3-gdbm-dbg python3-tk-dbg binfmt-support
Recommended packages:
  curl | wget | lynx bzip2-doc libarchive-cpio-perl javascript-common
  libjson-xs-perl libltdl-dev libmail-sendmail-perl libpaper-utils python3-pil
  gdb
The following NEW packages will be installed:
  autoconf automake autopoint autotools-dev bsdextrautils ca-certificates
  cython3 debhelper dh-autoreconf dh-python dh-strip-nondeterminism
  docutils-common dwz file gettext gettext-base groff-base intltool-debian
  libarchive-zip-perl libbz2-dev libdebhelper-perl libelf1 libexpat1
  libexpat1-dev libfile-stripnondeterminism-perl libgflags-dev libgflags2.2
  libicu71 libjs-jquery libjs-sphinxdoc libjs-underscore libjson-perl
  liblz4-dev libmagic-mgc libmagic1 libmpdec3 libpipeline1 libpython3-all-dbg
  libpython3-all-dev libpython3-dbg libpython3-dev libpython3-stdlib
  libpython3.10 libpython3.10-dbg libpython3.10-dev libpython3.10-minimal
  libpython3.10-stdlib librocksdb-dev librocksdb7.3 libsnappy-dev libsnappy1v5
  libsub-override-perl libtool libuchardet0 libxml2 libzstd-dev m4 man-db
  media-types openssl po-debconf python-babel-localedata python3
  python3-alabaster python3-all python3-all-dbg python3-all-dev python3-attr
  python3-babel python3-certifi python3-chardet python3-charset-normalizer
  python3-dbg python3-dev python3-distutils python3-docutils python3-idna
  python3-imagesize python3-importlib-metadata python3-iniconfig
  python3-jinja2 python3-lib2to3 python3-markupsafe python3-minimal
  python3-more-itertools python3-packaging python3-pkg-resources
  python3-pluggy python3-py python3-pygments python3-pyparsing python3-pytest
  python3-requests python3-roman python3-setuptools python3-six
  python3-snowballstemmer python3-sphinx python3-tomli python3-tz
  python3-urllib3 python3-zipp python3.10 python3.10-dbg python3.10-dev
  python3.10-minimal sbuild-build-depends-python-rocksdb-dummy sphinx-common
  xml-core zlib1g-dev
The following packages will be upgraded:
  liblz4-1
1 upgraded, 110 newly installed, 0 to remove and 36 not upgraded.
Need to get 89.0 MB of archives.
After this operation, 312 MB of additional disk space will be used.
Get:1 copy:/<<BUILDDIR>>/resolver-d5vXhr/apt_archive ./ sbuild-build-depends-python-rocksdb-dummy 0.invalid.0 [936 B]
Get:2 http://172.17.4.1/private bookworm-staging/main armhf libpython3.10-minimal armhf 3.10.6-1 [813 kB]
Get:3 http://172.17.4.1/private bookworm-staging/main armhf libexpat1 armhf 2.4.8-1 [84.1 kB]
Get:4 http://172.17.4.1/private bookworm-staging/main armhf python3.10-minimal armhf 3.10.6-1 [1520 kB]
Get:5 http://172.17.4.1/private bookworm-staging/main armhf python3-minimal armhf 3.10.6-1 [38.7 kB]
Get:6 http://172.17.4.1/private bookworm-staging/main armhf media-types all 8.0.0 [33.4 kB]
Get:7 http://172.17.4.1/private bookworm-staging/main armhf libmpdec3 armhf 2.5.1-2+rpi1 [73.5 kB]
Get:8 http://172.17.4.1/private bookworm-staging/main armhf libpython3.10-stdlib armhf 3.10.6-1 [1596 kB]
Get:9 http://172.17.4.1/private bookworm-staging/main armhf python3.10 armhf 3.10.6-1 [545 kB]
Get:10 http://172.17.4.1/private bookworm-staging/main armhf libpython3-stdlib armhf 3.10.6-1 [21.7 kB]
Get:11 http://172.17.4.1/private bookworm-staging/main armhf python3 armhf 3.10.6-1 [38.2 kB]
Get:12 http://172.17.4.1/private bookworm-staging/main armhf liblz4-1 armhf 1.9.4-1+rpi1 [54.5 kB]
Get:13 http://172.17.4.1/private bookworm-staging/main armhf libuchardet0 armhf 0.0.7-1 [65.0 kB]
Get:14 http://172.17.4.1/private bookworm-staging/main armhf groff-base armhf 1.22.4-8 [793 kB]
Get:15 http://172.17.4.1/private bookworm-staging/main armhf bsdextrautils armhf 2.38.1-1 [137 kB]
Get:16 http://172.17.4.1/private bookworm-staging/main armhf libpipeline1 armhf 1.5.6-2 [34.2 kB]
Get:17 http://172.17.4.1/private bookworm-staging/main armhf man-db armhf 2.10.2-3 [1364 kB]
Get:18 http://172.17.4.1/private bookworm-staging/main armhf openssl armhf 3.0.5-2 [1372 kB]
Get:19 http://172.17.4.1/private bookworm-staging/main armhf ca-certificates all 20211016 [156 kB]
Get:20 http://172.17.4.1/private bookworm-staging/main armhf libmagic-mgc armhf 1:5.41-4 [295 kB]
Get:21 http://172.17.4.1/private bookworm-staging/main armhf libmagic1 armhf 1:5.41-4 [120 kB]
Get:22 http://172.17.4.1/private bookworm-staging/main armhf file armhf 1:5.41-4 [65.8 kB]
Get:23 http://172.17.4.1/private bookworm-staging/main armhf gettext-base armhf 0.21-9 [171 kB]
Get:24 http://172.17.4.1/private bookworm-staging/main armhf m4 armhf 1.4.19-1 [260 kB]
Get:25 http://172.17.4.1/private bookworm-staging/main armhf autoconf all 2.71-2 [343 kB]
Get:26 http://172.17.4.1/private bookworm-staging/main armhf autotools-dev all 20220109.1 [51.6 kB]
Get:27 http://172.17.4.1/private bookworm-staging/main armhf automake all 1:1.16.5-1.3 [823 kB]
Get:28 http://172.17.4.1/private bookworm-staging/main armhf autopoint all 0.21-9 [510 kB]
Get:29 http://172.17.4.1/private bookworm-staging/main armhf cython3 armhf 0.29.30-1 [1585 kB]
Get:30 http://172.17.4.1/private bookworm-staging/main armhf libdebhelper-perl all 13.9.1 [196 kB]
Get:31 http://172.17.4.1/private bookworm-staging/main armhf libtool all 2.4.7-4 [526 kB]
Get:32 http://172.17.4.1/private bookworm-staging/main armhf dh-autoreconf all 20 [17.1 kB]
Get:33 http://172.17.4.1/private bookworm-staging/main armhf libarchive-zip-perl all 1.68-1 [104 kB]
Get:34 http://172.17.4.1/private bookworm-staging/main armhf libsub-override-perl all 0.09-3 [10.4 kB]
Get:35 http://172.17.4.1/private bookworm-staging/main armhf libfile-stripnondeterminism-perl all 1.13.0-1 [26.6 kB]
Get:36 http://172.17.4.1/private bookworm-staging/main armhf dh-strip-nondeterminism all 1.13.0-1 [15.8 kB]
Get:37 http://172.17.4.1/private bookworm-staging/main armhf libelf1 armhf 0.187-2+rpi2 [177 kB]
Get:38 http://172.17.4.1/private bookworm-staging/main armhf dwz armhf 0.14-1 [83.0 kB]
Get:39 http://172.17.4.1/private bookworm-staging/main armhf libicu71 armhf 71.1-3 [8855 kB]
Get:40 http://172.17.4.1/private bookworm-staging/main armhf libxml2 armhf 2.9.14+dfsg-1 [591 kB]
Get:41 http://172.17.4.1/private bookworm-staging/main armhf gettext armhf 0.21-9 [1220 kB]
Get:42 http://172.17.4.1/private bookworm-staging/main armhf intltool-debian all 0.35.0+20060710.5 [26.8 kB]
Get:43 http://172.17.4.1/private bookworm-staging/main armhf po-debconf all 1.0.21+nmu1 [248 kB]
Get:44 http://172.17.4.1/private bookworm-staging/main armhf debhelper all 13.9.1 [1071 kB]
Get:45 http://172.17.4.1/private bookworm-staging/main armhf python3-lib2to3 all 3.10.6-1 [79.9 kB]
Get:46 http://172.17.4.1/private bookworm-staging/main armhf python3-distutils all 3.10.6-1 [141 kB]
Get:47 http://172.17.4.1/private bookworm-staging/main armhf dh-python all 5.20220819+rpi1 [114 kB]
Get:48 http://172.17.4.1/private bookworm-staging/main armhf xml-core all 0.18+nmu1 [23.8 kB]
Get:49 http://172.17.4.1/private bookworm-staging/main armhf docutils-common all 0.17.1+dfsg-2 [127 kB]
Get:50 http://172.17.4.1/private bookworm-staging/main armhf libbz2-dev armhf 1.0.8-5+b2 [26.8 kB]
Get:51 http://172.17.4.1/private bookworm-staging/main armhf libexpat1-dev armhf 2.4.8-1 [137 kB]
Get:52 http://172.17.4.1/private bookworm-staging/main armhf libgflags2.2 armhf 2.2.2-2 [63.7 kB]
Get:53 http://172.17.4.1/private bookworm-staging/main armhf libgflags-dev armhf 2.2.2-2 [82.1 kB]
Get:54 http://172.17.4.1/private bookworm-staging/main armhf libjs-jquery all 3.6.0+dfsg+~3.5.13-1 [316 kB]
Get:55 http://172.17.4.1/private bookworm-staging/main armhf libjs-underscore all 1.13.4~dfsg+~1.11.4-1 [119 kB]
Get:56 http://172.17.4.1/private bookworm-staging/main armhf libjs-sphinxdoc all 4.5.0-4 [142 kB]
Get:57 http://172.17.4.1/private bookworm-staging/main armhf libjson-perl all 4.09000-1 [90.5 kB]
Get:58 http://172.17.4.1/private bookworm-staging/main armhf liblz4-dev armhf 1.9.4-1+rpi1 [76.2 kB]
Get:59 http://172.17.4.1/private bookworm-staging/main armhf libpython3.10-dbg armhf 3.10.6-1 [12.9 MB]
Get:60 http://172.17.4.1/private bookworm-staging/main armhf libpython3-dbg armhf 3.10.6-1 [22.0 kB]
Get:61 http://172.17.4.1/private bookworm-staging/main armhf libpython3-all-dbg armhf 3.10.6-1 [1068 B]
Get:62 http://172.17.4.1/private bookworm-staging/main armhf libpython3.10 armhf 3.10.6-1 [1456 kB]
Get:63 http://172.17.4.1/private bookworm-staging/main armhf zlib1g-dev armhf 1:1.2.11.dfsg-4.1 [183 kB]
Get:64 http://172.17.4.1/private bookworm-staging/main armhf libpython3.10-dev armhf 3.10.6-1 [2991 kB]
Get:65 http://172.17.4.1/private bookworm-staging/main armhf libpython3-dev armhf 3.10.6-1 [22.0 kB]
Get:66 http://172.17.4.1/private bookworm-staging/main armhf libpython3-all-dev armhf 3.10.6-1 [1068 B]
Get:67 http://172.17.4.1/private bookworm-staging/main armhf libsnappy1v5 armhf 1.1.9-2 [25.5 kB]
Get:68 http://172.17.4.1/private bookworm-staging/main armhf librocksdb7.3 armhf 7.3.1-2 [2683 kB]
Get:69 http://172.17.4.1/private bookworm-staging/main armhf libsnappy-dev armhf 1.1.9-2 [38.2 kB]
Get:70 http://172.17.4.1/private bookworm-staging/main armhf libzstd-dev armhf 1.5.2+dfsg-1 [289 kB]
Get:71 http://172.17.4.1/private bookworm-staging/main armhf librocksdb-dev armhf 7.3.1-2 [4148 kB]
Get:72 http://172.17.4.1/private bookworm-staging/main armhf python-babel-localedata all 2.8.0+dfsg.1-7 [4997 kB]
Get:73 http://172.17.4.1/private bookworm-staging/main armhf python3-alabaster all 0.7.12-1 [20.8 kB]
Get:74 http://172.17.4.1/private bookworm-staging/main armhf python3-all armhf 3.10.6-1 [1060 B]
Get:75 http://172.17.4.1/private bookworm-staging/main armhf python3.10-dbg armhf 3.10.6-1 [26.6 MB]
Get:76 http://172.17.4.1/private bookworm-staging/main armhf python3-dbg armhf 3.10.6-1 [1228 B]
Get:77 http://172.17.4.1/private bookworm-staging/main armhf python3-all-dbg armhf 3.10.6-1 [1068 B]
Get:78 http://172.17.4.1/private bookworm-staging/main armhf python3.10-dev armhf 3.10.6-1 [509 kB]
Get:79 http://172.17.4.1/private bookworm-staging/main armhf python3-dev armhf 3.10.6-1 [25.4 kB]
Get:80 http://172.17.4.1/private bookworm-staging/main armhf python3-all-dev armhf 3.10.6-1 [1068 B]
Get:81 http://172.17.4.1/private bookworm-staging/main armhf python3-attr all 22.1.0-1 [64.1 kB]
Get:82 http://172.17.4.1/private bookworm-staging/main armhf python3-pkg-resources all 59.6.0-1.2 [196 kB]
Get:83 http://172.17.4.1/private bookworm-staging/main armhf python3-tz all 2022.2.1-1 [34.8 kB]
Get:84 http://172.17.4.1/private bookworm-staging/main armhf python3-babel all 2.8.0+dfsg.1-7 [100 kB]
Get:85 http://172.17.4.1/private bookworm-staging/main armhf python3-certifi all 2022.6.15-2 [154 kB]
Get:86 http://172.17.4.1/private bookworm-staging/main armhf python3-chardet all 4.0.0-2 [99.1 kB]
Get:87 http://172.17.4.1/private bookworm-staging/main armhf python3-charset-normalizer all 2.0.6-2 [30.6 kB]
Get:88 http://172.17.4.1/private bookworm-staging/main armhf python3-roman all 3.3-1 [10.7 kB]
Get:89 http://172.17.4.1/private bookworm-staging/main armhf python3-docutils all 0.17.1+dfsg-2 [393 kB]
Get:90 http://172.17.4.1/private bookworm-staging/main armhf python3-idna all 3.3-1 [39.4 kB]
Get:91 http://172.17.4.1/private bookworm-staging/main armhf python3-imagesize all 1.4.1-1 [6688 B]
Get:92 http://172.17.4.1/private bookworm-staging/main armhf python3-more-itertools all 8.10.0-2 [53.0 kB]
Get:93 http://172.17.4.1/private bookworm-staging/main armhf python3-zipp all 1.0.0-4 [6160 B]
Get:94 http://172.17.4.1/private bookworm-staging/main armhf python3-importlib-metadata all 4.12.0-1 [24.9 kB]
Get:95 http://172.17.4.1/private bookworm-staging/main armhf python3-iniconfig all 1.1.1-2 [6396 B]
Get:96 http://172.17.4.1/private bookworm-staging/main armhf python3-markupsafe armhf 2.0.1-2+b1 [13.5 kB]
Get:97 http://172.17.4.1/private bookworm-staging/main armhf python3-jinja2 all 3.0.3-1 [121 kB]
Ign:97 http://172.17.4.1/private bookworm-staging/main armhf python3-jinja2 all 3.0.3-1
Get:98 http://172.17.4.1/private bookworm-staging/main armhf python3-pyparsing all 3.0.7-2 [140 kB]
Get:99 http://172.17.4.1/private bookworm-staging/main armhf python3-packaging all 21.3-1 [34.1 kB]
Get:100 http://172.17.4.1/private bookworm-staging/main armhf python3-pluggy all 1.0.0+repack-1 [19.7 kB]
Get:101 http://172.17.4.1/private bookworm-staging/main armhf python3-py all 1.10.0-1 [94.2 kB]
Get:102 http://172.17.4.1/private bookworm-staging/main armhf python3-pygments all 2.12.0+dfsg-2 [765 kB]
Get:103 http://172.17.4.1/private bookworm-staging/main armhf python3-tomli all 2.0.1-1 [18.1 kB]
Get:104 http://172.17.4.1/private bookworm-staging/main armhf python3-pytest all 7.1.2-2 [223 kB]
Get:105 http://172.17.4.1/private bookworm-staging/main armhf python3-six all 1.16.0-4 [17.5 kB]
Get:106 http://172.17.4.1/private bookworm-staging/main armhf python3-urllib3 all 1.26.9-1 [116 kB]
Get:107 http://172.17.4.1/private bookworm-staging/main armhf python3-requests all 2.27.1+dfsg-1 [71.9 kB]
Get:108 http://172.17.4.1/private bookworm-staging/main armhf python3-setuptools all 59.6.0-1.2 [401 kB]
Get:109 http://172.17.4.1/private bookworm-staging/main armhf python3-snowballstemmer all 2.2.0-1 [58.5 kB]
Get:110 http://172.17.4.1/private bookworm-staging/main armhf sphinx-common all 4.5.0-4 [638 kB]
Get:111 http://172.17.4.1/private bookworm-staging/main armhf python3-sphinx all 4.5.0-4 [540 kB]
Get:97 http://172.17.4.1/private bookworm-staging/main armhf python3-jinja2 all 3.0.3-1 [121 kB]
debconf: delaying package configuration, since apt-utils is not installed
Fetched 88.9 MB in 9s (10.0 MB/s)
Selecting previously unselected package libpython3.10-minimal:armhf.
(Reading database ... 12802 files and directories currently installed.)
Preparing to unpack .../libpython3.10-minimal_3.10.6-1_armhf.deb ...
Unpacking libpython3.10-minimal:armhf (3.10.6-1) ...
Selecting previously unselected package libexpat1:armhf.
Preparing to unpack .../libexpat1_2.4.8-1_armhf.deb ...
Unpacking libexpat1:armhf (2.4.8-1) ...
Selecting previously unselected package python3.10-minimal.
Preparing to unpack .../python3.10-minimal_3.10.6-1_armhf.deb ...
Unpacking python3.10-minimal (3.10.6-1) ...
Setting up libpython3.10-minimal:armhf (3.10.6-1) ...
Setting up libexpat1:armhf (2.4.8-1) ...
Setting up python3.10-minimal (3.10.6-1) ...
Selecting previously unselected package python3-minimal.
(Reading database ... 13105 files and directories currently installed.)
Preparing to unpack .../0-python3-minimal_3.10.6-1_armhf.deb ...
Unpacking python3-minimal (3.10.6-1) ...
Selecting previously unselected package media-types.
Preparing to unpack .../1-media-types_8.0.0_all.deb ...
Unpacking media-types (8.0.0) ...
Selecting previously unselected package libmpdec3:armhf.
Preparing to unpack .../2-libmpdec3_2.5.1-2+rpi1_armhf.deb ...
Unpacking libmpdec3:armhf (2.5.1-2+rpi1) ...
Selecting previously unselected package libpython3.10-stdlib:armhf.
Preparing to unpack .../3-libpython3.10-stdlib_3.10.6-1_armhf.deb ...
Unpacking libpython3.10-stdlib:armhf (3.10.6-1) ...
Selecting previously unselected package python3.10.
Preparing to unpack .../4-python3.10_3.10.6-1_armhf.deb ...
Unpacking python3.10 (3.10.6-1) ...
Selecting previously unselected package libpython3-stdlib:armhf.
Preparing to unpack .../5-libpython3-stdlib_3.10.6-1_armhf.deb ...
Unpacking libpython3-stdlib:armhf (3.10.6-1) ...
Setting up python3-minimal (3.10.6-1) ...
Selecting previously unselected package python3.
(Reading database ... 13507 files and directories currently installed.)
Preparing to unpack .../python3_3.10.6-1_armhf.deb ...
Unpacking python3 (3.10.6-1) ...
Preparing to unpack .../liblz4-1_1.9.4-1+rpi1_armhf.deb ...
Unpacking liblz4-1:armhf (1.9.4-1+rpi1) over (1.9.3-2) ...
Setting up liblz4-1:armhf (1.9.4-1+rpi1) ...
Selecting previously unselected package libuchardet0:armhf.
(Reading database ... 13527 files and directories currently installed.)
Preparing to unpack .../00-libuchardet0_0.0.7-1_armhf.deb ...
Unpacking libuchardet0:armhf (0.0.7-1) ...
Selecting previously unselected package groff-base.
Preparing to unpack .../01-groff-base_1.22.4-8_armhf.deb ...
Unpacking groff-base (1.22.4-8) ...
Selecting previously unselected package bsdextrautils.
Preparing to unpack .../02-bsdextrautils_2.38.1-1_armhf.deb ...
Unpacking bsdextrautils (2.38.1-1) ...
Selecting previously unselected package libpipeline1:armhf.
Preparing to unpack .../03-libpipeline1_1.5.6-2_armhf.deb ...
Unpacking libpipeline1:armhf (1.5.6-2) ...
Selecting previously unselected package man-db.
Preparing to unpack .../04-man-db_2.10.2-3_armhf.deb ...
Unpacking man-db (2.10.2-3) ...
Selecting previously unselected package openssl.
Preparing to unpack .../05-openssl_3.0.5-2_armhf.deb ...
Unpacking openssl (3.0.5-2) ...
Selecting previously unselected package ca-certificates.
Preparing to unpack .../06-ca-certificates_20211016_all.deb ...
Unpacking ca-certificates (20211016) ...
Selecting previously unselected package libmagic-mgc.
Preparing to unpack .../07-libmagic-mgc_1%3a5.41-4_armhf.deb ...
Unpacking libmagic-mgc (1:5.41-4) ...
Selecting previously unselected package libmagic1:armhf.
Preparing to unpack .../08-libmagic1_1%3a5.41-4_armhf.deb ...
Unpacking libmagic1:armhf (1:5.41-4) ...
Selecting previously unselected package file.
Preparing to unpack .../09-file_1%3a5.41-4_armhf.deb ...
Unpacking file (1:5.41-4) ...
Selecting previously unselected package gettext-base.
Preparing to unpack .../10-gettext-base_0.21-9_armhf.deb ...
Unpacking gettext-base (0.21-9) ...
Selecting previously unselected package m4.
Preparing to unpack .../11-m4_1.4.19-1_armhf.deb ...
Unpacking m4 (1.4.19-1) ...
Selecting previously unselected package autoconf.
Preparing to unpack .../12-autoconf_2.71-2_all.deb ...
Unpacking autoconf (2.71-2) ...
Selecting previously unselected package autotools-dev.
Preparing to unpack .../13-autotools-dev_20220109.1_all.deb ...
Unpacking autotools-dev (20220109.1) ...
Selecting previously unselected package automake.
Preparing to unpack .../14-automake_1%3a1.16.5-1.3_all.deb ...
Unpacking automake (1:1.16.5-1.3) ...
Selecting previously unselected package autopoint.
Preparing to unpack .../15-autopoint_0.21-9_all.deb ...
Unpacking autopoint (0.21-9) ...
Selecting previously unselected package cython3.
Preparing to unpack .../16-cython3_0.29.30-1_armhf.deb ...
Unpacking cython3 (0.29.30-1) ...
Selecting previously unselected package libdebhelper-perl.
Preparing to unpack .../17-libdebhelper-perl_13.9.1_all.deb ...
Unpacking libdebhelper-perl (13.9.1) ...
Selecting previously unselected package libtool.
Preparing to unpack .../18-libtool_2.4.7-4_all.deb ...
Unpacking libtool (2.4.7-4) ...
Selecting previously unselected package dh-autoreconf.
Preparing to unpack .../19-dh-autoreconf_20_all.deb ...
Unpacking dh-autoreconf (20) ...
Selecting previously unselected package libarchive-zip-perl.
Preparing to unpack .../20-libarchive-zip-perl_1.68-1_all.deb ...
Unpacking libarchive-zip-perl (1.68-1) ...
Selecting previously unselected package libsub-override-perl.
Preparing to unpack .../21-libsub-override-perl_0.09-3_all.deb ...
Unpacking libsub-override-perl (0.09-3) ...
Selecting previously unselected package libfile-stripnondeterminism-perl.
Preparing to unpack .../22-libfile-stripnondeterminism-perl_1.13.0-1_all.deb ...
Unpacking libfile-stripnondeterminism-perl (1.13.0-1) ...
Selecting previously unselected package dh-strip-nondeterminism.
Preparing to unpack .../23-dh-strip-nondeterminism_1.13.0-1_all.deb ...
Unpacking dh-strip-nondeterminism (1.13.0-1) ...
Selecting previously unselected package libelf1:armhf.
Preparing to unpack .../24-libelf1_0.187-2+rpi2_armhf.deb ...
Unpacking libelf1:armhf (0.187-2+rpi2) ...
Selecting previously unselected package dwz.
Preparing to unpack .../25-dwz_0.14-1_armhf.deb ...
Unpacking dwz (0.14-1) ...
Selecting previously unselected package libicu71:armhf.
Preparing to unpack .../26-libicu71_71.1-3_armhf.deb ...
Unpacking libicu71:armhf (71.1-3) ...
Selecting previously unselected package libxml2:armhf.
Preparing to unpack .../27-libxml2_2.9.14+dfsg-1_armhf.deb ...
Unpacking libxml2:armhf (2.9.14+dfsg-1) ...
Selecting previously unselected package gettext.
Preparing to unpack .../28-gettext_0.21-9_armhf.deb ...
Unpacking gettext (0.21-9) ...
Selecting previously unselected package intltool-debian.
Preparing to unpack .../29-intltool-debian_0.35.0+20060710.5_all.deb ...
Unpacking intltool-debian (0.35.0+20060710.5) ...
Selecting previously unselected package po-debconf.
Preparing to unpack .../30-po-debconf_1.0.21+nmu1_all.deb ...
Unpacking po-debconf (1.0.21+nmu1) ...
Selecting previously unselected package debhelper.
Preparing to unpack .../31-debhelper_13.9.1_all.deb ...
Unpacking debhelper (13.9.1) ...
Selecting previously unselected package python3-lib2to3.
Preparing to unpack .../32-python3-lib2to3_3.10.6-1_all.deb ...
Unpacking python3-lib2to3 (3.10.6-1) ...
Selecting previously unselected package python3-distutils.
Preparing to unpack .../33-python3-distutils_3.10.6-1_all.deb ...
Unpacking python3-distutils (3.10.6-1) ...
Selecting previously unselected package dh-python.
Preparing to unpack .../34-dh-python_5.20220819+rpi1_all.deb ...
Unpacking dh-python (5.20220819+rpi1) ...
Selecting previously unselected package xml-core.
Preparing to unpack .../35-xml-core_0.18+nmu1_all.deb ...
Unpacking xml-core (0.18+nmu1) ...
Selecting previously unselected package docutils-common.
Preparing to unpack .../36-docutils-common_0.17.1+dfsg-2_all.deb ...
Unpacking docutils-common (0.17.1+dfsg-2) ...
Selecting previously unselected package libbz2-dev:armhf.
Preparing to unpack .../37-libbz2-dev_1.0.8-5+b2_armhf.deb ...
Unpacking libbz2-dev:armhf (1.0.8-5+b2) ...
Selecting previously unselected package libexpat1-dev:armhf.
Preparing to unpack .../38-libexpat1-dev_2.4.8-1_armhf.deb ...
Unpacking libexpat1-dev:armhf (2.4.8-1) ...
Selecting previously unselected package libgflags2.2.
Preparing to unpack .../39-libgflags2.2_2.2.2-2_armhf.deb ...
Unpacking libgflags2.2 (2.2.2-2) ...
Selecting previously unselected package libgflags-dev.
Preparing to unpack .../40-libgflags-dev_2.2.2-2_armhf.deb ...
Unpacking libgflags-dev (2.2.2-2) ...
Selecting previously unselected package libjs-jquery.
Preparing to unpack .../41-libjs-jquery_3.6.0+dfsg+~3.5.13-1_all.deb ...
Unpacking libjs-jquery (3.6.0+dfsg+~3.5.13-1) ...
Selecting previously unselected package libjs-underscore.
Preparing to unpack .../42-libjs-underscore_1.13.4~dfsg+~1.11.4-1_all.deb ...
Unpacking libjs-underscore (1.13.4~dfsg+~1.11.4-1) ...
Selecting previously unselected package libjs-sphinxdoc.
Preparing to unpack .../43-libjs-sphinxdoc_4.5.0-4_all.deb ...
Unpacking libjs-sphinxdoc (4.5.0-4) ...
Selecting previously unselected package libjson-perl.
Preparing to unpack .../44-libjson-perl_4.09000-1_all.deb ...
Unpacking libjson-perl (4.09000-1) ...
Selecting previously unselected package liblz4-dev:armhf.
Preparing to unpack .../45-liblz4-dev_1.9.4-1+rpi1_armhf.deb ...
Unpacking liblz4-dev:armhf (1.9.4-1+rpi1) ...
Selecting previously unselected package libpython3.10-dbg:armhf.
Preparing to unpack .../46-libpython3.10-dbg_3.10.6-1_armhf.deb ...
Unpacking libpython3.10-dbg:armhf (3.10.6-1) ...
Selecting previously unselected package libpython3-dbg:armhf.
Preparing to unpack .../47-libpython3-dbg_3.10.6-1_armhf.deb ...
Unpacking libpython3-dbg:armhf (3.10.6-1) ...
Selecting previously unselected package libpython3-all-dbg:armhf.
Preparing to unpack .../48-libpython3-all-dbg_3.10.6-1_armhf.deb ...
Unpacking libpython3-all-dbg:armhf (3.10.6-1) ...
Selecting previously unselected package libpython3.10:armhf.
Preparing to unpack .../49-libpython3.10_3.10.6-1_armhf.deb ...
Unpacking libpython3.10:armhf (3.10.6-1) ...
Selecting previously unselected package zlib1g-dev:armhf.
Preparing to unpack .../50-zlib1g-dev_1%3a1.2.11.dfsg-4.1_armhf.deb ...
Unpacking zlib1g-dev:armhf (1:1.2.11.dfsg-4.1) ...
Selecting previously unselected package libpython3.10-dev:armhf.
Preparing to unpack .../51-libpython3.10-dev_3.10.6-1_armhf.deb ...
Unpacking libpython3.10-dev:armhf (3.10.6-1) ...
Selecting previously unselected package libpython3-dev:armhf.
Preparing to unpack .../52-libpython3-dev_3.10.6-1_armhf.deb ...
Unpacking libpython3-dev:armhf (3.10.6-1) ...
Selecting previously unselected package libpython3-all-dev:armhf.
Preparing to unpack .../53-libpython3-all-dev_3.10.6-1_armhf.deb ...
Unpacking libpython3-all-dev:armhf (3.10.6-1) ...
Selecting previously unselected package libsnappy1v5:armhf.
Preparing to unpack .../54-libsnappy1v5_1.1.9-2_armhf.deb ...
Unpacking libsnappy1v5:armhf (1.1.9-2) ...
Selecting previously unselected package librocksdb7.3.
Preparing to unpack .../55-librocksdb7.3_7.3.1-2_armhf.deb ...
Unpacking librocksdb7.3 (7.3.1-2) ...
Selecting previously unselected package libsnappy-dev:armhf.
Preparing to unpack .../56-libsnappy-dev_1.1.9-2_armhf.deb ...
Unpacking libsnappy-dev:armhf (1.1.9-2) ...
Selecting previously unselected package libzstd-dev:armhf.
Preparing to unpack .../57-libzstd-dev_1.5.2+dfsg-1_armhf.deb ...
Unpacking libzstd-dev:armhf (1.5.2+dfsg-1) ...
Selecting previously unselected package librocksdb-dev.
Preparing to unpack .../58-librocksdb-dev_7.3.1-2_armhf.deb ...
Unpacking librocksdb-dev (7.3.1-2) ...
Selecting previously unselected package python-babel-localedata.
Preparing to unpack .../59-python-babel-localedata_2.8.0+dfsg.1-7_all.deb ...
Unpacking python-babel-localedata (2.8.0+dfsg.1-7) ...
Selecting previously unselected package python3-alabaster.
Preparing to unpack .../60-python3-alabaster_0.7.12-1_all.deb ...
Unpacking python3-alabaster (0.7.12-1) ...
Selecting previously unselected package python3-all.
Preparing to unpack .../61-python3-all_3.10.6-1_armhf.deb ...
Unpacking python3-all (3.10.6-1) ...
Selecting previously unselected package python3.10-dbg.
Preparing to unpack .../62-python3.10-dbg_3.10.6-1_armhf.deb ...
Unpacking python3.10-dbg (3.10.6-1) ...
Selecting previously unselected package python3-dbg.
Preparing to unpack .../63-python3-dbg_3.10.6-1_armhf.deb ...
Unpacking python3-dbg (3.10.6-1) ...
Selecting previously unselected package python3-all-dbg.
Preparing to unpack .../64-python3-all-dbg_3.10.6-1_armhf.deb ...
Unpacking python3-all-dbg (3.10.6-1) ...
Selecting previously unselected package python3.10-dev.
Preparing to unpack .../65-python3.10-dev_3.10.6-1_armhf.deb ...
Unpacking python3.10-dev (3.10.6-1) ...
Selecting previously unselected package python3-dev.
Preparing to unpack .../66-python3-dev_3.10.6-1_armhf.deb ...
Unpacking python3-dev (3.10.6-1) ...
Selecting previously unselected package python3-all-dev.
Preparing to unpack .../67-python3-all-dev_3.10.6-1_armhf.deb ...
Unpacking python3-all-dev (3.10.6-1) ...
Selecting previously unselected package python3-attr.
Preparing to unpack .../68-python3-attr_22.1.0-1_all.deb ...
Unpacking python3-attr (22.1.0-1) ...
Selecting previously unselected package python3-pkg-resources.
Preparing to unpack .../69-python3-pkg-resources_59.6.0-1.2_all.deb ...
Unpacking python3-pkg-resources (59.6.0-1.2) ...
Selecting previously unselected package python3-tz.
Preparing to unpack .../70-python3-tz_2022.2.1-1_all.deb ...
Unpacking python3-tz (2022.2.1-1) ...
Selecting previously unselected package python3-babel.
Preparing to unpack .../71-python3-babel_2.8.0+dfsg.1-7_all.deb ...
Unpacking python3-babel (2.8.0+dfsg.1-7) ...
Selecting previously unselected package python3-certifi.
Preparing to unpack .../72-python3-certifi_2022.6.15-2_all.deb ...
Unpacking python3-certifi (2022.6.15-2) ...
Selecting previously unselected package python3-chardet.
Preparing to unpack .../73-python3-chardet_4.0.0-2_all.deb ...
Unpacking python3-chardet (4.0.0-2) ...
Selecting previously unselected package python3-charset-normalizer.
Preparing to unpack .../74-python3-charset-normalizer_2.0.6-2_all.deb ...
Unpacking python3-charset-normalizer (2.0.6-2) ...
Selecting previously unselected package python3-roman.
Preparing to unpack .../75-python3-roman_3.3-1_all.deb ...
Unpacking python3-roman (3.3-1) ...
Selecting previously unselected package python3-docutils.
Preparing to unpack .../76-python3-docutils_0.17.1+dfsg-2_all.deb ...
Unpacking python3-docutils (0.17.1+dfsg-2) ...
Selecting previously unselected package python3-idna.
Preparing to unpack .../77-python3-idna_3.3-1_all.deb ...
Unpacking python3-idna (3.3-1) ...
Selecting previously unselected package python3-imagesize.
Preparing to unpack .../78-python3-imagesize_1.4.1-1_all.deb ...
Unpacking python3-imagesize (1.4.1-1) ...
Selecting previously unselected package python3-more-itertools.
Preparing to unpack .../79-python3-more-itertools_8.10.0-2_all.deb ...
Unpacking python3-more-itertools (8.10.0-2) ...
Selecting previously unselected package python3-zipp.
Preparing to unpack .../80-python3-zipp_1.0.0-4_all.deb ...
Unpacking python3-zipp (1.0.0-4) ...
Selecting previously unselected package python3-importlib-metadata.
Preparing to unpack .../81-python3-importlib-metadata_4.12.0-1_all.deb ...
Unpacking python3-importlib-metadata (4.12.0-1) ...
Selecting previously unselected package python3-iniconfig.
Preparing to unpack .../82-python3-iniconfig_1.1.1-2_all.deb ...
Unpacking python3-iniconfig (1.1.1-2) ...
Selecting previously unselected package python3-markupsafe.
Preparing to unpack .../83-python3-markupsafe_2.0.1-2+b1_armhf.deb ...
Unpacking python3-markupsafe (2.0.1-2+b1) ...
Selecting previously unselected package python3-jinja2.
Preparing to unpack .../84-python3-jinja2_3.0.3-1_all.deb ...
Unpacking python3-jinja2 (3.0.3-1) ...
Selecting previously unselected package python3-pyparsing.
Preparing to unpack .../85-python3-pyparsing_3.0.7-2_all.deb ...
Unpacking python3-pyparsing (3.0.7-2) ...
Selecting previously unselected package python3-packaging.
Preparing to unpack .../86-python3-packaging_21.3-1_all.deb ...
Unpacking python3-packaging (21.3-1) ...
Selecting previously unselected package python3-pluggy.
Preparing to unpack .../87-python3-pluggy_1.0.0+repack-1_all.deb ...
Unpacking python3-pluggy (1.0.0+repack-1) ...
Selecting previously unselected package python3-py.
Preparing to unpack .../88-python3-py_1.10.0-1_all.deb ...
Unpacking python3-py (1.10.0-1) ...
Selecting previously unselected package python3-pygments.
Preparing to unpack .../89-python3-pygments_2.12.0+dfsg-2_all.deb ...
Unpacking python3-pygments (2.12.0+dfsg-2) ...
Selecting previously unselected package python3-tomli.
Preparing to unpack .../90-python3-tomli_2.0.1-1_all.deb ...
Unpacking python3-tomli (2.0.1-1) ...
Selecting previously unselected package python3-pytest.
Preparing to unpack .../91-python3-pytest_7.1.2-2_all.deb ...
Unpacking python3-pytest (7.1.2-2) ...
Selecting previously unselected package python3-six.
Preparing to unpack .../92-python3-six_1.16.0-4_all.deb ...
Unpacking python3-six (1.16.0-4) ...
Selecting previously unselected package python3-urllib3.
Preparing to unpack .../93-python3-urllib3_1.26.9-1_all.deb ...
Unpacking python3-urllib3 (1.26.9-1) ...
Selecting previously unselected package python3-requests.
Preparing to unpack .../94-python3-requests_2.27.1+dfsg-1_all.deb ...
Unpacking python3-requests (2.27.1+dfsg-1) ...
Selecting previously unselected package python3-setuptools.
Preparing to unpack .../95-python3-setuptools_59.6.0-1.2_all.deb ...
Unpacking python3-setuptools (59.6.0-1.2) ...
Selecting previously unselected package python3-snowballstemmer.
Preparing to unpack .../96-python3-snowballstemmer_2.2.0-1_all.deb ...
Unpacking python3-snowballstemmer (2.2.0-1) ...
Selecting previously unselected package sphinx-common.
Preparing to unpack .../97-sphinx-common_4.5.0-4_all.deb ...
Unpacking sphinx-common (4.5.0-4) ...
Selecting previously unselected package python3-sphinx.
Preparing to unpack .../98-python3-sphinx_4.5.0-4_all.deb ...
Unpacking python3-sphinx (4.5.0-4) ...
Selecting previously unselected package sbuild-build-depends-python-rocksdb-dummy.
Preparing to unpack .../99-sbuild-build-depends-python-rocksdb-dummy_0.invalid.0_armhf.deb ...
Unpacking sbuild-build-depends-python-rocksdb-dummy (0.invalid.0) ...
Setting up media-types (8.0.0) ...
Setting up libpipeline1:armhf (1.5.6-2) ...
Setting up libicu71:armhf (71.1-3) ...
Setting up libzstd-dev:armhf (1.5.2+dfsg-1) ...
Setting up bsdextrautils (2.38.1-1) ...
Setting up libmagic-mgc (1:5.41-4) ...
Setting up libarchive-zip-perl (1.68-1) ...
Setting up libdebhelper-perl (13.9.1) ...
Setting up libmagic1:armhf (1:5.41-4) ...
Setting up gettext-base (0.21-9) ...
Setting up m4 (1.4.19-1) ...
Setting up file (1:5.41-4) ...
Setting up python-babel-localedata (2.8.0+dfsg.1-7) ...
Setting up libsnappy1v5:armhf (1.1.9-2) ...
Setting up autotools-dev (20220109.1) ...
Setting up libexpat1-dev:armhf (2.4.8-1) ...
Setting up autopoint (0.21-9) ...
Setting up liblz4-dev:armhf (1.9.4-1+rpi1) ...
Setting up autoconf (2.71-2) ...
Setting up zlib1g-dev:armhf (1:1.2.11.dfsg-4.1) ...
Setting up xml-core (0.18+nmu1) ...
Setting up libuchardet0:armhf (0.0.7-1) ...
Setting up libjson-perl (4.09000-1) ...
Setting up libmpdec3:armhf (2.5.1-2+rpi1) ...
Setting up libsub-override-perl (0.09-3) ...
Setting up libjs-jquery (3.6.0+dfsg+~3.5.13-1) ...
Setting up openssl (3.0.5-2) ...
Setting up libelf1:armhf (0.187-2+rpi2) ...
Setting up libxml2:armhf (2.9.14+dfsg-1) ...
Setting up libjs-underscore (1.13.4~dfsg+~1.11.4-1) ...
Setting up libgflags2.2 (2.2.2-2) ...
Setting up libbz2-dev:armhf (1.0.8-5+b2) ...
Setting up automake (1:1.16.5-1.3) ...
update-alternatives: using /usr/bin/automake-1.16 to provide /usr/bin/automake (automake) in auto mode
Setting up libfile-stripnondeterminism-perl (1.13.0-1) ...
Setting up gettext (0.21-9) ...
Setting up librocksdb7.3 (7.3.1-2) ...
Setting up libtool (2.4.7-4) ...
Setting up libsnappy-dev:armhf (1.1.9-2) ...
Setting up intltool-debian (0.35.0+20060710.5) ...
Setting up libpython3.10-stdlib:armhf (3.10.6-1) ...
Setting up dh-autoreconf (20) ...
Setting up ca-certificates (20211016) ...
Updating certificates in /etc/ssl/certs...
127 added, 0 removed; done.
Setting up libgflags-dev (2.2.2-2) ...
Setting up libjs-sphinxdoc (4.5.0-4) ...
Setting up dh-strip-nondeterminism (1.13.0-1) ...
Setting up dwz (0.14-1) ...
Setting up groff-base (1.22.4-8) ...
Setting up libpython3.10-dbg:armhf (3.10.6-1) ...
Setting up libpython3-stdlib:armhf (3.10.6-1) ...
Setting up librocksdb-dev (7.3.1-2) ...
Setting up libpython3.10:armhf (3.10.6-1) ...
Setting up python3.10 (3.10.6-1) ...
Setting up po-debconf (1.0.21+nmu1) ...
Setting up libpython3-dbg:armhf (3.10.6-1) ...
Setting up python3 (3.10.6-1) ...
Setting up libpython3-all-dbg:armhf (3.10.6-1) ...
Setting up man-db (2.10.2-3) ...
Not building database; man-db/auto-update is not 'true'.
Setting up python3-markupsafe (2.0.1-2+b1) ...
Setting up python3-tz (2022.2.1-1) ...
Setting up python3-six (1.16.0-4) ...
Setting up python3-roman (3.3-1) ...
Setting up python3-pyparsing (3.0.7-2) ...
Setting up python3-certifi (2022.6.15-2) ...
Setting up python3-snowballstemmer (2.2.0-1) ...
Setting up sphinx-common (4.5.0-4) ...
Setting up python3-idna (3.3-1) ...
Setting up cython3 (0.29.30-1) ...
Setting up libpython3.10-dev:armhf (3.10.6-1) ...
Setting up python3-urllib3 (1.26.9-1) ...
Setting up python3-pluggy (1.0.0+repack-1) ...
Setting up python3.10-dev (3.10.6-1) ...
Setting up python3-lib2to3 (3.10.6-1) ...
Setting up python3.10-dbg (3.10.6-1) ...
Setting up python3-imagesize (1.4.1-1) ...
Setting up python3-dbg (3.10.6-1) ...
Setting up python3-pkg-resources (59.6.0-1.2) ...
Setting up python3-distutils (3.10.6-1) ...
Setting up dh-python (5.20220819+rpi1) ...
Setting up python3-more-itertools (8.10.0-2) ...
Setting up python3-iniconfig (1.1.1-2) ...
Setting up python3-attr (22.1.0-1) ...
Setting up libpython3-dev:armhf (3.10.6-1) ...
Setting up python3-setuptools (59.6.0-1.2) ...
Setting up python3-tomli (2.0.1-1) ...
Setting up python3-py (1.10.0-1) ...
Setting up python3-babel (2.8.0+dfsg.1-7) ...
update-alternatives: using /usr/bin/pybabel-python3 to provide /usr/bin/pybabel (pybabel) in auto mode
Setting up python3-charset-normalizer (2.0.6-2) ...
Setting up python3-alabaster (0.7.12-1) ...
Setting up python3-all (3.10.6-1) ...
Setting up debhelper (13.9.1) ...
Setting up python3-zipp (1.0.0-4) ...
Setting up python3-jinja2 (3.0.3-1) ...
Setting up python3-pygments (2.12.0+dfsg-2) ...
Setting up python3-packaging (21.3-1) ...
Setting up python3-chardet (4.0.0-2) ...
Setting up libpython3-all-dev:armhf (3.10.6-1) ...
Setting up python3-dev (3.10.6-1) ...
Setting up python3-requests (2.27.1+dfsg-1) ...
Setting up python3-all-dbg (3.10.6-1) ...
Setting up python3-all-dev (3.10.6-1) ...
Setting up python3-importlib-metadata (4.12.0-1) ...
Setting up python3-pytest (7.1.2-2) ...
Processing triggers for libc-bin (2.33-8+rpi1) ...
Processing triggers for sgml-base (1.30) ...
Setting up docutils-common (0.17.1+dfsg-2) ...
Processing triggers for sgml-base (1.30) ...
Setting up python3-docutils (0.17.1+dfsg-2) ...
Setting up python3-sphinx (4.5.0-4) ...
Setting up sbuild-build-depends-python-rocksdb-dummy (0.invalid.0) ...
Processing triggers for ca-certificates (20211016) ...
Updating certificates in /etc/ssl/certs...
0 added, 0 removed; done.
Running hooks in /etc/ca-certificates/update.d...
done.
W: No sandbox user '_apt' on the system, can not drop privileges

+------------------------------------------------------------------------------+
| Build environment                                                            |
+------------------------------------------------------------------------------+

Kernel: Linux 4.15.0-187-generic armhf (armv8l)
Toolchain package versions: binutils_2.38.90.20220713-2+rpi1 dpkg-dev_1.21.9+rpi1 g++-12_12.1.0-7+rpi1 gcc-12_12.1.0-7+rpi1 libc6-dev_2.33-8+rpi1 libstdc++-12-dev_12.1.0-7+rpi1 libstdc++6_12.1.0-7+rpi1 linux-libc-dev_5.18.14-1+rpi1
Package versions: adduser_3.123 apt_2.5.2 autoconf_2.71-2 automake_1:1.16.5-1.3 autopoint_0.21-9 autotools-dev_20220109.1 base-files_12.2+rpi1 base-passwd_3.6.0 bash_5.1-6.1 binutils_2.38.90.20220713-2+rpi1 binutils-arm-linux-gnueabihf_2.38.90.20220713-2+rpi1 binutils-common_2.38.90.20220713-2+rpi1 bsdextrautils_2.38.1-1 bsdutils_1:2.38.1-1 build-essential_12.9 bzip2_1.0.8-5+b2 ca-certificates_20211016 coreutils_8.32-4.1 cpp_4:12.1.0-3+rpi1 cpp-12_12.1.0-7+rpi1 cython3_0.29.30-1 dash_0.5.11+git20210903+057cd650a4ed-8 debconf_1.5.79 debhelper_13.9.1 debianutils_5.7-0.3 dh-autoreconf_20 dh-python_5.20220819+rpi1 dh-strip-nondeterminism_1.13.0-1 diffutils_1:3.8-1 dirmngr_2.2.35-3 docutils-common_0.17.1+dfsg-2 dpkg_1.21.9+rpi1 dpkg-dev_1.21.9+rpi1 dwz_0.14-1 e2fsprogs_1.46.5-2 fakeroot_1.29-1 file_1:5.41-4 findutils_4.9.0-3 g++_4:12.1.0-3+rpi1 g++-12_12.1.0-7+rpi1 gcc_4:12.1.0-3+rpi1 gcc-12_12.1.0-7+rpi1 gcc-12-base_12.1.0-7+rpi1 gcc-7-base_7.5.0-6+rpi1+b2 gcc-8-base_8.4.0-7+rpi1 gcc-9-base_9.4.0-2+rpi1 gettext_0.21-9 gettext-base_0.21-9 gnupg_2.2.35-3 gnupg-l10n_2.2.35-3 gnupg-utils_2.2.35-3 gpg_2.2.35-3 gpg-agent_2.2.35-3 gpg-wks-client_2.2.35-3 gpg-wks-server_2.2.35-3 gpgconf_2.2.35-3 gpgsm_2.2.35-3 gpgv_2.2.35-3 grep_3.7-1 groff-base_1.22.4-8 gzip_1.12-1 hostname_3.23 init-system-helpers_1.64 intltool-debian_0.35.0+20060710.5 iputils-ping_3:20211215-1 krb5-locales_1.20-1 libacl1_2.3.1-1 libapt-pkg6.0_2.5.2 libarchive-zip-perl_1.68-1 libasan8_12.1.0-7+rpi1 libassuan0_2.5.5-4 libatomic1_12.1.0-7+rpi1 libattr1_1:2.5.1-1 libaudit-common_1:3.0.7-1 libaudit1_1:3.0.7-1+b1 libbinutils_2.38.90.20220713-2+rpi1 libblkid1_2.38.1-1 libbz2-1.0_1.0.8-5+b2 libbz2-dev_1.0.8-5+b2 libc-bin_2.33-8+rpi1 libc-dev-bin_2.33-8+rpi1 libc6_2.33-8+rpi1 libc6-dev_2.33-8+rpi1 libcap-ng0_0.8.3-1 libcap2_1:2.44-1 libcap2-bin_1:2.44-1 libcc1-0_12.1.0-7+rpi1 libcom-err2_1.46.5-2 libcrypt-dev_1:4.4.28-2 libcrypt1_1:4.4.28-2 libctf-nobfd0_2.38.90.20220713-2+rpi1 libctf0_2.38.90.20220713-2+rpi1 libdb5.3_5.3.28+dfsg1-0.10 libdebconfclient0_0.263 libdebhelper-perl_13.9.1 libdpkg-perl_1.21.9+rpi1 libelf1_0.187-2+rpi2 libexpat1_2.4.8-1 libexpat1-dev_2.4.8-1 libext2fs2_1.46.5-2 libfakeroot_1.29-1 libffi8_3.4.2-4 libfile-stripnondeterminism-perl_1.13.0-1 libgcc-12-dev_12.1.0-7+rpi1 libgcc-s1_12.1.0-7+rpi1 libgcrypt20_1.10.1-2+b2 libgdbm-compat4_1.23-1 libgdbm6_1.23-1 libgflags-dev_2.2.2-2 libgflags2.2_2.2.2-2 libgmp10_2:6.2.1+dfsg1-1 libgnutls30_3.7.7-2 libgomp1_12.1.0-7+rpi1 libgpg-error0_1.45-2 libgssapi-krb5-2_1.20-1 libhogweed6_3.8.1-2 libicu71_71.1-3 libidn2-0_2.3.3-1 libisl23_0.25-1 libjs-jquery_3.6.0+dfsg+~3.5.13-1 libjs-sphinxdoc_4.5.0-4 libjs-underscore_1.13.4~dfsg+~1.11.4-1 libjson-perl_4.09000-1 libk5crypto3_1.20-1 libkeyutils1_1.6.3-1 libkrb5-3_1.20-1 libkrb5support0_1.20-1 libksba8_1.6.0-3 libldap-2.5-0_2.5.12+dfsg-2 liblz4-1_1.9.4-1+rpi1 liblz4-dev_1.9.4-1+rpi1 liblzma5_5.2.5-2.1 libmagic-mgc_1:5.41-4 libmagic1_1:5.41-4 libmount1_2.38.1-1 libmpc3_1.2.1-2 libmpdec3_2.5.1-2+rpi1 libmpfr6_4.1.0-3 libncursesw6_6.3+20220423-2 libnettle8_3.8.1-2 libnpth0_1.6-3 libnsl-dev_1.3.0-2 libnsl2_1.3.0-2 libp11-kit0_0.24.1-1 libpam-cap_1:2.44-1 libpam-modules_1.5.2-2 libpam-modules-bin_1.5.2-2 libpam-runtime_1.5.2-2 libpam0g_1.5.2-2 libpcre2-8-0_10.40-1+b2 libpcre3_2:8.39-14 libperl5.34_5.34.0-5 libpipeline1_1.5.6-2 libpython3-all-dbg_3.10.6-1 libpython3-all-dev_3.10.6-1 libpython3-dbg_3.10.6-1 libpython3-dev_3.10.6-1 libpython3-stdlib_3.10.6-1 libpython3.10_3.10.6-1 libpython3.10-dbg_3.10.6-1 libpython3.10-dev_3.10.6-1 libpython3.10-minimal_3.10.6-1 libpython3.10-stdlib_3.10.6-1 libreadline8_8.1.2-1.2 librocksdb-dev_7.3.1-2 librocksdb7.3_7.3.1-2 libsasl2-2_2.1.28+dfsg-7 libsasl2-modules-db_2.1.28+dfsg-7 libseccomp2_2.5.4-1+rpi1 libselinux1_3.4-1 libsemanage-common_3.4-1 libsemanage2_3.4-1 libsepol1_3.1-1 libsepol2_3.4-2 libsmartcols1_2.38.1-1 libsnappy-dev_1.1.9-2 libsnappy1v5_1.1.9-2 libsqlite3-0_3.39.2-1 libss2_1.46.5-2 libssl1.1_1.1.1o-1 libssl3_3.0.5-2 libstdc++-12-dev_12.1.0-7+rpi1 libstdc++6_12.1.0-7+rpi1 libsub-override-perl_0.09-3 libsystemd0_251.3-1+rpi1 libtasn1-6_4.18.0-4 libtinfo6_6.3+20220423-2 libtirpc-common_1.3.3+ds-1 libtirpc-dev_1.3.3+ds-1 libtirpc3_1.3.3+ds-1 libtool_2.4.7-4 libubsan1_12.1.0-7+rpi1 libuchardet0_0.0.7-1 libudev1_251.3-1+rpi1 libunistring2_1.0-1 libuuid1_2.38.1-1 libxml2_2.9.14+dfsg-1 libxxhash0_0.8.1-1 libzstd-dev_1.5.2+dfsg-1 libzstd1_1.5.2+dfsg-1 linux-libc-dev_5.18.14-1+rpi1 login_1:4.11.1+dfsg1-2 logsave_1.46.5-2 lsb-base_11.2+rpi1 m4_1.4.19-1 make_4.3-4.1 man-db_2.10.2-3 mawk_1.3.4.20200120-3.1 media-types_8.0.0 mount_2.38.1-1 nano_6.4-1 ncurses-base_6.3+20220423-2 ncurses-bin_6.3+20220423-2 netbase_6.3 openssl_3.0.5-2 passwd_1:4.11.1+dfsg1-2 patch_2.7.6-7 perl_5.34.0-5 perl-base_5.34.0-5 perl-modules-5.34_5.34.0-5 pinentry-curses_1.2.0-2 po-debconf_1.0.21+nmu1 python-babel-localedata_2.8.0+dfsg.1-7 python3_3.10.6-1 python3-alabaster_0.7.12-1 python3-all_3.10.6-1 python3-all-dbg_3.10.6-1 python3-all-dev_3.10.6-1 python3-attr_22.1.0-1 python3-babel_2.8.0+dfsg.1-7 python3-certifi_2022.6.15-2 python3-chardet_4.0.0-2 python3-charset-normalizer_2.0.6-2 python3-dbg_3.10.6-1 python3-dev_3.10.6-1 python3-distutils_3.10.6-1 python3-docutils_0.17.1+dfsg-2 python3-idna_3.3-1 python3-imagesize_1.4.1-1 python3-importlib-metadata_4.12.0-1 python3-iniconfig_1.1.1-2 python3-jinja2_3.0.3-1 python3-lib2to3_3.10.6-1 python3-markupsafe_2.0.1-2+b1 python3-minimal_3.10.6-1 python3-more-itertools_8.10.0-2 python3-packaging_21.3-1 python3-pkg-resources_59.6.0-1.2 python3-pluggy_1.0.0+repack-1 python3-py_1.10.0-1 python3-pygments_2.12.0+dfsg-2 python3-pyparsing_3.0.7-2 python3-pytest_7.1.2-2 python3-requests_2.27.1+dfsg-1 python3-roman_3.3-1 python3-setuptools_59.6.0-1.2 python3-six_1.16.0-4 python3-snowballstemmer_2.2.0-1 python3-sphinx_4.5.0-4 python3-tomli_2.0.1-1 python3-tz_2022.2.1-1 python3-urllib3_1.26.9-1 python3-zipp_1.0.0-4 python3.10_3.10.6-1 python3.10-dbg_3.10.6-1 python3.10-dev_3.10.6-1 python3.10-minimal_3.10.6-1 raspbian-archive-keyring_20120528.2 readline-common_8.1.2-1.2 rpcsvc-proto_1.4.2-4 sbuild-build-depends-core-dummy_0.invalid.0 sbuild-build-depends-python-rocksdb-dummy_0.invalid.0 sed_4.8-1 sensible-utils_0.0.17 sgml-base_1.30 sphinx-common_4.5.0-4 sysvinit-utils_3.04-1 tar_1.34+dfsg-1 tzdata_2022c-1 util-linux_2.38.1-1 util-linux-extra_2.38.1-1 xml-core_0.18+nmu1 xz-utils_5.2.5-2.1 zlib1g_1:1.2.11.dfsg-4.1 zlib1g-dev_1:1.2.11.dfsg-4.1

+------------------------------------------------------------------------------+
| Build                                                                        |
+------------------------------------------------------------------------------+


Unpack source
-------------

gpgv: unknown type of key resource 'trustedkeys.kbx'
gpgv: keyblock resource '/tmp/dpkg-verify-sig.4v25ZDAM/trustedkeys.kbx': General error
gpgv: Signature made Sun Nov 21 10:08:36 2021 UTC
gpgv:                using RSA key A2520FEA0A8670A661DD8C553362F7031A4992E1
gpgv: Can't check signature: No public key
dpkg-source: warning: cannot verify signature ./python-rocksdb_0.8.0~rc3-2.dsc
dpkg-source: info: extracting python-rocksdb in /<<PKGBUILDDIR>>
dpkg-source: info: unpacking python-rocksdb_0.8.0~rc3.orig.tar.gz
dpkg-source: info: unpacking python-rocksdb_0.8.0~rc3-2.debian.tar.xz

Check disk space
----------------

Sufficient free space for build

User Environment
----------------

APT_CONFIG=/var/lib/sbuild/apt.conf
DEB_BUILD_OPTIONS=parallel=4
HOME=/sbuild-nonexistent
LC_ALL=POSIX
LOGNAME=buildd
PATH=/usr/local/sbin:/usr/local/bin:/usr/sbin:/usr/bin:/sbin:/bin:/usr/games
SCHROOT_ALIAS_NAME=bookworm-staging-armhf-sbuild
SCHROOT_CHROOT_NAME=bookworm-staging-armhf-sbuild
SCHROOT_COMMAND=env
SCHROOT_GID=112
SCHROOT_GROUP=buildd
SCHROOT_SESSION_ID=bookworm-staging-armhf-sbuild-a8be2f09-2af2-44db-9b0b-23ea29c50bbc
SCHROOT_UID=107
SCHROOT_USER=buildd
SHELL=/bin/sh
USER=buildd

dpkg-buildpackage
-----------------

dpkg-buildpackage: info: source package python-rocksdb
dpkg-buildpackage: info: source version 0.8.0~rc3-2
dpkg-buildpackage: info: source distribution unstable
 dpkg-source --before-build .
dpkg-buildpackage: info: host architecture armhf
 debian/rules clean
dh clean --with python3,sphinxdoc --buildsystem=pybuild
   debian/rules override_dh_auto_clean
make[1]: Entering directory '/<<PKGBUILDDIR>>'
dh_auto_clean --buildsystem=pybuild
I: pybuild base:240: python3.10 setup.py clean 
running clean
removing '/<<PKGBUILDDIR>>/.pybuild/cpython3_3.10/build' (and everything under it)
'build/bdist.linux-armhf' does not exist -- can't clean it
'build/scripts-3.10' does not exist -- can't clean it
I: pybuild base:240: python3.10-dbg setup.py clean 
/usr/lib/python3/dist-packages/setuptools/config.py:510: DeprecationWarning: The license_file parameter is deprecated, use license_files instead.
  warnings.warn(msg, warning_class)
running clean
removing '/<<PKGBUILDDIR>>/.pybuild/cpython3_3.10_dbg/build' (and everything under it)
'build/bdist.linux-armhf' does not exist -- can't clean it
'build/scripts-3.10' does not exist -- can't clean it
rm -rf rocksdb.egg-info/ build/ rocksdb/_rocksdb.cpp \
    rocksdb/_rocksdb.cpython*.so .tox/
make[1]: Leaving directory '/<<PKGBUILDDIR>>'
   dh_autoreconf_clean -O--buildsystem=pybuild
   dh_clean -O--buildsystem=pybuild
 debian/rules binary-arch
dh binary-arch --with python3,sphinxdoc --buildsystem=pybuild
   dh_update_autotools_config -a -O--buildsystem=pybuild
   dh_autoreconf -a -O--buildsystem=pybuild
   dh_auto_configure -a -O--buildsystem=pybuild
I: pybuild base:240: python3.10 setup.py config 
running config
I: pybuild base:240: python3.10-dbg setup.py config 
/usr/lib/python3/dist-packages/setuptools/config.py:510: DeprecationWarning: The license_file parameter is deprecated, use license_files instead.
  warnings.warn(msg, warning_class)
running config
   debian/rules override_dh_auto_build
make[1]: Entering directory '/<<PKGBUILDDIR>>'
dh_auto_build --buildsystem=pybuild
I: pybuild base:240: /usr/bin/python3 setup.py build 
running build
running build_py
creating /<<PKGBUILDDIR>>/.pybuild/cpython3_3.10/build/rocksdb
copying rocksdb/__init__.py -> /<<PKGBUILDDIR>>/.pybuild/cpython3_3.10/build/rocksdb
copying rocksdb/errors.py -> /<<PKGBUILDDIR>>/.pybuild/cpython3_3.10/build/rocksdb
copying rocksdb/interfaces.py -> /<<PKGBUILDDIR>>/.pybuild/cpython3_3.10/build/rocksdb
copying rocksdb/merge_operators.py -> /<<PKGBUILDDIR>>/.pybuild/cpython3_3.10/build/rocksdb
creating /<<PKGBUILDDIR>>/.pybuild/cpython3_3.10/build/rocksdb/tests
copying rocksdb/tests/__init__.py -> /<<PKGBUILDDIR>>/.pybuild/cpython3_3.10/build/rocksdb/tests
copying rocksdb/tests/test_db.py -> /<<PKGBUILDDIR>>/.pybuild/cpython3_3.10/build/rocksdb/tests
copying rocksdb/tests/test_memtable.py -> /<<PKGBUILDDIR>>/.pybuild/cpython3_3.10/build/rocksdb/tests
copying rocksdb/tests/test_options.py -> /<<PKGBUILDDIR>>/.pybuild/cpython3_3.10/build/rocksdb/tests
running egg_info
creating rocksdb.egg-info
writing rocksdb.egg-info/PKG-INFO
writing dependency_links to rocksdb.egg-info/dependency_links.txt
writing requirements to rocksdb.egg-info/requires.txt
writing top-level names to rocksdb.egg-info/top_level.txt
writing manifest file 'rocksdb.egg-info/SOURCES.txt'
reading manifest file 'rocksdb.egg-info/SOURCES.txt'
reading manifest template 'MANIFEST.in'
adding license file 'LICENSE'
writing manifest file 'rocksdb.egg-info/SOURCES.txt'
copying rocksdb/_rocksdb.pyx -> /<<PKGBUILDDIR>>/.pybuild/cpython3_3.10/build/rocksdb
copying rocksdb/backup.pxd -> /<<PKGBUILDDIR>>/.pybuild/cpython3_3.10/build/rocksdb
copying rocksdb/cache.pxd -> /<<PKGBUILDDIR>>/.pybuild/cpython3_3.10/build/rocksdb
copying rocksdb/comparator.pxd -> /<<PKGBUILDDIR>>/.pybuild/cpython3_3.10/build/rocksdb
copying rocksdb/db.pxd -> /<<PKGBUILDDIR>>/.pybuild/cpython3_3.10/build/rocksdb
copying rocksdb/env.pxd -> /<<PKGBUILDDIR>>/.pybuild/cpython3_3.10/build/rocksdb
copying rocksdb/filter_policy.pxd -> /<<PKGBUILDDIR>>/.pybuild/cpython3_3.10/build/rocksdb
copying rocksdb/iterator.pxd -> /<<PKGBUILDDIR>>/.pybuild/cpython3_3.10/build/rocksdb
copying rocksdb/logger.pxd -> /<<PKGBUILDDIR>>/.pybuild/cpython3_3.10/build/rocksdb
copying rocksdb/memtablerep.pxd -> /<<PKGBUILDDIR>>/.pybuild/cpython3_3.10/build/rocksdb
copying rocksdb/merge_operator.pxd -> /<<PKGBUILDDIR>>/.pybuild/cpython3_3.10/build/rocksdb
copying rocksdb/options.pxd -> /<<PKGBUILDDIR>>/.pybuild/cpython3_3.10/build/rocksdb
copying rocksdb/slice_.pxd -> /<<PKGBUILDDIR>>/.pybuild/cpython3_3.10/build/rocksdb
copying rocksdb/slice_transform.pxd -> /<<PKGBUILDDIR>>/.pybuild/cpython3_3.10/build/rocksdb
copying rocksdb/snapshot.pxd -> /<<PKGBUILDDIR>>/.pybuild/cpython3_3.10/build/rocksdb
copying rocksdb/statistics.pxd -> /<<PKGBUILDDIR>>/.pybuild/cpython3_3.10/build/rocksdb
copying rocksdb/status.pxd -> /<<PKGBUILDDIR>>/.pybuild/cpython3_3.10/build/rocksdb
copying rocksdb/std_memory.pxd -> /<<PKGBUILDDIR>>/.pybuild/cpython3_3.10/build/rocksdb
copying rocksdb/table_factory.pxd -> /<<PKGBUILDDIR>>/.pybuild/cpython3_3.10/build/rocksdb
copying rocksdb/universal_compaction.pxd -> /<<PKGBUILDDIR>>/.pybuild/cpython3_3.10/build/rocksdb
creating /<<PKGBUILDDIR>>/.pybuild/cpython3_3.10/build/rocksdb/cpp
copying rocksdb/cpp/comparator_wrapper.hpp -> /<<PKGBUILDDIR>>/.pybuild/cpython3_3.10/build/rocksdb/cpp
copying rocksdb/cpp/filter_policy_wrapper.hpp -> /<<PKGBUILDDIR>>/.pybuild/cpython3_3.10/build/rocksdb/cpp
copying rocksdb/cpp/memtable_factories.hpp -> /<<PKGBUILDDIR>>/.pybuild/cpython3_3.10/build/rocksdb/cpp
copying rocksdb/cpp/merge_operator_wrapper.hpp -> /<<PKGBUILDDIR>>/.pybuild/cpython3_3.10/build/rocksdb/cpp
copying rocksdb/cpp/slice_transform_wrapper.hpp -> /<<PKGBUILDDIR>>/.pybuild/cpython3_3.10/build/rocksdb/cpp
copying rocksdb/cpp/utils.hpp -> /<<PKGBUILDDIR>>/.pybuild/cpython3_3.10/build/rocksdb/cpp
copying rocksdb/cpp/write_batch_iter_helper.hpp -> /<<PKGBUILDDIR>>/.pybuild/cpython3_3.10/build/rocksdb/cpp
running build_ext
cythoning rocksdb/_rocksdb.pyx to rocksdb/_rocksdb.cpp
building 'rocksdb._rocksdb' extension
creating build
creating build/temp.linux-armhf-3.10
creating build/temp.linux-armhf-3.10/rocksdb
arm-linux-gnueabihf-gcc -pthread -Wno-unused-result -Wsign-compare -DNDEBUG -g -fwrapv -O2 -Wall -g -fstack-protector-strong -Wformat -Werror=format-security -g -fwrapv -O2 -g -O2 -ffile-prefix-map=/<<PKGBUILDDIR>>=. -fstack-protector-strong -Wformat -Werror=format-security -Wdate-time -D_FORTIFY_SOURCE=2 -fPIC -I/usr/include/python3.10 -c rocksdb/_rocksdb.cpp -o build/temp.linux-armhf-3.10/rocksdb/_rocksdb.o -std=c++11 -O3 -Wall -Wextra -Wconversion -fno-strict-aliasing -fno-rtti
rocksdb/_rocksdb.cpp:744:10: fatal error: rocksdb/utilities/backupable_db.h: No such file or directory
  744 | #include "rocksdb/utilities/backupable_db.h"
      |          ^~~~~~~~~~~~~~~~~~~~~~~~~~~~~~~~~~~
compilation terminated.
error: command '/usr/bin/arm-linux-gnueabihf-gcc' failed with exit code 1
E: pybuild pybuild:379: build: plugin distutils failed with: exit code=1: /usr/bin/python3 setup.py build 
dh_auto_build: error: pybuild --build -i python{version} -p 3.10 returned exit code 13
make[1]: *** [debian/rules:17: override_dh_auto_build] Error 25
make[1]: Leaving directory '/<<PKGBUILDDIR>>'
make: *** [debian/rules:12: binary-arch] Error 2
dpkg-buildpackage: error: debian/rules binary-arch subprocess returned exit status 2
--------------------------------------------------------------------------------
Build finished at 2022-09-14T01:03:44Z

Finished
--------


+------------------------------------------------------------------------------+
| Cleanup                                                                      |
+------------------------------------------------------------------------------+

Purging /<<BUILDDIR>>
Not cleaning session: cloned chroot in use
E: Build failure (dpkg-buildpackage died)

+------------------------------------------------------------------------------+
| Summary                                                                      |
+------------------------------------------------------------------------------+

Build Architecture: armhf
Build-Space: 3204
Build-Time: 26
Distribution: bookworm-staging
Fail-Stage: build
Host Architecture: armhf
Install-Time: 648
Job: python-rocksdb_0.8.0~rc3-2
Machine Architecture: armhf
Package: python-rocksdb
Package-Time: 693
Source-Version: 0.8.0~rc3-2
Space: 3204
Status: attempted
Version: 0.8.0~rc3-2
--------------------------------------------------------------------------------
Finished at 2022-09-14T01:03:44Z
Build needed 00:11:33, 3204k disk space