Raspbian Package Auto-Building

Build log for open-axiom (1.5.0~svn3056+ds-1) on armhf

open-axiom1.5.0~svn3056+ds-1armhf → 2015-02-27 06:48:23

sbuild (Debian sbuild) 0.63.2 (18 Aug 2012) on testwandboard

║ open-axiom 1.5.0~svn3056+ds-1 (armhf)                      27 Feb 2015 06:40 ║

Package: open-axiom
Version: 1.5.0~svn3056+ds-1
Source Version: 1.5.0~svn3056+ds-1
Distribution: jessie-staging
Machine Architecture: armhf
Host Architecture: armhf
Build Architecture: armhf

I: NOTICE: Log filtering will replace 'build/open-axiom-NkpxP8/open-axiom-1.5.0~svn3056+ds' with '«PKGBUILDDIR»'
I: NOTICE: Log filtering will replace 'build/open-axiom-NkpxP8' with '«BUILDDIR»'
I: NOTICE: Log filtering will replace 'var/lib/schroot/mount/jessie-staging-armhf-sbuild-49ce8d2b-f25c-4fe0-b354-5156315ba757' with '«CHROOT»'

│ Update chroot                                                                │

Get:1 jessie-staging InRelease [11.3 kB]
Get:2 jessie-staging/main Sources [7730 kB]
Get:3 jessie-staging/main armhf Packages [8961 kB]
Ign jessie-staging/main Translation-en
Fetched 16.7 MB in 32s (516 kB/s)
Reading package lists...

│ Fetch source files                                                           │

Check APT

Checking available source versions...

Download source files with APT

Reading package lists...
Building dependency tree...
Reading state information...
NOTICE: 'open-axiom' packaging is maintained in the 'Git' version control system at:
Need to get 8031 kB of source archives.
Get:1 jessie-staging/main open-axiom 1.5.0~svn3056+ds-1 (dsc) [2533 B]
Get:2 jessie-staging/main open-axiom 1.5.0~svn3056+ds-1 (tar) [8013 kB]
Get:3 jessie-staging/main open-axiom 1.5.0~svn3056+ds-1 (diff) [15.5 kB]
Fetched 8031 kB in 4s (1948 kB/s)
Download complete and in download only mode

Check arch

Merged Build-Depends: build-essential, fakeroot
Filtered Build-Depends: build-essential, fakeroot
dpkg-deb: building package `sbuild-build-depends-core-dummy' in `/«BUILDDIR»/resolver-Klaq5_/apt_archive/sbuild-build-depends-core-dummy.deb'.
Reading package lists...

│ Install core build dependencies (apt-based resolver)                         │

Installing build dependencies
Reading package lists...
Building dependency tree...
Reading state information...
The following NEW packages will be installed:
debconf: delaying package configuration, since apt-utils is not installed
0 upgraded, 1 newly installed, 0 to remove and 30 not upgraded.
Need to get 0 B/812 B of archives.
After this operation, 0 B of additional disk space will be used.
Selecting previously unselected package sbuild-build-depends-core-dummy.
(Reading database ... 12632 files and directories currently installed.)
Preparing to unpack .../sbuild-build-depends-core-dummy.deb ...
Unpacking sbuild-build-depends-core-dummy (0.invalid.0) ...
Setting up sbuild-build-depends-core-dummy (0.invalid.0) ...
Merged Build-Depends: libc6-dev | libc-dev, gcc (>= 4:4.9.1), g++ (>= 4:4.9.1), make, dpkg-dev (>= 1.17.11), debhelper (>= 8), sbcl (>= 1:1.0.30), libxpm-dev, libxt-dev, g++ (>= 4.7), help2man, dh-buildinfo, autotools-dev
Filtered Build-Depends: libc6-dev, gcc (>= 4:4.9.1), g++ (>= 4:4.9.1), make, dpkg-dev (>= 1.17.11), debhelper (>= 8), sbcl (>= 1:1.0.30), libxpm-dev, libxt-dev, g++ (>= 4.7), help2man, dh-buildinfo, autotools-dev
dpkg-deb: building package `sbuild-build-depends-open-axiom-dummy' in `/«BUILDDIR»/resolver-Ia01QE/apt_archive/sbuild-build-depends-open-axiom-dummy.deb'.
Reading package lists...

│ Install open-axiom build dependencies (apt-based resolver)                   │

Installing build dependencies
Reading package lists...
Building dependency tree...
Reading state information...
The following extra packages will be installed:
  autotools-dev bsdmainutils debhelper dh-buildinfo file gettext gettext-base
  groff-base help2man intltool-debian libasprintf0c2 libcroco3 libffi6
  libglib2.0-0 libice-dev libice6 liblocale-gettext-perl libmagic1
  libpipeline1 libpthread-stubs0-dev libsm-dev libsm6 libunistring0 libx11-6
  libx11-data libx11-dev libxau-dev libxau6 libxcb1 libxcb1-dev libxdmcp-dev
  libxdmcp6 libxml2 libxpm-dev libxpm4 libxt-dev libxt6 man-db po-debconf sbcl
  x11-common x11proto-core-dev x11proto-input-dev x11proto-kb-dev
  xorg-sgml-doctools xtrans-dev
Suggested packages:
  wamerican wordlist whois vacation dh-make gettext-doc groff libice-doc
  libsm-doc libxcb-doc libxt-doc less www-browser libmail-box-perl sbcl-doc
  sbcl-source slime
Recommended packages:
  curl wget lynx-cur autopoint libasprintf-dev libgettextpo-dev
  libglib2.0-data shared-mime-info xdg-user-dirs libx11-doc xml-core
  libmail-sendmail-perl binfmt-support
The following NEW packages will be installed:
  autotools-dev bsdmainutils debhelper dh-buildinfo file gettext gettext-base
  groff-base help2man intltool-debian libasprintf0c2 libcroco3 libffi6
  libglib2.0-0 libice-dev libice6 liblocale-gettext-perl libmagic1
  libpipeline1 libpthread-stubs0-dev libsm-dev libsm6 libunistring0 libx11-6
  libx11-data libx11-dev libxau-dev libxau6 libxcb1 libxcb1-dev libxdmcp-dev
  libxdmcp6 libxml2 libxpm-dev libxpm4 libxt-dev libxt6 man-db po-debconf sbcl
  sbuild-build-depends-open-axiom-dummy x11-common x11proto-core-dev
  x11proto-input-dev x11proto-kb-dev xorg-sgml-doctools xtrans-dev
0 upgraded, 47 newly installed, 0 to remove and 30 not upgraded.
Need to get 20.7 MB/20.7 MB of archives.
After this operation, 90.9 MB of additional disk space will be used.
Get:1 jessie-staging/main libpipeline1 armhf 1.4.0-1 [24.0 kB]
Get:2 jessie-staging/main groff-base armhf 1.22.2-8 [1045 kB]
Get:3 jessie-staging/main bsdmainutils armhf 9.0.6 [177 kB]
Get:4 jessie-staging/main man-db armhf [972 kB]
Get:5 jessie-staging/main liblocale-gettext-perl armhf 1.05-8+b1 [18.4 kB]
Get:6 jessie-staging/main libasprintf0c2 armhf 0.19.3-2 [31.1 kB]
Get:7 jessie-staging/main libmagic1 armhf 1:5.20-2 [239 kB]
Get:8 jessie-staging/main libxml2 armhf 2.9.1+dfsg1-5 [703 kB]
Get:9 jessie-staging/main libffi6 armhf 3.1-2 [18.1 kB]
Get:10 jessie-staging/main libglib2.0-0 armhf 2.42.1-1 [2250 kB]
Get:11 jessie-staging/main libcroco3 armhf 0.6.8-3 [121 kB]
Get:12 jessie-staging/main x11-common all 1:7.7+7 [287 kB]
Get:13 jessie-staging/main libice6 armhf 2:1.0.9-1 [51.2 kB]
Get:14 jessie-staging/main libsm6 armhf 2:1.2.2-1 [31.2 kB]
Get:15 jessie-staging/main libunistring0 armhf 0.9.3-5.2 [253 kB]
Get:16 jessie-staging/main libxau6 armhf 1:1.0.8-1 [19.9 kB]
Get:17 jessie-staging/main libxdmcp6 armhf 1:1.1.1-1 [24.6 kB]
Get:18 jessie-staging/main libxcb1 armhf 1.10-3 [38.1 kB]
Get:19 jessie-staging/main libx11-data all 2:1.6.2-3 [126 kB]
Get:20 jessie-staging/main libx11-6 armhf 2:1.6.2-3 [656 kB]
Get:21 jessie-staging/main libxpm4 armhf 1:3.5.11-1 [41.7 kB]
Get:22 jessie-staging/main libxt6 armhf 1:1.1.4-1 [183 kB]
Get:23 jessie-staging/main file armhf 1:5.20-2 [58.0 kB]
Get:24 jessie-staging/main gettext-base armhf 0.19.3-2 [116 kB]
Get:25 jessie-staging/main autotools-dev all 20140911.1 [70.5 kB]
Get:26 jessie-staging/main gettext armhf 0.19.3-2 [1167 kB]
Get:27 jessie-staging/main intltool-debian all 0.35.0+20060710.1 [29.8 kB]
Get:28 jessie-staging/main po-debconf all 1.0.16+nmu3 [220 kB]
Get:29 jessie-staging/main debhelper all 9.20141022 [812 kB]
Get:30 jessie-staging/main dh-buildinfo all 0.11 [18.3 kB]
Get:31 jessie-staging/main help2man armhf 1.46.4 [139 kB]
Get:32 jessie-staging/main xorg-sgml-doctools all 1:1.11-1 [21.9 kB]
Get:33 jessie-staging/main x11proto-core-dev all 7.0.26-1 [729 kB]
Get:34 jessie-staging/main libice-dev armhf 2:1.0.9-1 [58.1 kB]
Get:35 jessie-staging/main libpthread-stubs0-dev armhf 0.3-4 [4042 B]
Get:36 jessie-staging/main libsm-dev armhf 2:1.2.2-1 [33.5 kB]
Get:37 jessie-staging/main libxau-dev armhf 1:1.0.8-1 [23.0 kB]
Get:38 jessie-staging/main libxdmcp-dev armhf 1:1.1.1-1 [40.8 kB]
Get:39 jessie-staging/main x11proto-input-dev all 2.3.1-1 [157 kB]
Get:40 jessie-staging/main x11proto-kb-dev all 1.0.6-2 [269 kB]
Get:41 jessie-staging/main xtrans-dev all 1.3.4-1 [99.3 kB]
Get:42 jessie-staging/main libxcb1-dev armhf 1.10-3 [78.1 kB]
Get:43 jessie-staging/main libx11-dev armhf 2:1.6.2-3 [726 kB]
Get:44 jessie-staging/main libxpm-dev armhf 1:3.5.11-1 [96.3 kB]
Get:45 jessie-staging/main libxt-dev armhf 1:1.1.4-1 [447 kB]
Get:46 jessie-staging/main sbcl armhf 2:1.2.4-2 [7946 kB]
debconf: delaying package configuration, since apt-utils is not installed
Fetched 20.7 MB in 14s (1416 kB/s)
Selecting previously unselected package libpipeline1:armhf.
(Reading database ... 12632 files and directories currently installed.)
Preparing to unpack .../libpipeline1_1.4.0-1_armhf.deb ...
Unpacking libpipeline1:armhf (1.4.0-1) ...
Selecting previously unselected package groff-base.
Preparing to unpack .../groff-base_1.22.2-8_armhf.deb ...
Unpacking groff-base (1.22.2-8) ...
Selecting previously unselected package bsdmainutils.
Preparing to unpack .../bsdmainutils_9.0.6_armhf.deb ...
Unpacking bsdmainutils (9.0.6) ...
Selecting previously unselected package man-db.
Preparing to unpack .../man-db_2.7.0.2-5_armhf.deb ...
Unpacking man-db ( ...
Selecting previously unselected package liblocale-gettext-perl.
Preparing to unpack .../liblocale-gettext-perl_1.05-8+b1_armhf.deb ...
Unpacking liblocale-gettext-perl (1.05-8+b1) ...
Selecting previously unselected package libasprintf0c2:armhf.
Preparing to unpack .../libasprintf0c2_0.19.3-2_armhf.deb ...
Unpacking libasprintf0c2:armhf (0.19.3-2) ...
Selecting previously unselected package libmagic1:armhf.
Preparing to unpack .../libmagic1_1%3a5.20-2_armhf.deb ...
Unpacking libmagic1:armhf (1:5.20-2) ...
Selecting previously unselected package libxml2:armhf.
Preparing to unpack .../libxml2_2.9.1+dfsg1-5_armhf.deb ...
Unpacking libxml2:armhf (2.9.1+dfsg1-5) ...
Selecting previously unselected package libffi6:armhf.
Preparing to unpack .../libffi6_3.1-2_armhf.deb ...
Unpacking libffi6:armhf (3.1-2) ...
Selecting previously unselected package libglib2.0-0:armhf.
Preparing to unpack .../libglib2.0-0_2.42.1-1_armhf.deb ...
Unpacking libglib2.0-0:armhf (2.42.1-1) ...
Selecting previously unselected package libcroco3:armhf.
Preparing to unpack .../libcroco3_0.6.8-3_armhf.deb ...
Unpacking libcroco3:armhf (0.6.8-3) ...
Selecting previously unselected package x11-common.
Preparing to unpack .../x11-common_1%3a7.7+7_all.deb ...
Unpacking x11-common (1:7.7+7) ...
Selecting previously unselected package libice6:armhf.
Preparing to unpack .../libice6_2%3a1.0.9-1_armhf.deb ...
Unpacking libice6:armhf (2:1.0.9-1) ...
Selecting previously unselected package libsm6:armhf.
Preparing to unpack .../libsm6_2%3a1.2.2-1_armhf.deb ...
Unpacking libsm6:armhf (2:1.2.2-1) ...
Selecting previously unselected package libunistring0:armhf.
Preparing to unpack .../libunistring0_0.9.3-5.2_armhf.deb ...
Unpacking libunistring0:armhf (0.9.3-5.2) ...
Selecting previously unselected package libxau6:armhf.
Preparing to unpack .../libxau6_1%3a1.0.8-1_armhf.deb ...
Unpacking libxau6:armhf (1:1.0.8-1) ...
Selecting previously unselected package libxdmcp6:armhf.
Preparing to unpack .../libxdmcp6_1%3a1.1.1-1_armhf.deb ...
Unpacking libxdmcp6:armhf (1:1.1.1-1) ...
Selecting previously unselected package libxcb1:armhf.
Preparing to unpack .../libxcb1_1.10-3_armhf.deb ...
Unpacking libxcb1:armhf (1.10-3) ...
Selecting previously unselected package libx11-data.
Preparing to unpack .../libx11-data_2%3a1.6.2-3_all.deb ...
Unpacking libx11-data (2:1.6.2-3) ...
Selecting previously unselected package libx11-6:armhf.
Preparing to unpack .../libx11-6_2%3a1.6.2-3_armhf.deb ...
Unpacking libx11-6:armhf (2:1.6.2-3) ...
Selecting previously unselected package libxpm4:armhf.
Preparing to unpack .../libxpm4_1%3a3.5.11-1_armhf.deb ...
Unpacking libxpm4:armhf (1:3.5.11-1) ...
Selecting previously unselected package libxt6:armhf.
Preparing to unpack .../libxt6_1%3a1.1.4-1_armhf.deb ...
Unpacking libxt6:armhf (1:1.1.4-1) ...
Selecting previously unselected package file.
Preparing to unpack .../file_1%3a5.20-2_armhf.deb ...
Unpacking file (1:5.20-2) ...
Selecting previously unselected package gettext-base.
Preparing to unpack .../gettext-base_0.19.3-2_armhf.deb ...
Unpacking gettext-base (0.19.3-2) ...
Selecting previously unselected package autotools-dev.
Preparing to unpack .../autotools-dev_20140911.1_all.deb ...
Unpacking autotools-dev (20140911.1) ...
Selecting previously unselected package gettext.
Preparing to unpack .../gettext_0.19.3-2_armhf.deb ...
Unpacking gettext (0.19.3-2) ...
Selecting previously unselected package intltool-debian.
Preparing to unpack .../intltool-debian_0.35.0+20060710.1_all.deb ...
Unpacking intltool-debian (0.35.0+20060710.1) ...
Selecting previously unselected package po-debconf.
Preparing to unpack .../po-debconf_1.0.16+nmu3_all.deb ...
Unpacking po-debconf (1.0.16+nmu3) ...
Selecting previously unselected package debhelper.
Preparing to unpack .../debhelper_9.20141022_all.deb ...
Unpacking debhelper (9.20141022) ...
Selecting previously unselected package dh-buildinfo.
Preparing to unpack .../dh-buildinfo_0.11_all.deb ...
Unpacking dh-buildinfo (0.11) ...
Selecting previously unselected package help2man.
Preparing to unpack .../help2man_1.46.4_armhf.deb ...
Unpacking help2man (1.46.4) ...
Selecting previously unselected package xorg-sgml-doctools.
Preparing to unpack .../xorg-sgml-doctools_1%3a1.11-1_all.deb ...
Unpacking xorg-sgml-doctools (1:1.11-1) ...
Selecting previously unselected package x11proto-core-dev.
Preparing to unpack .../x11proto-core-dev_7.0.26-1_all.deb ...
Unpacking x11proto-core-dev (7.0.26-1) ...
Selecting previously unselected package libice-dev:armhf.
Preparing to unpack .../libice-dev_2%3a1.0.9-1_armhf.deb ...
Unpacking libice-dev:armhf (2:1.0.9-1) ...
Selecting previously unselected package libpthread-stubs0-dev:armhf.
Preparing to unpack .../libpthread-stubs0-dev_0.3-4_armhf.deb ...
Unpacking libpthread-stubs0-dev:armhf (0.3-4) ...
Selecting previously unselected package libsm-dev:armhf.
Preparing to unpack .../libsm-dev_2%3a1.2.2-1_armhf.deb ...
Unpacking libsm-dev:armhf (2:1.2.2-1) ...
Selecting previously unselected package libxau-dev:armhf.
Preparing to unpack .../libxau-dev_1%3a1.0.8-1_armhf.deb ...
Unpacking libxau-dev:armhf (1:1.0.8-1) ...
Selecting previously unselected package libxdmcp-dev:armhf.
Preparing to unpack .../libxdmcp-dev_1%3a1.1.1-1_armhf.deb ...
Unpacking libxdmcp-dev:armhf (1:1.1.1-1) ...
Selecting previously unselected package x11proto-input-dev.
Preparing to unpack .../x11proto-input-dev_2.3.1-1_all.deb ...
Unpacking x11proto-input-dev (2.3.1-1) ...
Selecting previously unselected package x11proto-kb-dev.
Preparing to unpack .../x11proto-kb-dev_1.0.6-2_all.deb ...
Unpacking x11proto-kb-dev (1.0.6-2) ...
Selecting previously unselected package xtrans-dev.
Preparing to unpack .../xtrans-dev_1.3.4-1_all.deb ...
Unpacking xtrans-dev (1.3.4-1) ...
Selecting previously unselected package libxcb1-dev:armhf.
Preparing to unpack .../libxcb1-dev_1.10-3_armhf.deb ...
Unpacking libxcb1-dev:armhf (1.10-3) ...
Selecting previously unselected package libx11-dev:armhf.
Preparing to unpack .../libx11-dev_2%3a1.6.2-3_armhf.deb ...
Unpacking libx11-dev:armhf (2:1.6.2-3) ...
Selecting previously unselected package libxpm-dev:armhf.
Preparing to unpack .../libxpm-dev_1%3a3.5.11-1_armhf.deb ...
Unpacking libxpm-dev:armhf (1:3.5.11-1) ...
Selecting previously unselected package libxt-dev:armhf.
Preparing to unpack .../libxt-dev_1%3a1.1.4-1_armhf.deb ...
Unpacking libxt-dev:armhf (1:1.1.4-1) ...
Selecting previously unselected package sbcl.
Preparing to unpack .../sbcl_2%3a1.2.4-2_armhf.deb ...
Unpacking sbcl (2:1.2.4-2) ...
Selecting previously unselected package sbuild-build-depends-open-axiom-dummy.
Preparing to unpack .../sbuild-build-depends-open-axiom-dummy.deb ...
Unpacking sbuild-build-depends-open-axiom-dummy (0.invalid.0) ...
Setting up libpipeline1:armhf (1.4.0-1) ...
Setting up groff-base (1.22.2-8) ...
Setting up bsdmainutils (9.0.6) ...
update-alternatives: using /usr/bin/bsd-write to provide /usr/bin/write (write) in auto mode
update-alternatives: using /usr/bin/bsd-from to provide /usr/bin/from (from) in auto mode
Setting up man-db ( ...
Not building database; man-db/auto-update is not 'true'.
Setting up liblocale-gettext-perl (1.05-8+b1) ...
Setting up libasprintf0c2:armhf (0.19.3-2) ...
Setting up libmagic1:armhf (1:5.20-2) ...
Setting up libxml2:armhf (2.9.1+dfsg1-5) ...
Setting up libffi6:armhf (3.1-2) ...
Setting up libglib2.0-0:armhf (2.42.1-1) ...
No schema files found: doing nothing.
Setting up libcroco3:armhf (0.6.8-3) ...
Setting up x11-common (1:7.7+7) ...
update-rc.d: warning: start and stop actions are no longer supported; falling back to defaults
All runlevel operations denied by policy
invoke-rc.d: policy-rc.d denied execution of start.
Setting up libice6:armhf (2:1.0.9-1) ...
Setting up libsm6:armhf (2:1.2.2-1) ...
Setting up libunistring0:armhf (0.9.3-5.2) ...
Setting up libxau6:armhf (1:1.0.8-1) ...
Setting up libxdmcp6:armhf (1:1.1.1-1) ...
Setting up libxcb1:armhf (1.10-3) ...
Setting up libx11-data (2:1.6.2-3) ...
Setting up libx11-6:armhf (2:1.6.2-3) ...
Setting up libxpm4:armhf (1:3.5.11-1) ...
Setting up libxt6:armhf (1:1.1.4-1) ...
Setting up file (1:5.20-2) ...
Setting up gettext-base (0.19.3-2) ...
Setting up autotools-dev (20140911.1) ...
Setting up gettext (0.19.3-2) ...
Setting up intltool-debian (0.35.0+20060710.1) ...
Setting up po-debconf (1.0.16+nmu3) ...
Setting up debhelper (9.20141022) ...
Setting up dh-buildinfo (0.11) ...
Setting up help2man (1.46.4) ...
Setting up xorg-sgml-doctools (1:1.11-1) ...
Setting up x11proto-core-dev (7.0.26-1) ...
Setting up libice-dev:armhf (2:1.0.9-1) ...
Setting up libpthread-stubs0-dev:armhf (0.3-4) ...
Setting up libsm-dev:armhf (2:1.2.2-1) ...
Setting up libxau-dev:armhf (1:1.0.8-1) ...
Setting up libxdmcp-dev:armhf (1:1.1.1-1) ...
Setting up x11proto-input-dev (2.3.1-1) ...
Setting up x11proto-kb-dev (1.0.6-2) ...
Setting up xtrans-dev (1.3.4-1) ...
Setting up libxcb1-dev:armhf (1.10-3) ...
Setting up libx11-dev:armhf (2:1.6.2-3) ...
Setting up libxpm-dev:armhf (1:3.5.11-1) ...
Setting up libxt-dev:armhf (1:1.1.4-1) ...
Setting up sbcl (2:1.2.4-2) ...
Setting up sbuild-build-depends-open-axiom-dummy (0.invalid.0) ...
Processing triggers for libc-bin (2.19-13) ...

│ Build environment                                                            │

Kernel: Linux 3.17-1-armmp armhf (armv7l)
Toolchain package versions: binutils_2.24.90.20141023-1 dpkg-dev_1.17.21 g++-4.6_4.6.4-5+rpi1 g++-4.9_4.9.1-19 gcc-4.6_4.6.4-5+rpi1 gcc-4.8_4.8.3-13 gcc-4.9_4.9.1-19 libc6-dev_2.19-13 libstdc++-4.9-dev_4.9.1-19 libstdc++6_4.9.1-19 libstdc++6-4.6-dev_4.6.4-5+rpi1 linux-libc-dev_3.16.7-2+rpi1
Package versions: apt_1.0.9.3 autotools-dev_20140911.1 base-files_7.10+rpi1 base-passwd_3.5.37 bash_4.3-11 binutils_2.24.90.20141023-1 bsdmainutils_9.0.6 bsdutils_1:2.25.2-3 build-essential_11.7 bzip2_1.0.6-7 coreutils_8.23-3 cpio_2.11+dfsg-2 cpp_4:4.9.1-5 cpp-4.6_4.6.4-5+rpi1 cpp-4.8_4.8.3-13 cpp-4.9_4.9.1-19 dash_0.5.7-4 debconf_1.5.54 debfoster_2.7-2 debhelper_9.20141022 debianutils_4.4 dh-buildinfo_0.11 dialog_1.2-20140911-1 diffutils_1:3.3-1 dpkg_1.17.21 dpkg-dev_1.17.21 e2fslibs_1.42.12-1 e2fsprogs_1.42.12-1 fakeroot_1.20.2-1 file_1:5.20-2 findutils_4.4.2-9 g++_4:4.9.1-5 g++-4.6_4.6.4-5+rpi1 g++-4.9_4.9.1-19 gcc_4:4.9.1-5 gcc-4.5-base_4.5.3-12+rpi1 gcc-4.6_4.6.4-5+rpi1 gcc-4.6-base_4.6.4-5+rpi1 gcc-4.7-base_4.7.3-11+rpi1 gcc-4.8_4.8.3-13 gcc-4.8-base_4.8.3-13 gcc-4.9_4.9.1-19 gcc-4.9-base_4.9.1-19 gettext_0.19.3-2 gettext-base_0.19.3-2 gnupg_1.4.18-4 gpgv_1.4.18-4 grep_2.20-4 groff-base_1.22.2-8 gzip_1.6-4 help2man_1.46.4 hostname_3.15 init_1.22 initscripts_2.88dsf-58 insserv_1.14.0-5 intltool-debian_0.35.0+20060710.1 klibc-utils_2.0.4-2+rpi1 kmod_18-3 libacl1_2.2.52-2 libapt-pkg4.12_1.0.9.3 libarchive-extract-perl_0.72-1 libasan0_4.8.3-13 libasan1_4.9.1-19 libasprintf0c2_0.19.3-2 libatomic1_4.9.1-19 libattr1_1:2.4.47-2 libaudit-common_1:2.4-1 libaudit1_1:2.4-1 libblkid1_2.25.2-3 libbz2-1.0_1.0.6-7 libc-bin_2.19-13 libc-dev-bin_2.19-13 libc6_2.19-13 libc6-dev_2.19-13 libcap2_1:2.24-6 libcgi-pm-perl_4.09-1 libclass-isa-perl_0.36-5 libcloog-isl4_0.18.2-1 libcomerr2_1.42.12-1 libcroco3_0.6.8-3 libdb5.1_5.1.29-6 libdb5.3_5.3.28-6 libdbus-1-3_1.8.12-1 libdebconfclient0_0.192 libdpkg-perl_1.17.21 libfakeroot_1.20.2-1 libffi6_3.1-2 libgc1c2_1:7.2d-6.4 libgcc-4.8-dev_4.8.3-13 libgcc-4.9-dev_4.9.1-19 libgcc1_1:4.9.1-19 libgcrypt20_1.6.2-4 libgdbm3_1.8.3-13.1 libglib2.0-0_2.42.1-1 libgmp10_2:6.0.0+dfsg-4+rpi1 libgomp1_4.9.1-19 libgpg-error0_1.17-2 libice-dev_2:1.0.9-1 libice6_2:1.0.9-1 libisl10_0.12.2-2 libklibc_2.0.4-2+rpi1 libkmod2_18-3 liblocale-gettext-perl_1.05-8+b1 liblzma5_5.1.1alpha+20120614-2 libmagic1_1:5.20-2 libmodule-pluggable-perl_5.1-1 libmount1_2.25.2-3 libmpc3_1.0.2-1 libmpfr4_3.1.2-1 libncurses5_5.9+20140913-1 libncursesw5_5.9+20140913-1 libpackage-constants-perl_0.04-1 libpam-modules_1.1.8-3.1 libpam-modules-bin_1.1.8-3.1 libpam-runtime_1.1.8-3.1 libpam0g_1.1.8-3.1 libpcre3_1:8.35-3.1 libpipeline1_1.4.0-1 libpng12-0_1.2.50-2 libpod-latex-perl_0.61-1 libprocps0_1:3.3.4-2 libprocps3_2:3.3.9-8 libpthread-stubs0-dev_0.3-4 libreadline6_6.3-8 libselinux1_2.3-2 libsemanage-common_2.3-1 libsemanage1_2.3-1 libsepol1_2.3-2 libslang2_2.3.0-2 libsm-dev_2:1.2.2-1 libsm6_2:1.2.2-1 libsmartcols1_2.25.2-3 libss2_1.42.12-1 libstdc++-4.9-dev_4.9.1-19 libstdc++6_4.9.1-19 libstdc++6-4.6-dev_4.6.4-5+rpi1 libswitch-perl_2.17-2 libsystemd0_215-7 libtimedate-perl_2.3000-2 libtinfo5_5.9+20140913-1 libubsan0_4.9.1-19 libudev0_175-7.2 libunistring0_0.9.3-5.2 libusb-0.1-4_2:0.1.12-25 libustr-1.0-1_1.0.4-3 libuuid1_2.25.2-3 libx11-6_2:1.6.2-3 libx11-data_2:1.6.2-3 libx11-dev_2:1.6.2-3 libxau-dev_1:1.0.8-1 libxau6_1:1.0.8-1 libxcb1_1.10-3 libxcb1-dev_1.10-3 libxdmcp-dev_1:1.1.1-1 libxdmcp6_1:1.1.1-1 libxml2_2.9.1+dfsg1-5 libxpm-dev_1:3.5.11-1 libxpm4_1:3.5.11-1 libxt-dev_1:1.1.4-1 libxt6_1:1.1.4-1 linux-libc-dev_3.16.7-2+rpi1 locales_2.19-13 login_1:4.2-3 lsb-base_4.1+Debian13+rpi1+nmu1 make_4.0-8 makedev_2.3.1-93 man-db_2.7.0.2-5 mawk_1.3.3-17 mount_2.25.2-3 multiarch-support_2.19-13 nano_2.2.6-3 ncurses-base_5.9+20140913-1 ncurses-bin_5.9+20140913-1 passwd_1:4.2-3 patch_2.7.1-6 perl_5.20.1-3 perl-base_5.20.1-3 perl-modules_5.20.1-3 po-debconf_1.0.16+nmu3 procps_2:3.3.9-8 raspbian-archive-keyring_20120528.2 readline-common_6.3-8 sbcl_2:1.2.4-2 sbuild-build-depends-core-dummy_0.invalid.0 sbuild-build-depends-open-axiom-dummy_0.invalid.0 sed_4.2.2-4 sensible-utils_0.0.9 startpar_0.59-3 sysv-rc_2.88dsf-58 sysvinit_2.88dsf-58 sysvinit-core_2.88dsf-58 sysvinit-utils_2.88dsf-58 tar_1.27.1-2 tzdata_2014i-1 util-linux_2.25.2-3 x11-common_1:7.7+7 x11proto-core-dev_7.0.26-1 x11proto-input-dev_2.3.1-1 x11proto-kb-dev_1.0.6-2 xorg-sgml-doctools_1:1.11-1 xtrans-dev_1.3.4-1 xz-utils_5.1.1alpha+20120614-2 zlib1g_1:1.2.8.dfsg-2

│ Build                                                                        │

Unpack source

gpgv: keyblock resource `/sbuild-nonexistent/.gnupg/trustedkeys.gpg': file open error
gpgv: Signature made Sun Dec 15 16:52:48 2013 UTC using RSA key ID 28F39278
gpgv: Can't check signature: public key not found
dpkg-source: warning: failed to verify signature on ./open-axiom_1.5.0~svn3056+ds-1.dsc
dpkg-source: info: extracting open-axiom in open-axiom-1.5.0~svn3056+ds
dpkg-source: info: unpacking open-axiom_1.5.0~svn3056+ds.orig.tar.xz
dpkg-source: info: unpacking open-axiom_1.5.0~svn3056+ds-1.debian.tar.gz
dpkg-source: info: applying no-missing-messages.patch
dpkg-source: info: applying non-static-open-axiom-binary.patch

Check disc space

Sufficient free space for build

User Environment



dpkg-buildpackage: source package open-axiom
dpkg-buildpackage: source version 1.5.0~svn3056+ds-1
dpkg-buildpackage: source distribution unstable
 dpkg-source --before-build open-axiom-1.5.0~svn3056+ds
dpkg-buildpackage: host architecture armhf
 fakeroot debian/rules clean
rm -rf /«BUILDDIR»/open-axiom-1.5.0~svn3056+ds/build-tree
	for c_g in `find . -type f -name config.guess` ; do if test -e "$c_g.dh-orig" ; then mv -f "$c_g.dh-orig" "$c_g" ; fi ; done
	for c_s in `find . -type f -name config.sub`   ; do if test -e "$c_s.dh-orig" ; then mv -f "$c_s.dh-orig" "$c_s" ; fi ; done
	find . -type f \( -name config.guess.dh-orig -o -name config.sub.dh-orig \) -delete
	rm -f debian/open-axiom.substvars
	rm -f debian/open-axiom.*.debhelper
	rm -rf debian/open-axiom/
	rm -f debian/open-axiom-source.substvars
	rm -f debian/open-axiom-source.*.debhelper
	rm -rf debian/open-axiom-source/
	rm -f debian/open-axiom-test.substvars
	rm -f debian/open-axiom-test.*.debhelper
	rm -rf debian/open-axiom-test/
	rm -f debian/open-axiom-databases.substvars
	rm -f debian/open-axiom-databases.*.debhelper
	rm -rf debian/open-axiom-databases/
	rm -f debian/open-axiom-tex.substvars
	rm -f debian/open-axiom-tex.*.debhelper
	rm -rf debian/open-axiom-tex/
	rm -f debian/open-axiom-graphics.substvars
	rm -f debian/open-axiom-graphics.*.debhelper
	rm -rf debian/open-axiom-graphics/
	rm -f debian/open-axiom-graphics-data.substvars
	rm -f debian/open-axiom-graphics-data.*.debhelper
	rm -rf debian/open-axiom-graphics-data/
	rm -f debian/open-axiom-hypertex.substvars
	rm -f debian/open-axiom-hypertex.*.debhelper
	rm -rf debian/open-axiom-hypertex/
	rm -f debian/open-axiom-hypertex-data.substvars
	rm -f debian/open-axiom-hypertex-data.*.debhelper
	rm -rf debian/open-axiom-hypertex-data/
	rm -f debian/*.debhelper.log
	rm -f -- debian/open-axiom.1
	rm -f debian/files
	find .  \( \( \
		\( -path .\*/.git -o -path .\*/.svn -o -path .\*/.bzr -o -path .\*/.hg -o -path .\*/CVS \) -prune -o -type f -a \
	        \( -name '#*#' -o -name '.*~' -o -name '*~' -o -name DEADJOE \
		 -o -name '*.orig' -o -name '*.rej' -o -name '*.bak' \
		 -o -name '.*.orig' -o -name .*.rej -o -name '.SUMS' \
		 -o -name TAGS -o \( -path '*/.deps/*' -a -name '*.P' \) \
		\) -exec rm -f {} + \) -o \
		\( -type d -a -name autom4te.cache -prune -exec rm -rf {} + \) \)
	rm -f *-stamp
 debian/rules build-arch
	for c_g in `find -type f -name config.guess` ; do if ! test -e "$c_g.dh-orig" ; then mv -f "$c_g" "$c_g.dh-orig" ; cp -f /usr/share/misc/config.guess "$c_g" ; fi ; done
	for c_s in `find -type f -name config.sub`   ; do if ! test -e "$c_s.dh-orig" ; then mv -f "$c_s" "$c_s.dh-orig" ; cp -f /usr/share/misc/config.sub   "$c_s" ; fi ; done
# aclocal.m4 is older than configure; rebuilding aclocal.m4 requires aclocal-1.13
touch aclocal.m4 config/*.m4 -r configure.ac
sbcl --version </dev/null || true
SBCL 1.2.4.debian
dh_auto_configure -B /«BUILDDIR»/open-axiom-1.5.0~svn3056+ds/build-tree -- \
	--with-lisp=sbcl \
	--with-x \
	mkdir -p build-tree
	cd build-tree
	../configure --build=arm-linux-gnueabihf --prefix=/usr --includedir=\${prefix}/include --mandir=\${prefix}/share/man --infodir=\${prefix}/share/info --sysconfdir=/etc --localstatedir=/var --disable-silent-rules --libexecdir=\${prefix}/lib/open-axiom --disable-maintainer-mode --disable-dependency-tracking --with-lisp=sbcl --with-x --disable-gcl
configure: WARNING: unrecognized options: --disable-maintainer-mode
checking build system type... arm-unknown-linux-gnueabihf
checking host system type... arm-unknown-linux-gnueabihf
checking target system type... arm-unknown-linux-gnueabihf
checking for a BSD-compatible install... /usr/bin/install -c
checking whether build environment is sane... yes
/«BUILDDIR»/open-axiom-1.5.0~svn3056+ds/config/missing: Unknown `--is-lightweight' option
Try `/«BUILDDIR»/open-axiom-1.5.0~svn3056+ds/config/missing --help' for more information
configure: WARNING: 'missing' script is too old or missing
checking for a thread-safe mkdir -p... /bin/mkdir -p
checking for gawk... no
checking for mawk... mawk
checking whether make sets $(MAKE)... yes
checking whether make supports nested variables... yes
checking for style of include used by make... GNU
checking which flavor of Lisp... sbcl
checking sbcl version... SBCL 1.2.4.debian
checking CPU precision as seen by sbcl... 32
checking for gcc... gcc
checking whether the C compiler works... yes
checking for C compiler default output file name... a.out
checking for suffix of executables... 
checking whether we are cross compiling... no
checking for suffix of object files... o
checking whether we are using the GNU C compiler... yes
checking whether gcc accepts -g... yes
checking for gcc option to accept ISO C89... none needed
checking dependency style of gcc... none
checking for g++... g++
checking whether we are using the GNU C++ compiler... yes
checking whether g++ accepts -g... yes
checking dependency style of g++... none
checking how to run the C preprocessor... /lib/cpp
configure: error: in `/«BUILDDIR»/open-axiom-1.5.0~svn3056+ds/build-tree':
configure: error: C preprocessor "/lib/cpp" fails sanity check
See `config.log' for more details
dh_auto_configure: ../configure --build=arm-linux-gnueabihf --prefix=/usr --includedir=${prefix}/include --mandir=${prefix}/share/man --infodir=${prefix}/share/info --sysconfdir=/etc --localstatedir=/var --disable-silent-rules --libexecdir=${prefix}/lib/open-axiom --disable-maintainer-mode --disable-dependency-tracking --with-lisp=sbcl --with-x --disable-gcl returned exit code 1
make: *** [configure-stamp] Error 2
debian/rules:45: recipe for target 'configure-stamp' failed
dpkg-buildpackage: error: debian/rules build-arch gave error exit status 2
Build finished at 20150227-0645


E: Build failure (dpkg-buildpackage died)

│ Cleanup                                                                      │

Purging /«BUILDDIR»
Not cleaning session: cloned chroot in use

│ Summary                                                                      │

Build Architecture: armhf
Build-Space: 61152
Build-Time: 56
Distribution: jessie-staging
Fail-Stage: build
Host Architecture: armhf
Install-Time: 204
Job: open-axiom_1.5.0~svn3056+ds-1
Machine Architecture: armhf
Package: open-axiom
Package-Time: 325
Source-Version: 1.5.0~svn3056+ds-1
Space: 61152
Status: attempted
Version: 1.5.0~svn3056+ds-1
Finished at 20150227-0645
Build needed 00:05:25, 61152k disc space