Raspbian Package Auto-Building

Build log for mojoshader (0.0~hg1314+dfsg-1.1) on armhf

mojoshader0.0~hg1314+dfsg-1.1armhf → 2021-12-03 01:28:28

sbuild (Debian sbuild) 0.72.0 (25 Oct 2016) on mb-lxc-02

+==============================================================================+
| mojoshader 0.0~hg1314+dfsg-1.1 (armhf)       Fri, 03 Dec 2021 01:15:17 +0000 |
+==============================================================================+

Package: mojoshader
Version: 0.0~hg1314+dfsg-1.1
Source Version: 0.0~hg1314+dfsg-1.1
Distribution: bookworm-staging
Machine Architecture: armhf
Host Architecture: armhf
Build Architecture: armhf

I: NOTICE: Log filtering will replace 'var/lib/schroot/mount/bookworm-staging-armhf-sbuild-031ac9a9-a6b9-4d54-8c27-3539951765a1' with '<<CHROOT>>'

+------------------------------------------------------------------------------+
| Update chroot                                                                |
+------------------------------------------------------------------------------+

Get:1 http://172.17.4.1/private bookworm-staging InRelease [11.3 kB]
Get:2 http://172.17.4.1/private bookworm-staging/main Sources [12.5 MB]
Get:3 http://172.17.4.1/private bookworm-staging/main armhf Packages [13.5 MB]
Fetched 26.1 MB in 12s (2258 kB/s)
Reading package lists...
W: No sandbox user '_apt' on the system, can not drop privileges

+------------------------------------------------------------------------------+
| Fetch source files                                                           |
+------------------------------------------------------------------------------+


Check APT
---------

Checking available source versions...

Download source files with APT
------------------------------

Reading package lists...
NOTICE: 'mojoshader' packaging is maintained in the 'Git' version control system at:
https://salsa.debian.org/yangfl-guest/mojoshader.git
Please use:
git clone https://salsa.debian.org/yangfl-guest/mojoshader.git
to retrieve the latest (possibly unreleased) updates to the package.
Need to get 334 kB of source archives.
Get:1 http://172.17.4.1/private bookworm-staging/main mojoshader 0.0~hg1314+dfsg-1.1 (dsc) [2124 B]
Get:2 http://172.17.4.1/private bookworm-staging/main mojoshader 0.0~hg1314+dfsg-1.1 (tar) [326 kB]
Get:3 http://172.17.4.1/private bookworm-staging/main mojoshader 0.0~hg1314+dfsg-1.1 (diff) [5472 B]
Fetched 334 kB in 0s (1835 kB/s)
Download complete and in download only mode
I: NOTICE: Log filtering will replace 'build/mojoshader-Ifce0V/mojoshader-0.0~hg1314+dfsg' with '<<PKGBUILDDIR>>'
I: NOTICE: Log filtering will replace 'build/mojoshader-Ifce0V' with '<<BUILDDIR>>'

+------------------------------------------------------------------------------+
| Install build-essential                                                      |
+------------------------------------------------------------------------------+


Setup apt archive
-----------------

Merged Build-Depends: build-essential, fakeroot
Filtered Build-Depends: build-essential, fakeroot
dpkg-deb: building package 'sbuild-build-depends-core-dummy' in '/<<BUILDDIR>>/resolver-tXtNeE/apt_archive/sbuild-build-depends-core-dummy.deb'.
dpkg-scanpackages: warning: Packages in archive but missing from override file:
dpkg-scanpackages: warning:   sbuild-build-depends-core-dummy
dpkg-scanpackages: info: Wrote 1 entries to output Packages file.
gpg: keybox '/<<BUILDDIR>>/resolver-tXtNeE/gpg/pubring.kbx' created
gpg: /<<BUILDDIR>>/resolver-tXtNeE/gpg/trustdb.gpg: trustdb created
gpg: key 37145E60F90AF620: public key "Sbuild Signer (Sbuild Build Dependency Archive Key) <buildd-tools-devel@lists.alioth.debian.org>" imported
gpg: Total number processed: 1
gpg:               imported: 1
gpg: key 37145E60F90AF620: "Sbuild Signer (Sbuild Build Dependency Archive Key) <buildd-tools-devel@lists.alioth.debian.org>" not changed
gpg: key 37145E60F90AF620: secret key imported
gpg: Total number processed: 1
gpg:              unchanged: 1
gpg:       secret keys read: 1
gpg:   secret keys imported: 1
gpg: using "Sbuild Signer" as default secret key for signing
Ign:1 copy:/<<BUILDDIR>>/resolver-tXtNeE/apt_archive ./ InRelease
Get:2 copy:/<<BUILDDIR>>/resolver-tXtNeE/apt_archive ./ Release [957 B]
Get:3 copy:/<<BUILDDIR>>/resolver-tXtNeE/apt_archive ./ Release.gpg [370 B]
Get:4 copy:/<<BUILDDIR>>/resolver-tXtNeE/apt_archive ./ Sources [349 B]
Get:5 copy:/<<BUILDDIR>>/resolver-tXtNeE/apt_archive ./ Packages [432 B]
Fetched 2108 B in 0s (10.1 kB/s)
Reading package lists...
W: No sandbox user '_apt' on the system, can not drop privileges
Reading package lists...

Install core build dependencies (apt-based resolver)
----------------------------------------------------

Installing build dependencies
Reading package lists...
Building dependency tree...
Reading state information...
The following packages were automatically installed and are no longer required:
  netbase sensible-utils
Use 'apt autoremove' to remove them.
The following NEW packages will be installed:
  sbuild-build-depends-core-dummy
0 upgraded, 1 newly installed, 0 to remove and 9 not upgraded.
Need to get 852 B of archives.
After this operation, 0 B of additional disk space will be used.
Get:1 copy:/<<BUILDDIR>>/resolver-tXtNeE/apt_archive ./ sbuild-build-depends-core-dummy 0.invalid.0 [852 B]
debconf: delaying package configuration, since apt-utils is not installed
Fetched 852 B in 0s (66.8 kB/s)
Selecting previously unselected package sbuild-build-depends-core-dummy.
(Reading database ... 12559 files and directories currently installed.)
Preparing to unpack .../sbuild-build-depends-core-dummy_0.invalid.0_armhf.deb ...
Unpacking sbuild-build-depends-core-dummy (0.invalid.0) ...
Setting up sbuild-build-depends-core-dummy (0.invalid.0) ...
W: No sandbox user '_apt' on the system, can not drop privileges

+------------------------------------------------------------------------------+
| Check architectures                                                          |
+------------------------------------------------------------------------------+

Arch check ok (armhf included in any)

+------------------------------------------------------------------------------+
| Install package build dependencies                                           |
+------------------------------------------------------------------------------+


Setup apt archive
-----------------

Merged Build-Depends: debhelper-compat (= 13), cmake, libgl-dev, libvulkan-dev, re2c, spirv-tools, libcryptx-perl
Filtered Build-Depends: debhelper-compat (= 13), cmake, libgl-dev, libvulkan-dev, re2c, spirv-tools, libcryptx-perl
dpkg-deb: building package 'sbuild-build-depends-mojoshader-dummy' in '/<<BUILDDIR>>/resolver-tXtNeE/apt_archive/sbuild-build-depends-mojoshader-dummy.deb'.
dpkg-scanpackages: warning: Packages in archive but missing from override file:
dpkg-scanpackages: warning:   sbuild-build-depends-core-dummy sbuild-build-depends-mojoshader-dummy
dpkg-scanpackages: info: Wrote 2 entries to output Packages file.
gpg: using "Sbuild Signer" as default secret key for signing
Ign:1 copy:/<<BUILDDIR>>/resolver-tXtNeE/apt_archive ./ InRelease
Get:2 copy:/<<BUILDDIR>>/resolver-tXtNeE/apt_archive ./ Release [963 B]
Get:3 copy:/<<BUILDDIR>>/resolver-tXtNeE/apt_archive ./ Release.gpg [370 B]
Get:4 copy:/<<BUILDDIR>>/resolver-tXtNeE/apt_archive ./ Sources [535 B]
Get:5 copy:/<<BUILDDIR>>/resolver-tXtNeE/apt_archive ./ Packages [615 B]
Fetched 2483 B in 0s (11.8 kB/s)
Reading package lists...
W: No sandbox user '_apt' on the system, can not drop privileges
Reading package lists...

Install mojoshader build dependencies (apt-based resolver)
----------------------------------------------------------

Installing build dependencies
Reading package lists...
Building dependency tree...
Reading state information...
The following package was automatically installed and is no longer required:
  netbase
Use 'apt autoremove' to remove it.
The following additional packages will be installed:
  autoconf automake autopoint autotools-dev bsdextrautils cmake cmake-data
  debhelper dh-autoreconf dh-elpa-helper dh-strip-nondeterminism dwz
  emacsen-common file gettext gettext-base groff-base intltool-debian
  libarchive-zip-perl libarchive13 libbrotli1 libbsd0 libcryptx-perl libcurl4
  libdebhelper-perl libdrm-amdgpu1 libdrm-common libdrm-nouveau2
  libdrm-radeon1 libdrm2 libedit2 libelf1 libexpat1
  libfile-stripnondeterminism-perl libgl-dev libgl1 libgl1-mesa-dri
  libglapi-mesa libglvnd0 libglx-dev libglx-mesa0 libglx0 libicu67
  libjsoncpp24 libllvm12 libmagic-mgc libmagic1 libmd0 libncurses6
  libnghttp2-14 libpipeline1 libprocps8 libpsl5 libpthread-stubs0-dev
  librhash0 librtmp1 libsensors-config libsensors5 libsigsegv2 libssh2-1
  libsub-override-perl libtool libuchardet0 libuv1 libvulkan-dev libvulkan1
  libx11-6 libx11-data libx11-dev libx11-xcb1 libxau-dev libxau6 libxcb-dri2-0
  libxcb-dri3-0 libxcb-glx0 libxcb-present0 libxcb-shm0 libxcb-sync1
  libxcb-xfixes0 libxcb1 libxcb1-dev libxdmcp-dev libxdmcp6 libxext6
  libxfixes3 libxml2 libxshmfence1 libxxf86vm1 libz3-4 m4 man-db po-debconf
  procps re2c spirv-tools x11proto-dev xorg-sgml-doctools xtrans-dev
Suggested packages:
  autoconf-archive gnu-standards autoconf-doc cmake-doc ninja-build dh-make
  gettext-doc libasprintf-dev libgettextpo-dev groff lrzip lm-sensors
  libtool-doc gfortran | fortran95-compiler gcj-jdk libx11-doc libxcb-doc
  m4-doc apparmor less www-browser libmail-box-perl
Recommended packages:
  curl | wget | lynx libjson-perl ca-certificates libarchive-cpio-perl libgpm2
  publicsuffix libltdl-dev mesa-vulkan-drivers | vulkan-icd
  libmail-sendmail-perl psmisc
The following NEW packages will be installed:
  autoconf automake autopoint autotools-dev bsdextrautils cmake cmake-data
  debhelper dh-autoreconf dh-elpa-helper dh-strip-nondeterminism dwz
  emacsen-common file gettext gettext-base groff-base intltool-debian
  libarchive-zip-perl libarchive13 libbrotli1 libbsd0 libcryptx-perl libcurl4
  libdebhelper-perl libdrm-amdgpu1 libdrm-common libdrm-nouveau2
  libdrm-radeon1 libdrm2 libedit2 libelf1 libexpat1
  libfile-stripnondeterminism-perl libgl-dev libgl1 libgl1-mesa-dri
  libglapi-mesa libglvnd0 libglx-dev libglx-mesa0 libglx0 libicu67
  libjsoncpp24 libllvm12 libmagic-mgc libmagic1 libmd0 libncurses6
  libnghttp2-14 libpipeline1 libprocps8 libpsl5 libpthread-stubs0-dev
  librhash0 librtmp1 libsensors-config libsensors5 libsigsegv2 libssh2-1
  libsub-override-perl libtool libuchardet0 libuv1 libvulkan-dev libvulkan1
  libx11-6 libx11-data libx11-dev libx11-xcb1 libxau-dev libxau6 libxcb-dri2-0
  libxcb-dri3-0 libxcb-glx0 libxcb-present0 libxcb-shm0 libxcb-sync1
  libxcb-xfixes0 libxcb1 libxcb1-dev libxdmcp-dev libxdmcp6 libxext6
  libxfixes3 libxml2 libxshmfence1 libxxf86vm1 libz3-4 m4 man-db po-debconf
  procps re2c sbuild-build-depends-mojoshader-dummy spirv-tools x11proto-dev
  xorg-sgml-doctools xtrans-dev
0 upgraded, 99 newly installed, 0 to remove and 9 not upgraded.
Need to get 63.8 MB of archives.
After this operation, 284 MB of additional disk space will be used.
Get:1 copy:/<<BUILDDIR>>/resolver-tXtNeE/apt_archive ./ sbuild-build-depends-mojoshader-dummy 0.invalid.0 [904 B]
Get:2 http://172.17.4.1/private bookworm-staging/main armhf bsdextrautils armhf 2.37.2-4 [135 kB]
Get:3 http://172.17.4.1/private bookworm-staging/main armhf libuchardet0 armhf 0.0.7-1 [65.0 kB]
Get:4 http://172.17.4.1/private bookworm-staging/main armhf groff-base armhf 1.22.4-7 [793 kB]
Get:5 http://172.17.4.1/private bookworm-staging/main armhf libpipeline1 armhf 1.5.4-1 [31.6 kB]
Get:6 http://172.17.4.1/private bookworm-staging/main armhf man-db armhf 2.9.4-2 [1307 kB]
Get:7 http://172.17.4.1/private bookworm-staging/main armhf libncurses6 armhf 6.3-1 [79.8 kB]
Get:8 http://172.17.4.1/private bookworm-staging/main armhf libprocps8 armhf 2:3.3.17-5 [60.5 kB]
Get:9 http://172.17.4.1/private bookworm-staging/main armhf procps armhf 2:3.3.17-5 [475 kB]
Get:10 http://172.17.4.1/private bookworm-staging/main armhf libmagic-mgc armhf 1:5.41-2 [295 kB]
Get:11 http://172.17.4.1/private bookworm-staging/main armhf libmagic1 armhf 1:5.41-2 [119 kB]
Get:12 http://172.17.4.1/private bookworm-staging/main armhf file armhf 1:5.41-2 [65.8 kB]
Get:13 http://172.17.4.1/private bookworm-staging/main armhf gettext-base armhf 0.21-4 [171 kB]
Get:14 http://172.17.4.1/private bookworm-staging/main armhf libsigsegv2 armhf 2.13-1 [34.3 kB]
Get:15 http://172.17.4.1/private bookworm-staging/main armhf m4 armhf 1.4.18-5 [186 kB]
Get:16 http://172.17.4.1/private bookworm-staging/main armhf autoconf all 2.71-2 [343 kB]
Get:17 http://172.17.4.1/private bookworm-staging/main armhf autotools-dev all 20180224.1+nmu1 [77.1 kB]
Get:18 http://172.17.4.1/private bookworm-staging/main armhf automake all 1:1.16.5-1.1 [823 kB]
Get:19 http://172.17.4.1/private bookworm-staging/main armhf autopoint all 0.21-4 [510 kB]
Get:20 http://172.17.4.1/private bookworm-staging/main armhf libicu67 armhf 67.1-7 [8291 kB]
Get:21 http://172.17.4.1/private bookworm-staging/main armhf libxml2 armhf 2.9.12+dfsg-5 [584 kB]
Get:22 http://172.17.4.1/private bookworm-staging/main armhf libarchive13 armhf 3.4.3-2 [294 kB]
Get:23 http://172.17.4.1/private bookworm-staging/main armhf libbrotli1 armhf 1.0.9-2+b1 [261 kB]
Get:24 http://172.17.4.1/private bookworm-staging/main armhf libnghttp2-14 armhf 1.43.0-1 [65.3 kB]
Get:25 http://172.17.4.1/private bookworm-staging/main armhf libpsl5 armhf 0.21.0-1.2 [56.2 kB]
Get:26 http://172.17.4.1/private bookworm-staging/main armhf librtmp1 armhf 2.4+20151223.gitfa8646d.1-2+b2 [54.2 kB]
Get:27 http://172.17.4.1/private bookworm-staging/main armhf libssh2-1 armhf 1.10.0-2 [161 kB]
Get:28 http://172.17.4.1/private bookworm-staging/main armhf libcurl4 armhf 7.79.1-2 [320 kB]
Get:29 http://172.17.4.1/private bookworm-staging/main armhf libexpat1 armhf 2.4.1-3 [80.1 kB]
Get:30 http://172.17.4.1/private bookworm-staging/main armhf libjsoncpp24 armhf 1.9.4-5 [67.4 kB]
Get:31 http://172.17.4.1/private bookworm-staging/main armhf librhash0 armhf 1.4.2-1 [141 kB]
Get:32 http://172.17.4.1/private bookworm-staging/main armhf libuv1 armhf 1.42.0-1 [121 kB]
Get:33 http://172.17.4.1/private bookworm-staging/main armhf dh-elpa-helper all 2.0.9 [11.2 kB]
Get:34 http://172.17.4.1/private bookworm-staging/main armhf emacsen-common all 3.0.4 [19.3 kB]
Get:35 http://172.17.4.1/private bookworm-staging/main armhf cmake-data all 3.22.0-1 [1902 kB]
Get:36 http://172.17.4.1/private bookworm-staging/main armhf cmake armhf 3.22.0-1 [3499 kB]
Get:37 http://172.17.4.1/private bookworm-staging/main armhf libdebhelper-perl all 13.5.2 [192 kB]
Get:38 http://172.17.4.1/private bookworm-staging/main armhf libtool all 2.4.6-15 [513 kB]
Get:39 http://172.17.4.1/private bookworm-staging/main armhf dh-autoreconf all 20 [17.1 kB]
Get:40 http://172.17.4.1/private bookworm-staging/main armhf libarchive-zip-perl all 1.68-1 [104 kB]
Get:41 http://172.17.4.1/private bookworm-staging/main armhf libsub-override-perl all 0.09-2 [10.2 kB]
Get:42 http://172.17.4.1/private bookworm-staging/main armhf libfile-stripnondeterminism-perl all 1.12.1-1 [26.5 kB]
Get:43 http://172.17.4.1/private bookworm-staging/main armhf dh-strip-nondeterminism all 1.12.1-1 [15.6 kB]
Get:44 http://172.17.4.1/private bookworm-staging/main armhf libelf1 armhf 0.186-1 [174 kB]
Get:45 http://172.17.4.1/private bookworm-staging/main armhf dwz armhf 0.14-1 [83.0 kB]
Get:46 http://172.17.4.1/private bookworm-staging/main armhf gettext armhf 0.21-4 [1215 kB]
Get:47 http://172.17.4.1/private bookworm-staging/main armhf intltool-debian all 0.35.0+20060710.5 [26.8 kB]
Get:48 http://172.17.4.1/private bookworm-staging/main armhf po-debconf all 1.0.21+nmu1 [248 kB]
Get:49 http://172.17.4.1/private bookworm-staging/main armhf debhelper all 13.5.2 [1056 kB]
Get:50 http://172.17.4.1/private bookworm-staging/main armhf libmd0 armhf 1.0.4-1 [28.9 kB]
Get:51 http://172.17.4.1/private bookworm-staging/main armhf libbsd0 armhf 0.11.3-1 [103 kB]
Get:52 http://172.17.4.1/private bookworm-staging/main armhf libcryptx-perl armhf 0.074-1 [597 kB]
Get:53 http://172.17.4.1/private bookworm-staging/main armhf libdrm-common all 2.4.108-1+rpi1 [15.4 kB]
Get:54 http://172.17.4.1/private bookworm-staging/main armhf libdrm2 armhf 2.4.108-1+rpi1 [40.5 kB]
Get:55 http://172.17.4.1/private bookworm-staging/main armhf libdrm-amdgpu1 armhf 2.4.108-1+rpi1 [27.9 kB]
Get:56 http://172.17.4.1/private bookworm-staging/main armhf libdrm-nouveau2 armhf 2.4.108-1+rpi1 [25.5 kB]
Get:57 http://172.17.4.1/private bookworm-staging/main armhf libdrm-radeon1 armhf 2.4.108-1+rpi1 [29.6 kB]
Get:58 http://172.17.4.1/private bookworm-staging/main armhf libedit2 armhf 3.1-20210910-1 [81.2 kB]
Get:59 http://172.17.4.1/private bookworm-staging/main armhf libglvnd0 armhf 1.3.4-2 [54.8 kB]
Get:60 http://172.17.4.1/private bookworm-staging/main armhf libxau6 armhf 1:1.0.9-1 [19.1 kB]
Get:61 http://172.17.4.1/private bookworm-staging/main armhf libxdmcp6 armhf 1:1.1.2-3 [25.0 kB]
Get:62 http://172.17.4.1/private bookworm-staging/main armhf libxcb1 armhf 1.14-3 [136 kB]
Get:63 http://172.17.4.1/private bookworm-staging/main armhf libx11-data all 2:1.7.2-2 [311 kB]
Get:64 http://172.17.4.1/private bookworm-staging/main armhf libx11-6 armhf 2:1.7.2-2 [704 kB]
Get:65 http://172.17.4.1/private bookworm-staging/main armhf libglapi-mesa armhf 21.2.5-1+rpi1 [83.6 kB]
Get:66 http://172.17.4.1/private bookworm-staging/main armhf libx11-xcb1 armhf 2:1.7.2-2 [203 kB]
Get:67 http://172.17.4.1/private bookworm-staging/main armhf libxcb-dri2-0 armhf 1.14-3 [103 kB]
Get:68 http://172.17.4.1/private bookworm-staging/main armhf libxcb-dri3-0 armhf 1.14-3 [102 kB]
Get:69 http://172.17.4.1/private bookworm-staging/main armhf libxcb-glx0 armhf 1.14-3 [117 kB]
Get:70 http://172.17.4.1/private bookworm-staging/main armhf libxcb-present0 armhf 1.14-3 [101 kB]
Get:71 http://172.17.4.1/private bookworm-staging/main armhf libxcb-shm0 armhf 1.14-3 [101 kB]
Get:72 http://172.17.4.1/private bookworm-staging/main armhf libxcb-sync1 armhf 1.14-3 [104 kB]
Get:73 http://172.17.4.1/private bookworm-staging/main armhf libxcb-xfixes0 armhf 1.14-3 [105 kB]
Get:74 http://172.17.4.1/private bookworm-staging/main armhf libxext6 armhf 2:1.3.4-1 [48.0 kB]
Get:75 http://172.17.4.1/private bookworm-staging/main armhf libxfixes3 armhf 1:5.0.3-2 [20.7 kB]
Get:76 http://172.17.4.1/private bookworm-staging/main armhf libxshmfence1 armhf 1.3-1 [8636 B]
Get:77 http://172.17.4.1/private bookworm-staging/main armhf libxxf86vm1 armhf 1:1.1.4-1+b2 [20.1 kB]
Get:78 http://172.17.4.1/private bookworm-staging/main armhf libz3-4 armhf 4.8.12-1 [5758 kB]
Get:79 http://172.17.4.1/private bookworm-staging/main armhf libllvm12 armhf 1:12.0.1-16+rpi1 [17.1 MB]
Get:80 http://172.17.4.1/private bookworm-staging/main armhf libsensors-config all 1:3.6.0-7 [32.3 kB]
Get:81 http://172.17.4.1/private bookworm-staging/main armhf libsensors5 armhf 1:3.6.0-7 [49.6 kB]
Get:82 http://172.17.4.1/private bookworm-staging/main armhf libvulkan1 armhf 1.2.189.0-2 [84.3 kB]
Get:83 http://172.17.4.1/private bookworm-staging/main armhf libgl1-mesa-dri armhf 21.2.5-1+rpi1 [6394 kB]
Get:84 http://172.17.4.1/private bookworm-staging/main armhf libglx-mesa0 armhf 21.2.5-1+rpi1 [169 kB]
Get:85 http://172.17.4.1/private bookworm-staging/main armhf libglx0 armhf 1.3.4-2 [26.6 kB]
Get:86 http://172.17.4.1/private bookworm-staging/main armhf libgl1 armhf 1.3.4-2 [105 kB]
Get:87 http://172.17.4.1/private bookworm-staging/main armhf xorg-sgml-doctools all 1:1.11-1.1 [22.1 kB]
Get:88 http://172.17.4.1/private bookworm-staging/main armhf x11proto-dev all 2021.5-1 [599 kB]
Get:89 http://172.17.4.1/private bookworm-staging/main armhf libxau-dev armhf 1:1.0.9-1 [22.3 kB]
Get:90 http://172.17.4.1/private bookworm-staging/main armhf libxdmcp-dev armhf 1:1.1.2-3 [40.9 kB]
Get:91 http://172.17.4.1/private bookworm-staging/main armhf xtrans-dev all 1.4.0-1 [98.7 kB]
Get:92 http://172.17.4.1/private bookworm-staging/main armhf libpthread-stubs0-dev armhf 0.4-1 [5344 B]
Get:93 http://172.17.4.1/private bookworm-staging/main armhf libxcb1-dev armhf 1.14-3 [171 kB]
Get:94 http://172.17.4.1/private bookworm-staging/main armhf libx11-dev armhf 2:1.7.2-2 [780 kB]
Get:95 http://172.17.4.1/private bookworm-staging/main armhf libglx-dev armhf 1.3.4-2 [16.6 kB]
Get:96 http://172.17.4.1/private bookworm-staging/main armhf libgl-dev armhf 1.3.4-2 [100 kB]
Get:97 http://172.17.4.1/private bookworm-staging/main armhf libvulkan-dev armhf 1.2.189.0-2 [783 kB]
Get:98 http://172.17.4.1/private bookworm-staging/main armhf re2c armhf 2.2-1 [336 kB]
Get:99 http://172.17.4.1/private bookworm-staging/main armhf spirv-tools armhf 2021.2+git20210818-1 [2595 kB]
debconf: delaying package configuration, since apt-utils is not installed
Fetched 63.8 MB in 16s (4038 kB/s)
Selecting previously unselected package bsdextrautils.
(Reading database ... 12559 files and directories currently installed.)
Preparing to unpack .../00-bsdextrautils_2.37.2-4_armhf.deb ...
Unpacking bsdextrautils (2.37.2-4) ...
Selecting previously unselected package libuchardet0:armhf.
Preparing to unpack .../01-libuchardet0_0.0.7-1_armhf.deb ...
Unpacking libuchardet0:armhf (0.0.7-1) ...
Selecting previously unselected package groff-base.
Preparing to unpack .../02-groff-base_1.22.4-7_armhf.deb ...
Unpacking groff-base (1.22.4-7) ...
Selecting previously unselected package libpipeline1:armhf.
Preparing to unpack .../03-libpipeline1_1.5.4-1_armhf.deb ...
Unpacking libpipeline1:armhf (1.5.4-1) ...
Selecting previously unselected package man-db.
Preparing to unpack .../04-man-db_2.9.4-2_armhf.deb ...
Unpacking man-db (2.9.4-2) ...
Selecting previously unselected package libncurses6:armhf.
Preparing to unpack .../05-libncurses6_6.3-1_armhf.deb ...
Unpacking libncurses6:armhf (6.3-1) ...
Selecting previously unselected package libprocps8:armhf.
Preparing to unpack .../06-libprocps8_2%3a3.3.17-5_armhf.deb ...
Unpacking libprocps8:armhf (2:3.3.17-5) ...
Selecting previously unselected package procps.
Preparing to unpack .../07-procps_2%3a3.3.17-5_armhf.deb ...
Unpacking procps (2:3.3.17-5) ...
Selecting previously unselected package libmagic-mgc.
Preparing to unpack .../08-libmagic-mgc_1%3a5.41-2_armhf.deb ...
Unpacking libmagic-mgc (1:5.41-2) ...
Selecting previously unselected package libmagic1:armhf.
Preparing to unpack .../09-libmagic1_1%3a5.41-2_armhf.deb ...
Unpacking libmagic1:armhf (1:5.41-2) ...
Selecting previously unselected package file.
Preparing to unpack .../10-file_1%3a5.41-2_armhf.deb ...
Unpacking file (1:5.41-2) ...
Selecting previously unselected package gettext-base.
Preparing to unpack .../11-gettext-base_0.21-4_armhf.deb ...
Unpacking gettext-base (0.21-4) ...
Selecting previously unselected package libsigsegv2:armhf.
Preparing to unpack .../12-libsigsegv2_2.13-1_armhf.deb ...
Unpacking libsigsegv2:armhf (2.13-1) ...
Selecting previously unselected package m4.
Preparing to unpack .../13-m4_1.4.18-5_armhf.deb ...
Unpacking m4 (1.4.18-5) ...
Selecting previously unselected package autoconf.
Preparing to unpack .../14-autoconf_2.71-2_all.deb ...
Unpacking autoconf (2.71-2) ...
Selecting previously unselected package autotools-dev.
Preparing to unpack .../15-autotools-dev_20180224.1+nmu1_all.deb ...
Unpacking autotools-dev (20180224.1+nmu1) ...
Selecting previously unselected package automake.
Preparing to unpack .../16-automake_1%3a1.16.5-1.1_all.deb ...
Unpacking automake (1:1.16.5-1.1) ...
Selecting previously unselected package autopoint.
Preparing to unpack .../17-autopoint_0.21-4_all.deb ...
Unpacking autopoint (0.21-4) ...
Selecting previously unselected package libicu67:armhf.
Preparing to unpack .../18-libicu67_67.1-7_armhf.deb ...
Unpacking libicu67:armhf (67.1-7) ...
Selecting previously unselected package libxml2:armhf.
Preparing to unpack .../19-libxml2_2.9.12+dfsg-5_armhf.deb ...
Unpacking libxml2:armhf (2.9.12+dfsg-5) ...
Selecting previously unselected package libarchive13:armhf.
Preparing to unpack .../20-libarchive13_3.4.3-2_armhf.deb ...
Unpacking libarchive13:armhf (3.4.3-2) ...
Selecting previously unselected package libbrotli1:armhf.
Preparing to unpack .../21-libbrotli1_1.0.9-2+b1_armhf.deb ...
Unpacking libbrotli1:armhf (1.0.9-2+b1) ...
Selecting previously unselected package libnghttp2-14:armhf.
Preparing to unpack .../22-libnghttp2-14_1.43.0-1_armhf.deb ...
Unpacking libnghttp2-14:armhf (1.43.0-1) ...
Selecting previously unselected package libpsl5:armhf.
Preparing to unpack .../23-libpsl5_0.21.0-1.2_armhf.deb ...
Unpacking libpsl5:armhf (0.21.0-1.2) ...
Selecting previously unselected package librtmp1:armhf.
Preparing to unpack .../24-librtmp1_2.4+20151223.gitfa8646d.1-2+b2_armhf.deb ...
Unpacking librtmp1:armhf (2.4+20151223.gitfa8646d.1-2+b2) ...
Selecting previously unselected package libssh2-1:armhf.
Preparing to unpack .../25-libssh2-1_1.10.0-2_armhf.deb ...
Unpacking libssh2-1:armhf (1.10.0-2) ...
Selecting previously unselected package libcurl4:armhf.
Preparing to unpack .../26-libcurl4_7.79.1-2_armhf.deb ...
Unpacking libcurl4:armhf (7.79.1-2) ...
Selecting previously unselected package libexpat1:armhf.
Preparing to unpack .../27-libexpat1_2.4.1-3_armhf.deb ...
Unpacking libexpat1:armhf (2.4.1-3) ...
Selecting previously unselected package libjsoncpp24:armhf.
Preparing to unpack .../28-libjsoncpp24_1.9.4-5_armhf.deb ...
Unpacking libjsoncpp24:armhf (1.9.4-5) ...
Selecting previously unselected package librhash0:armhf.
Preparing to unpack .../29-librhash0_1.4.2-1_armhf.deb ...
Unpacking librhash0:armhf (1.4.2-1) ...
Selecting previously unselected package libuv1:armhf.
Preparing to unpack .../30-libuv1_1.42.0-1_armhf.deb ...
Unpacking libuv1:armhf (1.42.0-1) ...
Selecting previously unselected package dh-elpa-helper.
Preparing to unpack .../31-dh-elpa-helper_2.0.9_all.deb ...
Unpacking dh-elpa-helper (2.0.9) ...
Selecting previously unselected package emacsen-common.
Preparing to unpack .../32-emacsen-common_3.0.4_all.deb ...
Unpacking emacsen-common (3.0.4) ...
Selecting previously unselected package cmake-data.
Preparing to unpack .../33-cmake-data_3.22.0-1_all.deb ...
Unpacking cmake-data (3.22.0-1) ...
Selecting previously unselected package cmake.
Preparing to unpack .../34-cmake_3.22.0-1_armhf.deb ...
Unpacking cmake (3.22.0-1) ...
Selecting previously unselected package libdebhelper-perl.
Preparing to unpack .../35-libdebhelper-perl_13.5.2_all.deb ...
Unpacking libdebhelper-perl (13.5.2) ...
Selecting previously unselected package libtool.
Preparing to unpack .../36-libtool_2.4.6-15_all.deb ...
Unpacking libtool (2.4.6-15) ...
Selecting previously unselected package dh-autoreconf.
Preparing to unpack .../37-dh-autoreconf_20_all.deb ...
Unpacking dh-autoreconf (20) ...
Selecting previously unselected package libarchive-zip-perl.
Preparing to unpack .../38-libarchive-zip-perl_1.68-1_all.deb ...
Unpacking libarchive-zip-perl (1.68-1) ...
Selecting previously unselected package libsub-override-perl.
Preparing to unpack .../39-libsub-override-perl_0.09-2_all.deb ...
Unpacking libsub-override-perl (0.09-2) ...
Selecting previously unselected package libfile-stripnondeterminism-perl.
Preparing to unpack .../40-libfile-stripnondeterminism-perl_1.12.1-1_all.deb ...
Unpacking libfile-stripnondeterminism-perl (1.12.1-1) ...
Selecting previously unselected package dh-strip-nondeterminism.
Preparing to unpack .../41-dh-strip-nondeterminism_1.12.1-1_all.deb ...
Unpacking dh-strip-nondeterminism (1.12.1-1) ...
Selecting previously unselected package libelf1:armhf.
Preparing to unpack .../42-libelf1_0.186-1_armhf.deb ...
Unpacking libelf1:armhf (0.186-1) ...
Selecting previously unselected package dwz.
Preparing to unpack .../43-dwz_0.14-1_armhf.deb ...
Unpacking dwz (0.14-1) ...
Selecting previously unselected package gettext.
Preparing to unpack .../44-gettext_0.21-4_armhf.deb ...
Unpacking gettext (0.21-4) ...
Selecting previously unselected package intltool-debian.
Preparing to unpack .../45-intltool-debian_0.35.0+20060710.5_all.deb ...
Unpacking intltool-debian (0.35.0+20060710.5) ...
Selecting previously unselected package po-debconf.
Preparing to unpack .../46-po-debconf_1.0.21+nmu1_all.deb ...
Unpacking po-debconf (1.0.21+nmu1) ...
Selecting previously unselected package debhelper.
Preparing to unpack .../47-debhelper_13.5.2_all.deb ...
Unpacking debhelper (13.5.2) ...
Selecting previously unselected package libmd0:armhf.
Preparing to unpack .../48-libmd0_1.0.4-1_armhf.deb ...
Unpacking libmd0:armhf (1.0.4-1) ...
Selecting previously unselected package libbsd0:armhf.
Preparing to unpack .../49-libbsd0_0.11.3-1_armhf.deb ...
Unpacking libbsd0:armhf (0.11.3-1) ...
Selecting previously unselected package libcryptx-perl.
Preparing to unpack .../50-libcryptx-perl_0.074-1_armhf.deb ...
Unpacking libcryptx-perl (0.074-1) ...
Selecting previously unselected package libdrm-common.
Preparing to unpack .../51-libdrm-common_2.4.108-1+rpi1_all.deb ...
Unpacking libdrm-common (2.4.108-1+rpi1) ...
Selecting previously unselected package libdrm2:armhf.
Preparing to unpack .../52-libdrm2_2.4.108-1+rpi1_armhf.deb ...
Unpacking libdrm2:armhf (2.4.108-1+rpi1) ...
Selecting previously unselected package libdrm-amdgpu1:armhf.
Preparing to unpack .../53-libdrm-amdgpu1_2.4.108-1+rpi1_armhf.deb ...
Unpacking libdrm-amdgpu1:armhf (2.4.108-1+rpi1) ...
Selecting previously unselected package libdrm-nouveau2:armhf.
Preparing to unpack .../54-libdrm-nouveau2_2.4.108-1+rpi1_armhf.deb ...
Unpacking libdrm-nouveau2:armhf (2.4.108-1+rpi1) ...
Selecting previously unselected package libdrm-radeon1:armhf.
Preparing to unpack .../55-libdrm-radeon1_2.4.108-1+rpi1_armhf.deb ...
Unpacking libdrm-radeon1:armhf (2.4.108-1+rpi1) ...
Selecting previously unselected package libedit2:armhf.
Preparing to unpack .../56-libedit2_3.1-20210910-1_armhf.deb ...
Unpacking libedit2:armhf (3.1-20210910-1) ...
Selecting previously unselected package libglvnd0:armhf.
Preparing to unpack .../57-libglvnd0_1.3.4-2_armhf.deb ...
Unpacking libglvnd0:armhf (1.3.4-2) ...
Selecting previously unselected package libxau6:armhf.
Preparing to unpack .../58-libxau6_1%3a1.0.9-1_armhf.deb ...
Unpacking libxau6:armhf (1:1.0.9-1) ...
Selecting previously unselected package libxdmcp6:armhf.
Preparing to unpack .../59-libxdmcp6_1%3a1.1.2-3_armhf.deb ...
Unpacking libxdmcp6:armhf (1:1.1.2-3) ...
Selecting previously unselected package libxcb1:armhf.
Preparing to unpack .../60-libxcb1_1.14-3_armhf.deb ...
Unpacking libxcb1:armhf (1.14-3) ...
Selecting previously unselected package libx11-data.
Preparing to unpack .../61-libx11-data_2%3a1.7.2-2_all.deb ...
Unpacking libx11-data (2:1.7.2-2) ...
Selecting previously unselected package libx11-6:armhf.
Preparing to unpack .../62-libx11-6_2%3a1.7.2-2_armhf.deb ...
Unpacking libx11-6:armhf (2:1.7.2-2) ...
Selecting previously unselected package libglapi-mesa:armhf.
Preparing to unpack .../63-libglapi-mesa_21.2.5-1+rpi1_armhf.deb ...
Unpacking libglapi-mesa:armhf (21.2.5-1+rpi1) ...
Selecting previously unselected package libx11-xcb1:armhf.
Preparing to unpack .../64-libx11-xcb1_2%3a1.7.2-2_armhf.deb ...
Unpacking libx11-xcb1:armhf (2:1.7.2-2) ...
Selecting previously unselected package libxcb-dri2-0:armhf.
Preparing to unpack .../65-libxcb-dri2-0_1.14-3_armhf.deb ...
Unpacking libxcb-dri2-0:armhf (1.14-3) ...
Selecting previously unselected package libxcb-dri3-0:armhf.
Preparing to unpack .../66-libxcb-dri3-0_1.14-3_armhf.deb ...
Unpacking libxcb-dri3-0:armhf (1.14-3) ...
Selecting previously unselected package libxcb-glx0:armhf.
Preparing to unpack .../67-libxcb-glx0_1.14-3_armhf.deb ...
Unpacking libxcb-glx0:armhf (1.14-3) ...
Selecting previously unselected package libxcb-present0:armhf.
Preparing to unpack .../68-libxcb-present0_1.14-3_armhf.deb ...
Unpacking libxcb-present0:armhf (1.14-3) ...
Selecting previously unselected package libxcb-shm0:armhf.
Preparing to unpack .../69-libxcb-shm0_1.14-3_armhf.deb ...
Unpacking libxcb-shm0:armhf (1.14-3) ...
Selecting previously unselected package libxcb-sync1:armhf.
Preparing to unpack .../70-libxcb-sync1_1.14-3_armhf.deb ...
Unpacking libxcb-sync1:armhf (1.14-3) ...
Selecting previously unselected package libxcb-xfixes0:armhf.
Preparing to unpack .../71-libxcb-xfixes0_1.14-3_armhf.deb ...
Unpacking libxcb-xfixes0:armhf (1.14-3) ...
Selecting previously unselected package libxext6:armhf.
Preparing to unpack .../72-libxext6_2%3a1.3.4-1_armhf.deb ...
Unpacking libxext6:armhf (2:1.3.4-1) ...
Selecting previously unselected package libxfixes3:armhf.
Preparing to unpack .../73-libxfixes3_1%3a5.0.3-2_armhf.deb ...
Unpacking libxfixes3:armhf (1:5.0.3-2) ...
Selecting previously unselected package libxshmfence1:armhf.
Preparing to unpack .../74-libxshmfence1_1.3-1_armhf.deb ...
Unpacking libxshmfence1:armhf (1.3-1) ...
Selecting previously unselected package libxxf86vm1:armhf.
Preparing to unpack .../75-libxxf86vm1_1%3a1.1.4-1+b2_armhf.deb ...
Unpacking libxxf86vm1:armhf (1:1.1.4-1+b2) ...
Selecting previously unselected package libz3-4:armhf.
Preparing to unpack .../76-libz3-4_4.8.12-1_armhf.deb ...
Unpacking libz3-4:armhf (4.8.12-1) ...
Selecting previously unselected package libllvm12:armhf.
Preparing to unpack .../77-libllvm12_1%3a12.0.1-16+rpi1_armhf.deb ...
Unpacking libllvm12:armhf (1:12.0.1-16+rpi1) ...
Selecting previously unselected package libsensors-config.
Preparing to unpack .../78-libsensors-config_1%3a3.6.0-7_all.deb ...
Unpacking libsensors-config (1:3.6.0-7) ...
Selecting previously unselected package libsensors5:armhf.
Preparing to unpack .../79-libsensors5_1%3a3.6.0-7_armhf.deb ...
Unpacking libsensors5:armhf (1:3.6.0-7) ...
Selecting previously unselected package libvulkan1:armhf.
Preparing to unpack .../80-libvulkan1_1.2.189.0-2_armhf.deb ...
Unpacking libvulkan1:armhf (1.2.189.0-2) ...
Selecting previously unselected package libgl1-mesa-dri:armhf.
Preparing to unpack .../81-libgl1-mesa-dri_21.2.5-1+rpi1_armhf.deb ...
Unpacking libgl1-mesa-dri:armhf (21.2.5-1+rpi1) ...
Selecting previously unselected package libglx-mesa0:armhf.
Preparing to unpack .../82-libglx-mesa0_21.2.5-1+rpi1_armhf.deb ...
Unpacking libglx-mesa0:armhf (21.2.5-1+rpi1) ...
Selecting previously unselected package libglx0:armhf.
Preparing to unpack .../83-libglx0_1.3.4-2_armhf.deb ...
Unpacking libglx0:armhf (1.3.4-2) ...
Selecting previously unselected package libgl1:armhf.
Preparing to unpack .../84-libgl1_1.3.4-2_armhf.deb ...
Unpacking libgl1:armhf (1.3.4-2) ...
Selecting previously unselected package xorg-sgml-doctools.
Preparing to unpack .../85-xorg-sgml-doctools_1%3a1.11-1.1_all.deb ...
Unpacking xorg-sgml-doctools (1:1.11-1.1) ...
Selecting previously unselected package x11proto-dev.
Preparing to unpack .../86-x11proto-dev_2021.5-1_all.deb ...
Unpacking x11proto-dev (2021.5-1) ...
Selecting previously unselected package libxau-dev:armhf.
Preparing to unpack .../87-libxau-dev_1%3a1.0.9-1_armhf.deb ...
Unpacking libxau-dev:armhf (1:1.0.9-1) ...
Selecting previously unselected package libxdmcp-dev:armhf.
Preparing to unpack .../88-libxdmcp-dev_1%3a1.1.2-3_armhf.deb ...
Unpacking libxdmcp-dev:armhf (1:1.1.2-3) ...
Selecting previously unselected package xtrans-dev.
Preparing to unpack .../89-xtrans-dev_1.4.0-1_all.deb ...
Unpacking xtrans-dev (1.4.0-1) ...
Selecting previously unselected package libpthread-stubs0-dev:armhf.
Preparing to unpack .../90-libpthread-stubs0-dev_0.4-1_armhf.deb ...
Unpacking libpthread-stubs0-dev:armhf (0.4-1) ...
Selecting previously unselected package libxcb1-dev:armhf.
Preparing to unpack .../91-libxcb1-dev_1.14-3_armhf.deb ...
Unpacking libxcb1-dev:armhf (1.14-3) ...
Selecting previously unselected package libx11-dev:armhf.
Preparing to unpack .../92-libx11-dev_2%3a1.7.2-2_armhf.deb ...
Unpacking libx11-dev:armhf (2:1.7.2-2) ...
Selecting previously unselected package libglx-dev:armhf.
Preparing to unpack .../93-libglx-dev_1.3.4-2_armhf.deb ...
Unpacking libglx-dev:armhf (1.3.4-2) ...
Selecting previously unselected package libgl-dev:armhf.
Preparing to unpack .../94-libgl-dev_1.3.4-2_armhf.deb ...
Unpacking libgl-dev:armhf (1.3.4-2) ...
Selecting previously unselected package libvulkan-dev:armhf.
Preparing to unpack .../95-libvulkan-dev_1.2.189.0-2_armhf.deb ...
Unpacking libvulkan-dev:armhf (1.2.189.0-2) ...
Selecting previously unselected package re2c.
Preparing to unpack .../96-re2c_2.2-1_armhf.deb ...
Unpacking re2c (2.2-1) ...
Selecting previously unselected package spirv-tools.
Preparing to unpack .../97-spirv-tools_2021.2+git20210818-1_armhf.deb ...
Unpacking spirv-tools (2021.2+git20210818-1) ...
Selecting previously unselected package sbuild-build-depends-mojoshader-dummy.
Preparing to unpack .../98-sbuild-build-depends-mojoshader-dummy_0.invalid.0_armhf.deb ...
Unpacking sbuild-build-depends-mojoshader-dummy (0.invalid.0) ...
Setting up libexpat1:armhf (2.4.1-3) ...
Setting up libpipeline1:armhf (1.5.4-1) ...
Setting up libxau6:armhf (1:1.0.9-1) ...
Setting up libpsl5:armhf (0.21.0-1.2) ...
Setting up bsdextrautils (2.37.2-4) ...
update-alternatives: using /usr/bin/write.ul to provide /usr/bin/write (write) in auto mode
Setting up libicu67:armhf (67.1-7) ...
Setting up libmagic-mgc (1:5.41-2) ...
Setting up libarchive-zip-perl (1.68-1) ...
Setting up libglvnd0:armhf (1.3.4-2) ...
Setting up libdebhelper-perl (13.5.2) ...
Setting up libbrotli1:armhf (1.0.9-2+b1) ...
Setting up libsensors-config (1:3.6.0-7) ...
Setting up libnghttp2-14:armhf (1.43.0-1) ...
Setting up libmagic1:armhf (1:5.41-2) ...
Setting up gettext-base (0.21-4) ...
Setting up file (1:5.41-2) ...
Setting up libpthread-stubs0-dev:armhf (0.4-1) ...
Setting up xtrans-dev (1.4.0-1) ...
Setting up autotools-dev (20180224.1+nmu1) ...
Setting up libz3-4:armhf (4.8.12-1) ...
Setting up libuv1:armhf (1.42.0-1) ...
Setting up spirv-tools (2021.2+git20210818-1) ...
Setting up emacsen-common (3.0.4) ...
Setting up libx11-data (2:1.7.2-2) ...
Setting up librtmp1:armhf (2.4+20151223.gitfa8646d.1-2+b2) ...
Setting up dh-elpa-helper (2.0.9) ...
Setting up libncurses6:armhf (6.3-1) ...
Setting up libsigsegv2:armhf (2.13-1) ...
Setting up libcryptx-perl (0.074-1) ...
Setting up autopoint (0.21-4) ...
Setting up libsensors5:armhf (1:3.6.0-7) ...
Setting up libglapi-mesa:armhf (21.2.5-1+rpi1) ...
Setting up libvulkan1:armhf (1.2.189.0-2) ...
Setting up libjsoncpp24:armhf (1.9.4-5) ...
Setting up libmd0:armhf (1.0.4-1) ...
Setting up libxshmfence1:armhf (1.3-1) ...
Setting up librhash0:armhf (1.4.2-1) ...
Setting up libuchardet0:armhf (0.0.7-1) ...
Setting up libsub-override-perl (0.09-2) ...
Setting up libssh2-1:armhf (1.10.0-2) ...
Setting up xorg-sgml-doctools (1:1.11-1.1) ...
Setting up cmake-data (3.22.0-1) ...
Setting up re2c (2.2-1) ...
Setting up libbsd0:armhf (0.11.3-1) ...
Setting up libdrm-common (2.4.108-1+rpi1) ...
Setting up libelf1:armhf (0.186-1) ...
Setting up libxml2:armhf (2.9.12+dfsg-5) ...
Setting up libprocps8:armhf (2:3.3.17-5) ...
Setting up x11proto-dev (2021.5-1) ...
Setting up libfile-stripnondeterminism-perl (1.12.1-1) ...
Setting up libxdmcp6:armhf (1:1.1.2-3) ...
Setting up libvulkan-dev:armhf (1.2.189.0-2) ...
Setting up libxcb1:armhf (1.14-3) ...
Setting up gettext (0.21-4) ...
Setting up libxcb-xfixes0:armhf (1.14-3) ...
Setting up libxau-dev:armhf (1:1.0.9-1) ...
Setting up libtool (2.4.6-15) ...
Setting up libarchive13:armhf (3.4.3-2) ...
Setting up libxcb-glx0:armhf (1.14-3) ...
Setting up libedit2:armhf (3.1-20210910-1) ...
Setting up m4 (1.4.18-5) ...
Setting up libxcb-shm0:armhf (1.14-3) ...
Setting up intltool-debian (0.35.0+20060710.5) ...
Setting up libxcb-present0:armhf (1.14-3) ...
Setting up libxdmcp-dev:armhf (1:1.1.2-3) ...
Setting up libxcb-sync1:armhf (1.14-3) ...
Setting up libllvm12:armhf (1:12.0.1-16+rpi1) ...
Setting up autoconf (2.71-2) ...
Setting up libxcb-dri2-0:armhf (1.14-3) ...
Setting up dh-strip-nondeterminism (1.12.1-1) ...
Setting up libdrm2:armhf (2.4.108-1+rpi1) ...
Setting up dwz (0.14-1) ...
Setting up groff-base (1.22.4-7) ...
Setting up procps (2:3.3.17-5) ...
Setting up libcurl4:armhf (7.79.1-2) ...
Setting up libx11-6:armhf (2:1.7.2-2) ...
Setting up libdrm-amdgpu1:armhf (2.4.108-1+rpi1) ...
Setting up automake (1:1.16.5-1.1) ...
update-alternatives: using /usr/bin/automake-1.16 to provide /usr/bin/automake (automake) in auto mode
Setting up libxcb-dri3-0:armhf (1.14-3) ...
Setting up libx11-xcb1:armhf (2:1.7.2-2) ...
Setting up libdrm-nouveau2:armhf (2.4.108-1+rpi1) ...
Setting up libxcb1-dev:armhf (1.14-3) ...
Setting up libdrm-radeon1:armhf (2.4.108-1+rpi1) ...
Setting up po-debconf (1.0.21+nmu1) ...
Setting up libgl1-mesa-dri:armhf (21.2.5-1+rpi1) ...
Setting up libx11-dev:armhf (2:1.7.2-2) ...
Setting up libxext6:armhf (2:1.3.4-1) ...
Setting up man-db (2.9.4-2) ...
Not building database; man-db/auto-update is not 'true'.
Setting up libxxf86vm1:armhf (1:1.1.4-1+b2) ...
Setting up dh-autoreconf (20) ...
Setting up libxfixes3:armhf (1:5.0.3-2) ...
Setting up cmake (3.22.0-1) ...
Setting up libglx-mesa0:armhf (21.2.5-1+rpi1) ...
Setting up libglx0:armhf (1.3.4-2) ...
Setting up debhelper (13.5.2) ...
Setting up libgl1:armhf (1.3.4-2) ...
Setting up libglx-dev:armhf (1.3.4-2) ...
Setting up libgl-dev:armhf (1.3.4-2) ...
Setting up sbuild-build-depends-mojoshader-dummy (0.invalid.0) ...
Processing triggers for libc-bin (2.32-4+rpi1) ...
W: No sandbox user '_apt' on the system, can not drop privileges

+------------------------------------------------------------------------------+
| Build environment                                                            |
+------------------------------------------------------------------------------+

Kernel: Linux 4.15.0-76-generic armhf (armv8l)
Toolchain package versions: binutils_2.37-5+rpi1 dpkg-dev_1.20.9+rpi1 g++-11_11.2.0-10+rpi1 gcc-11_11.2.0-10+rpi1 libc6-dev_2.32-4+rpi1 libstdc++-11-dev_11.2.0-10+rpi1 libstdc++6_11.2.0-10+rpi1 linux-libc-dev_5.14.16-1+rpi1
Package versions: adduser_3.118 apt_2.3.12 autoconf_2.71-2 automake_1:1.16.5-1.1 autopoint_0.21-4 autotools-dev_20180224.1+nmu1 base-files_12+rpi1 base-passwd_3.5.52 bash_5.1-3.1 binutils_2.37-5+rpi1 binutils-arm-linux-gnueabihf_2.37-5+rpi1 binutils-common_2.37-5+rpi1 bsdextrautils_2.37.2-4 bsdutils_1:2.37.2-4 build-essential_12.9 bzip2_1.0.8-4 cmake_3.22.0-1 cmake-data_3.22.0-1 coreutils_8.32-4.1 cpp_4:11.2.0-2+rpi1 cpp-11_11.2.0-10+rpi1 dash_0.5.11+git20210903+057cd650a4ed-3 debconf_1.5.79 debhelper_13.5.2 debianutils_4.11.2 dh-autoreconf_20 dh-elpa-helper_2.0.9 dh-strip-nondeterminism_1.12.1-1 diffutils_1:3.7-5 dirmngr_2.2.27-2 dpkg_1.20.9+rpi1 dpkg-dev_1.20.9+rpi1 dwz_0.14-1 e2fsprogs_1.46.4-1 emacsen-common_3.0.4 fakeroot_1.25.3-1.1 file_1:5.41-2 findutils_4.8.0-1 g++_4:11.2.0-2+rpi1 g++-11_11.2.0-10+rpi1 gcc_4:11.2.0-2+rpi1 gcc-11_11.2.0-10+rpi1 gcc-11-base_11.2.0-10+rpi1 gcc-7-base_7.5.0-6+rpi1+b2 gcc-8-base_8.4.0-7+rpi1 gcc-9-base_9.4.0-2+rpi1 gettext_0.21-4 gettext-base_0.21-4 gnupg_2.2.27-2 gnupg-l10n_2.2.27-2 gnupg-utils_2.2.27-2 gpg_2.2.27-2 gpg-agent_2.2.27-2 gpg-wks-client_2.2.27-2 gpg-wks-server_2.2.27-2 gpgconf_2.2.27-2 gpgsm_2.2.27-2 gpgv_2.2.27-2 grep_3.7-1 groff-base_1.22.4-7 gzip_1.10-4 hostname_3.23 init-system-helpers_1.60 intltool-debian_0.35.0+20060710.5 libacl1_2.3.1-1 libapt-pkg6.0_2.3.12 libarchive-zip-perl_1.68-1 libarchive13_3.4.3-2 libasan6_11.2.0-10+rpi1 libassuan0_2.5.5-1 libatomic1_11.2.0-10+rpi1 libattr1_1:2.5.1-1 libaudit-common_1:3.0.6-1 libaudit1_1:3.0.6-1 libbinutils_2.37-5+rpi1 libblkid1_2.37.2-4 libbrotli1_1.0.9-2+b1 libbsd0_0.11.3-1 libbz2-1.0_1.0.8-4 libc-bin_2.32-4+rpi1 libc-dev-bin_2.32-4+rpi1 libc6_2.32-4+rpi1 libc6-dev_2.32-4+rpi1 libcap-ng0_0.7.9-2.2+b1 libcap2_1:2.44-1 libcc1-0_11.2.0-10+rpi1 libcom-err2_1.46.4-1 libcrypt-dev_1:4.4.26-1 libcrypt1_1:4.4.26-1 libcryptx-perl_0.074-1 libctf-nobfd0_2.37-5+rpi1 libctf0_2.37-5+rpi1 libcurl4_7.79.1-2 libdb5.3_5.3.28+dfsg1-0.8 libdebconfclient0_0.261 libdebhelper-perl_13.5.2 libdpkg-perl_1.20.9+rpi1 libdrm-amdgpu1_2.4.108-1+rpi1 libdrm-common_2.4.108-1+rpi1 libdrm-nouveau2_2.4.108-1+rpi1 libdrm-radeon1_2.4.108-1+rpi1 libdrm2_2.4.108-1+rpi1 libedit2_3.1-20210910-1 libelf1_0.186-1 libexpat1_2.4.1-3 libext2fs2_1.46.4-1 libfakeroot_1.25.3-1.1 libffi8_3.4.2-3 libfile-stripnondeterminism-perl_1.12.1-1 libgcc-11-dev_11.2.0-10+rpi1 libgcc-s1_11.2.0-10+rpi1 libgcrypt20_1.9.4-3 libgdbm-compat4_1.22-1 libgdbm6_1.22-1 libgl-dev_1.3.4-2 libgl1_1.3.4-2 libgl1-mesa-dri_21.2.5-1+rpi1 libglapi-mesa_21.2.5-1+rpi1 libglvnd0_1.3.4-2 libglx-dev_1.3.4-2 libglx-mesa0_21.2.5-1+rpi1 libglx0_1.3.4-2 libgmp10_2:6.2.1+dfsg-3 libgnutls30_3.7.2-2 libgomp1_11.2.0-10+rpi1 libgpg-error0_1.42-3 libgssapi-krb5-2_1.18.3-7 libhogweed6_3.7.3-1 libicu67_67.1-7 libidn2-0_2.3.2-2 libisl23_0.24-2 libjsoncpp24_1.9.4-5 libk5crypto3_1.18.3-7 libkeyutils1_1.6.1-2 libkrb5-3_1.18.3-7 libkrb5support0_1.18.3-7 libksba8_1.6.0-2 libldap-2.4-2_2.4.59+dfsg-1 libllvm12_1:12.0.1-16+rpi1 liblocale-gettext-perl_1.07-4+b1 liblz4-1_1.9.3-2 liblzma5_5.2.5-2 libmagic-mgc_1:5.41-2 libmagic1_1:5.41-2 libmd0_1.0.4-1 libmount1_2.37.2-4 libmpc3_1.2.1-1 libmpfr6_4.1.0-3 libncurses6_6.3-1 libncursesw6_6.3-1 libnettle8_3.7.3-1 libnghttp2-14_1.43.0-1 libnpth0_1.6-3 libnsl-dev_1.3.0-2 libnsl2_1.3.0-2 libp11-kit0_0.24.0-5 libpam-modules_1.4.0-10 libpam-modules-bin_1.4.0-10 libpam-runtime_1.4.0-10 libpam0g_1.4.0-10 libpcre2-8-0_10.39-3 libpcre3_2:8.39-13 libperl5.32_5.32.1-6 libpipeline1_1.5.4-1 libprocps8_2:3.3.17-5 libpsl5_0.21.0-1.2 libpthread-stubs0-dev_0.4-1 libreadline8_8.1-2 librhash0_1.4.2-1 librtmp1_2.4+20151223.gitfa8646d.1-2+b2 libsasl2-2_2.1.27+dfsg2-2 libsasl2-modules-db_2.1.27+dfsg2-2 libseccomp2_2.5.3-2+rpi1 libselinux1_3.3-1 libsemanage-common_3.3-1 libsemanage2_3.3-1 libsensors-config_1:3.6.0-7 libsensors5_1:3.6.0-7 libsepol1_3.1-1 libsepol2_3.3-1 libsigsegv2_2.13-1 libsmartcols1_2.37.2-4 libsqlite3-0_3.36.0-2 libss2_1.46.4-1 libssh2-1_1.10.0-2 libssl1.1_1.1.1l-1 libstdc++-11-dev_11.2.0-10+rpi1 libstdc++6_11.2.0-10+rpi1 libsub-override-perl_0.09-2 libsystemd0_249.7-1+rpi1 libtasn1-6_4.18.0-4 libtext-charwidth-perl_0.04-10+b1 libtext-iconv-perl_1.7-7+b1 libtinfo6_6.3-1 libtirpc-common_1.3.2-2 libtirpc-dev_1.3.2-2 libtirpc3_1.3.2-2 libtool_2.4.6-15 libubsan1_11.2.0-10+rpi1 libuchardet0_0.0.7-1 libudev1_249.7-1+rpi1 libunistring2_0.9.10-6 libuuid1_2.37.2-4 libuv1_1.42.0-1 libvulkan-dev_1.2.189.0-2 libvulkan1_1.2.189.0-2 libx11-6_2:1.7.2-2 libx11-data_2:1.7.2-2 libx11-dev_2:1.7.2-2 libx11-xcb1_2:1.7.2-2 libxau-dev_1:1.0.9-1 libxau6_1:1.0.9-1 libxcb-dri2-0_1.14-3 libxcb-dri3-0_1.14-3 libxcb-glx0_1.14-3 libxcb-present0_1.14-3 libxcb-shm0_1.14-3 libxcb-sync1_1.14-3 libxcb-xfixes0_1.14-3 libxcb1_1.14-3 libxcb1-dev_1.14-3 libxdmcp-dev_1:1.1.2-3 libxdmcp6_1:1.1.2-3 libxext6_2:1.3.4-1 libxfixes3_1:5.0.3-2 libxml2_2.9.12+dfsg-5 libxshmfence1_1.3-1 libxxf86vm1_1:1.1.4-1+b2 libxxhash0_0.8.0-2+rpi1 libz3-4_4.8.12-1 libzstd1_1.4.8+dfsg-3+rpi1 linux-libc-dev_5.14.16-1+rpi1 login_1:4.8.1-2 logsave_1.46.4-1 lsb-base_11.1.0+rpi1 m4_1.4.18-5 make_4.3-4.1 man-db_2.9.4-2 mawk_1.3.4.20200120-2 mount_2.37.2-4 ncurses-base_6.3-1 ncurses-bin_6.3-1 netbase_6.3 passwd_1:4.8.1-2 patch_2.7.6-7 perl_5.32.1-6 perl-base_5.32.1-6 perl-modules-5.32_5.32.1-6 pinentry-curses_1.1.0-4 po-debconf_1.0.21+nmu1 procps_2:3.3.17-5 raspbian-archive-keyring_20120528.2 re2c_2.2-1 readline-common_8.1-2 rpcsvc-proto_1.4.2-4 sbuild-build-depends-core-dummy_0.invalid.0 sbuild-build-depends-mojoshader-dummy_0.invalid.0 sed_4.8-1 sensible-utils_0.0.17 spirv-tools_2021.2+git20210818-1 sysvinit-utils_3.00-1 tar_1.34+dfsg-1 tzdata_2021e-1 util-linux_2.37.2-4 x11proto-dev_2021.5-1 xorg-sgml-doctools_1:1.11-1.1 xtrans-dev_1.4.0-1 xz-utils_5.2.5-2 zlib1g_1:1.2.11.dfsg-2

+------------------------------------------------------------------------------+
| Build                                                                        |
+------------------------------------------------------------------------------+


Unpack source
-------------

gpgv: unknown type of key resource 'trustedkeys.kbx'
gpgv: keyblock resource '/tmp/dpkg-verify-sig.o1CkdZtb/trustedkeys.kbx': General error
gpgv: Signature made Wed Oct 28 15:07:01 2020 UTC
gpgv:                using RSA key 7E7729476D87D6F11D91ACCBC293E7B461825ACE
gpgv: Can't check signature: No public key
dpkg-source: warning: failed to verify signature on ./mojoshader_0.0~hg1314+dfsg-1.1.dsc
dpkg-source: info: extracting mojoshader in /<<BUILDDIR>>/mojoshader-0.0~hg1314+dfsg
dpkg-source: info: unpacking mojoshader_0.0~hg1314+dfsg.orig.tar.xz
dpkg-source: info: unpacking mojoshader_0.0~hg1314+dfsg-1.1.debian.tar.xz
dpkg-source: info: using patch list from debian/patches/series
dpkg-source: info: applying CMakeLists.patch
dpkg-source: info: applying perl-script.patch

Check disk space
----------------

Sufficient free space for build

User Environment
----------------

APT_CONFIG=/var/lib/sbuild/apt.conf
DEB_BUILD_OPTIONS=parallel=4
HOME=/sbuild-nonexistent
LC_ALL=POSIX
LOGNAME=buildd
PATH=/usr/local/sbin:/usr/local/bin:/usr/sbin:/usr/bin:/sbin:/bin:/usr/games
SCHROOT_ALIAS_NAME=bookworm-staging-armhf-sbuild
SCHROOT_CHROOT_NAME=bookworm-staging-armhf-sbuild
SCHROOT_COMMAND=env
SCHROOT_GID=112
SCHROOT_GROUP=buildd
SCHROOT_SESSION_ID=bookworm-staging-armhf-sbuild-031ac9a9-a6b9-4d54-8c27-3539951765a1
SCHROOT_UID=107
SCHROOT_USER=buildd
SHELL=/bin/sh
USER=buildd

dpkg-buildpackage
-----------------

dpkg-buildpackage: info: source package mojoshader
dpkg-buildpackage: info: source version 0.0~hg1314+dfsg-1.1
dpkg-buildpackage: info: source distribution unstable
 dpkg-source --before-build .
dpkg-buildpackage: info: host architecture armhf
 debian/rules clean
dh clean
   debian/rules execute_after_dh_auto_clean
make[1]: Entering directory '/<<BUILDDIR>>/mojoshader-0.0~hg1314+dfsg'
rm -f mojoshader_version.h mojoshader_parser_hlsl.h
make[1]: Leaving directory '/<<BUILDDIR>>/mojoshader-0.0~hg1314+dfsg'
   dh_clean
 debian/rules binary-arch
dh binary-arch
   dh_update_autotools_config -a
   dh_autoreconf -a
   debian/rules override_dh_auto_configure
make[1]: Entering directory '/<<BUILDDIR>>/mojoshader-0.0~hg1314+dfsg'
dh_auto_configure -- \
	-DMOJOSHADER_VERSION=1314 \
	-DMOJOSHADER_CHANGESET=hg-1314:3ddd9fca664f
	cd obj-arm-linux-gnueabihf && cmake -DCMAKE_INSTALL_PREFIX=/usr -DCMAKE_BUILD_TYPE=None -DCMAKE_INSTALL_SYSCONFDIR=/etc -DCMAKE_INSTALL_LOCALSTATEDIR=/var -DCMAKE_EXPORT_NO_PACKAGE_REGISTRY=ON -DCMAKE_FIND_USE_PACKAGE_REGISTRY=OFF -DCMAKE_FIND_PACKAGE_NO_PACKAGE_REGISTRY=ON -DCMAKE_INSTALL_RUNSTATEDIR=/run -DCMAKE_SKIP_INSTALL_ALL_DEPENDENCY=ON "-GUnix Makefiles" -DCMAKE_VERBOSE_MAKEFILE=ON -DCMAKE_INSTALL_LIBDIR=lib/arm-linux-gnueabihf -DMOJOSHADER_VERSION=1314 -DMOJOSHADER_CHANGESET=hg-1314:3ddd9fca664f ..
CMake Deprecation Warning at CMakeLists.txt:1 (CMAKE_MINIMUM_REQUIRED):
  Compatibility with CMake < 2.8.12 will be removed from a future version of
  CMake.

  Update the VERSION argument <min> value or use a ...<max> suffix to tell
  CMake that the project does not need compatibility with older versions.


-- The C compiler identification is GNU 11.2.0
-- The CXX compiler identification is GNU 11.2.0
-- Detecting C compiler ABI info
-- Detecting C compiler ABI info - done
-- Check for working C compiler: /usr/bin/cc - skipped
-- Detecting C compile features
-- Detecting C compile features - done
-- Detecting CXX compiler ABI info
-- Detecting CXX compiler ABI info - done
-- Check for working CXX compiler: /usr/bin/c++ - skipped
-- Detecting CXX compile features
-- Detecting CXX compile features - done
-- Mercurial (hg) not found. You can go on, but version info will be wrong.
CMake Warning (dev) at CMakeLists.txt:87 (GET_TARGET_PROPERTY):
  Policy CMP0026 is not set: Disallow use of the LOCATION target property.
  Run "cmake --help-policy CMP0026" for policy details.  Use the cmake_policy
  command to set the policy and suppress this warning.

  The LOCATION property should not be read from target "lemon".  Use the
  target name directly with add_custom_command, or use the generator
  expression $<TARGET_FILE>, as appropriate.

This warning is for project developers.  Use -Wno-dev to suppress it.

-- Configuring done
-- Generating done
CMake Warning:
  Manually-specified variables were not used by the project:

    CMAKE_EXPORT_NO_PACKAGE_REGISTRY
    CMAKE_FIND_PACKAGE_NO_PACKAGE_REGISTRY
    CMAKE_FIND_USE_PACKAGE_REGISTRY


-- Build files have been written to: /<<BUILDDIR>>/mojoshader-0.0~hg1314+dfsg/obj-arm-linux-gnueabihf
make[1]: Leaving directory '/<<BUILDDIR>>/mojoshader-0.0~hg1314+dfsg'
   dh_auto_build -a
	cd obj-arm-linux-gnueabihf && make -j4 "INSTALL=install --strip-program=true" VERBOSE=1
make[1]: Entering directory '/<<BUILDDIR>>/mojoshader-0.0~hg1314+dfsg/obj-arm-linux-gnueabihf'
/usr/bin/cmake -S"/<<BUILDDIR>>/mojoshader-0.0~hg1314+dfsg" -B"/<<BUILDDIR>>/mojoshader-0.0~hg1314+dfsg/obj-arm-linux-gnueabihf" --check-build-system CMakeFiles/Makefile.cmake 0
/usr/bin/cmake -E cmake_progress_start "/<<BUILDDIR>>/mojoshader-0.0~hg1314+dfsg/obj-arm-linux-gnueabihf/CMakeFiles" "/<<BUILDDIR>>/mojoshader-0.0~hg1314+dfsg/obj-arm-linux-gnueabihf//CMakeFiles/progress.marks"
make  -f CMakeFiles/Makefile2 all
make[2]: Entering directory '/<<BUILDDIR>>/mojoshader-0.0~hg1314+dfsg/obj-arm-linux-gnueabihf'
make  -f CMakeFiles/lemon.dir/build.make CMakeFiles/lemon.dir/depend
make[3]: Entering directory '/<<BUILDDIR>>/mojoshader-0.0~hg1314+dfsg/obj-arm-linux-gnueabihf'
cd "/<<BUILDDIR>>/mojoshader-0.0~hg1314+dfsg/obj-arm-linux-gnueabihf" && /usr/bin/cmake -E cmake_depends "Unix Makefiles" "/<<BUILDDIR>>/mojoshader-0.0~hg1314+dfsg" "/<<BUILDDIR>>/mojoshader-0.0~hg1314+dfsg" "/<<BUILDDIR>>/mojoshader-0.0~hg1314+dfsg/obj-arm-linux-gnueabihf" "/<<BUILDDIR>>/mojoshader-0.0~hg1314+dfsg/obj-arm-linux-gnueabihf" "/<<BUILDDIR>>/mojoshader-0.0~hg1314+dfsg/obj-arm-linux-gnueabihf/CMakeFiles/lemon.dir/DependInfo.cmake" --color=
make[3]: Leaving directory '/<<BUILDDIR>>/mojoshader-0.0~hg1314+dfsg/obj-arm-linux-gnueabihf'
make  -f CMakeFiles/lemon.dir/build.make CMakeFiles/lemon.dir/build
make[3]: Entering directory '/<<BUILDDIR>>/mojoshader-0.0~hg1314+dfsg/obj-arm-linux-gnueabihf'
[  3%] Building C object CMakeFiles/lemon.dir/misc/lemon.c.o
/usr/bin/cc -DMOJOSHADER_EFFECT_SUPPORT -I"/<<BUILDDIR>>/mojoshader-0.0~hg1314+dfsg/." -g -O2 -ffile-prefix-map=/<<BUILDDIR>>/mojoshader-0.0~hg1314+dfsg=. -fstack-protector-strong -Wformat -Werror=format-security -Wall -pedantic -Wdate-time -D_FORTIFY_SOURCE=2   -Wall -ggdb3 -MD -MT CMakeFiles/lemon.dir/misc/lemon.c.o -MF CMakeFiles/lemon.dir/misc/lemon.c.o.d -o CMakeFiles/lemon.dir/misc/lemon.c.o -c "/<<BUILDDIR>>/mojoshader-0.0~hg1314+dfsg/misc/lemon.c"
/<<BUILDDIR>>/mojoshader-0.0~hg1314+dfsg/misc/lemon.c: In function 'main':
/<<BUILDDIR>>/mojoshader-0.0~hg1314+dfsg/misc/lemon.c:1425:21: warning: ISO C forbids conversion of function pointer to object pointer type [-Wpedantic]
 1425 |     {OPT_FSTR, "D", (char*)handle_D_option, "Define an %ifdef macro."},
      |                     ^
/<<BUILDDIR>>/mojoshader-0.0~hg1314+dfsg/misc/lemon.c:1426:21: warning: ISO C forbids conversion of function pointer to object pointer type [-Wpedantic]
 1426 |     {OPT_FSTR, "T", (char*)handle_T_option, "Specify a template file."},
      |                     ^
/<<BUILDDIR>>/mojoshader-0.0~hg1314+dfsg/misc/lemon.c: In function 'handleflags':
/<<BUILDDIR>>/mojoshader-0.0~hg1314+dfsg/misc/lemon.c:1760:7: warning: ISO C forbids conversion of object pointer to function pointer type [-Wpedantic]
 1760 |     (*(void(*)(int))(op[j].arg))(v);
      |       ^
/<<BUILDDIR>>/mojoshader-0.0~hg1314+dfsg/misc/lemon.c:1762:7: warning: ISO C forbids conversion of object pointer to function pointer type [-Wpedantic]
 1762 |     (*(void(*)(char *))(op[j].arg))(&argv[i][2]);
      |       ^
/<<BUILDDIR>>/mojoshader-0.0~hg1314+dfsg/misc/lemon.c: In function 'handleswitch':
/<<BUILDDIR>>/mojoshader-0.0~hg1314+dfsg/misc/lemon.c:1843:11: warning: ISO C forbids conversion of object pointer to function pointer type [-Wpedantic]
 1843 |         (*(void(*)(double))(op[j].arg))(dv);
      |           ^
/<<BUILDDIR>>/mojoshader-0.0~hg1314+dfsg/misc/lemon.c:1849:11: warning: ISO C forbids conversion of object pointer to function pointer type [-Wpedantic]
 1849 |         (*(void(*)(int))(op[j].arg))((int)lv);
      |           ^
/<<BUILDDIR>>/mojoshader-0.0~hg1314+dfsg/misc/lemon.c:1855:11: warning: ISO C forbids conversion of object pointer to function pointer type [-Wpedantic]
 1855 |         (*(void(*)(char *))(op[j].arg))(sv);
      |           ^
[  6%] Linking C executable lemon
/usr/bin/cmake -E cmake_link_script CMakeFiles/lemon.dir/link.txt --verbose=1
/usr/bin/cc -g -O2 -ffile-prefix-map=/<<BUILDDIR>>/mojoshader-0.0~hg1314+dfsg=. -fstack-protector-strong -Wformat -Werror=format-security -Wall -pedantic -Wdate-time -D_FORTIFY_SOURCE=2 -Wl,-z,relro -Wl,-z,now -rdynamic CMakeFiles/lemon.dir/misc/lemon.c.o -o lemon 
make[3]: Leaving directory '/<<BUILDDIR>>/mojoshader-0.0~hg1314+dfsg/obj-arm-linux-gnueabihf'
[  6%] Built target lemon
make  -f CMakeFiles/mojoshader.dir/build.make CMakeFiles/mojoshader.dir/depend
make[3]: Entering directory '/<<BUILDDIR>>/mojoshader-0.0~hg1314+dfsg/obj-arm-linux-gnueabihf'
[  9%] Generating ../mojoshader_parser_hlsl.h
./lemon -q -T/<<BUILDDIR>>/mojoshader-0.0~hg1314+dfsg/misc/lempar.c /<<BUILDDIR>>/mojoshader-0.0~hg1314+dfsg/mojoshader_parser_hlsl.lemon
Segmentation fault (core dumped)
make[3]: *** [CMakeFiles/mojoshader.dir/build.make:79: ../mojoshader_parser_hlsl.h] Error 139
make[3]: *** Deleting file '../mojoshader_parser_hlsl.h'
make[3]: Leaving directory '/<<BUILDDIR>>/mojoshader-0.0~hg1314+dfsg/obj-arm-linux-gnueabihf'
make[2]: *** [CMakeFiles/Makefile2:126: CMakeFiles/mojoshader.dir/all] Error 2
make[2]: Leaving directory '/<<BUILDDIR>>/mojoshader-0.0~hg1314+dfsg/obj-arm-linux-gnueabihf'
make[1]: *** [Makefile:139: all] Error 2
make[1]: Leaving directory '/<<BUILDDIR>>/mojoshader-0.0~hg1314+dfsg/obj-arm-linux-gnueabihf'
dh_auto_build: error: cd obj-arm-linux-gnueabihf && make -j4 "INSTALL=install --strip-program=true" VERBOSE=1 returned exit code 2
make: *** [debian/rules:12: binary-arch] Error 25
dpkg-buildpackage: error: debian/rules binary-arch subprocess returned exit status 2
--------------------------------------------------------------------------------
Build finished at 2021-12-03T01:28:26Z

Finished
--------


+------------------------------------------------------------------------------+
| Cleanup                                                                      |
+------------------------------------------------------------------------------+

Purging /<<BUILDDIR>>
Not cleaning session: cloned chroot in use
E: Build failure (dpkg-buildpackage died)

+------------------------------------------------------------------------------+
| Summary                                                                      |
+------------------------------------------------------------------------------+

Build Architecture: armhf
Build-Space: 4428
Build-Time: 14
Distribution: bookworm-staging
Fail-Stage: build
Host Architecture: armhf
Install-Time: 752
Job: mojoshader_0.0~hg1314+dfsg-1.1
Machine Architecture: armhf
Package: mojoshader
Package-Time: 789
Source-Version: 0.0~hg1314+dfsg-1.1
Space: 4428
Status: attempted
Version: 0.0~hg1314+dfsg-1.1
--------------------------------------------------------------------------------
Finished at 2021-12-03T01:28:26Z
Build needed 00:13:09, 4428k disk space