Raspbian Package Auto-Building

Build log for ht (2.0.20-2) on armhf

ht2.0.20-2armhf → 2017-06-18 16:18:08

sbuild (Debian sbuild) 0.72.0 (25 Oct 2016) on mb-lxc-01

| ht 2.0.20-2 (armhf)                          Sun, 18 Jun 2017 13:38:20 +0000 |

Package: ht
Version: 2.0.20-2
Source Version: 2.0.20-2
Distribution: wheezy-staging
Machine Architecture: armhf
Host Architecture: armhf
Build Architecture: armhf

I: NOTICE: Log filtering will replace 'var/lib/schroot/mount/wheezy-staging-armhf-sbuild-e91468fd-33a0-4993-8ed3-85b12613adbf' with '<<CHROOT>>'

| Update chroot                                                                |

Get:1 wheezy-staging Release.gpg [473 B]
Get:2 wheezy-staging Release [10.8 kB]
Get:3 wheezy-staging/main Sources [6094 kB]
Get:4 wheezy-staging/main armhf Packages [7678 kB]
Fetched 13.8 MB in 6s (2036 kB/s)
Reading package lists...

| Fetch source files                                                           |

Check APT

Checking available source versions...

Download source files with APT

Reading package lists...
Building dependency tree...
NOTICE: 'ht' packaging is maintained in the 'Svn' version control system at:
Need to get 1087 kB of source archives.
Get:1 wheezy-staging/main ht 2.0.20-2 (dsc) [1856 B]
Get:2 wheezy-staging/main ht 2.0.20-2 (tar) [1078 kB]
Get:3 wheezy-staging/main ht 2.0.20-2 (diff) [6741 B]
Fetched 1087 kB in 0s (3976 kB/s)
Download complete and in download only mode
I: NOTICE: Log filtering will replace 'build/ht-O6FgzB/ht-2.0.20' with '<<PKGBUILDDIR>>'
I: NOTICE: Log filtering will replace 'build/ht-O6FgzB' with '<<BUILDDIR>>'

| Install build-essential                                                      |

Setup apt archive

Merged Build-Depends: build-essential, fakeroot
Filtered Build-Depends: build-essential, fakeroot
dpkg-deb: building package `sbuild-build-depends-core-dummy' in `/<<BUILDDIR>>/resolver-G85PLq/apt_archive/sbuild-build-depends-core-dummy.deb'.
dpkg-scanpackages: warning: Packages in archive but missing from override file:
dpkg-scanpackages: warning:   sbuild-build-depends-core-dummy
dpkg-scanpackages: info: Wrote 1 entries to output Packages file.
gpg: keyring `/<<BUILDDIR>>/resolver-G85PLq/gpg/secring.gpg' created
gpg: keyring `/<<BUILDDIR>>/resolver-G85PLq/gpg/pubring.gpg' created
gpg: /<<BUILDDIR>>/resolver-G85PLq/gpg/trustdb.gpg: trustdb created
gpg: key F90AF620: public key "Sbuild Signer (Sbuild Build Dependency Archive Key) <buildd-tools-devel@lists.alioth.debian.org>" imported
gpg: Total number processed: 1
gpg:               imported: 1  (RSA: 1)
gpg: key F90AF620: secret key imported
gpg: key F90AF620: "Sbuild Signer (Sbuild Build Dependency Archive Key) <buildd-tools-devel@lists.alioth.debian.org>" not changed
gpg: Total number processed: 1
gpg:              unchanged: 1
gpg:       secret keys read: 1
gpg:   secret keys imported: 1
Get:1 copy: ./ Release.gpg [316 B]
Get:2 copy: ./ Release [957 B]
Get:3 copy: ./ Sources [350 B]
Get:4 copy: ./ Packages [432 B]
Fetched 2055 B in 0s (56.4 kB/s)
Reading package lists...
Reading package lists...

Install core build dependencies (apt-based resolver)

Installing build dependencies
Reading package lists...
Building dependency tree...
The following NEW packages will be installed:
0 upgraded, 1 newly installed, 0 to remove and 0 not upgraded.
Need to get 704 B of archives.
After this operation, 0 B of additional disk space will be used.
Get:1 copy:/<<BUILDDIR>>/resolver-G85PLq/apt_archive/ ./ sbuild-build-depends-core-dummy 0.invalid.0 [704 B]
debconf: delaying package configuration, since apt-utils is not installed
Fetched 704 B in 0s (0 B/s)
Selecting previously unselected package sbuild-build-depends-core-dummy.
(Reading database ... 11350 files and directories currently installed.)
Unpacking sbuild-build-depends-core-dummy (from .../sbuild-build-depends-core-dummy_0.invalid.0_armhf.deb) ...
Setting up sbuild-build-depends-core-dummy (0.invalid.0) ...

| Check architectures                                                          |

Arch check ok (armhf included in any)

| Install package build dependencies                                           |

Setup apt archive

Merged Build-Depends: debhelper (>= 5), flex, libncurses5-dev, libncursesw5-dev, libx11-dev, liblzo2-dev, quilt, texinfo
Filtered Build-Depends: debhelper (>= 5), flex, libncurses5-dev, libncursesw5-dev, libx11-dev, liblzo2-dev, quilt, texinfo
dpkg-deb: building package `sbuild-build-depends-ht-dummy' in `/<<BUILDDIR>>/resolver-G85PLq/apt_archive/sbuild-build-depends-ht-dummy.deb'.
dpkg-scanpackages: warning: Packages in archive but missing from override file:
dpkg-scanpackages: warning:   sbuild-build-depends-core-dummy sbuild-build-depends-ht-dummy
dpkg-scanpackages: info: Wrote 2 entries to output Packages file.
Get:1 copy: ./ Release.gpg [316 B]
Get:2 copy: ./ Release [963 B]
Get:3 copy: ./ Sources [523 B]
Get:4 copy: ./ Packages [604 B]
Fetched 2406 B in 0s (67.0 kB/s)
Reading package lists...
Reading package lists...

Install ht build dependencies (apt-based resolver)

Installing build dependencies
Reading package lists...
Building dependency tree...
Reading state information...
The following extra packages will be installed:
  bsdmainutils debhelper diffstat file flex gettext gettext-base groff-base
  html2text intltool-debian libasprintf0c2 libcroco3 libffi5 libgettextpo0
  libglib2.0-0 liblzo2-2 liblzo2-dev libmagic1 libncurses5-dev
  libncursesw5-dev libpcre3 libpipeline1 libpthread-stubs0
  libpthread-stubs0-dev libtinfo-dev libunistring0 libx11-6 libx11-data
  libx11-dev libxau-dev libxau6 libxcb1 libxcb1-dev libxdmcp-dev libxdmcp6
  libxml2 m4 man-db po-debconf quilt texinfo x11proto-core-dev
  x11proto-input-dev x11proto-kb-dev xorg-sgml-doctools xtrans-dev
Suggested packages:
  wamerican wordlist whois vacation dh-make bison gettext-doc groff
  ncurses-doc libxcb-doc less www-browser libmail-box-perl procmail graphviz
  default-mta mail-transport-agent texlive-base texlive-latex-base
  texlive-generic-recommended texinfo-doc-nonfree
Recommended packages:
  curl wget lynx-cur autopoint libglib2.0-data shared-mime-info libx11-doc
  xml-core libmail-sendmail-perl
The following NEW packages will be installed:
  bsdmainutils debhelper diffstat file flex gettext gettext-base groff-base
  html2text intltool-debian libasprintf0c2 libcroco3 libffi5 libgettextpo0
  libglib2.0-0 liblzo2-2 liblzo2-dev libmagic1 libncurses5-dev
  libncursesw5-dev libpcre3 libpipeline1 libpthread-stubs0
  libpthread-stubs0-dev libtinfo-dev libunistring0 libx11-6 libx11-data
  libx11-dev libxau-dev libxau6 libxcb1 libxcb1-dev libxdmcp-dev libxdmcp6
  libxml2 m4 man-db po-debconf quilt sbuild-build-depends-ht-dummy texinfo
  x11proto-core-dev x11proto-input-dev x11proto-kb-dev xorg-sgml-doctools
0 upgraded, 47 newly installed, 0 to remove and 0 not upgraded.
Need to get 15.4 MB of archives.
After this operation, 41.9 MB of additional disk space will be used.
Get:1 copy:/<<BUILDDIR>>/resolver-G85PLq/apt_archive/ ./ sbuild-build-depends-ht-dummy 0.invalid.0 [742 B]
Get:2 wheezy-staging/main libpcre3 armhf 1:8.30-5 [242 kB]
Get:3 wheezy-staging/main libpipeline1 armhf 1.2.1-1 [35.0 kB]
Get:4 wheezy-staging/main libasprintf0c2 armhf [26.4 kB]
Get:5 wheezy-staging/main libmagic1 armhf 5.11-2+deb7u9 [201 kB]
Get:6 wheezy-staging/main libxml2 armhf 2.8.0+dfsg1-7+wheezy7 [826 kB]
Get:7 wheezy-staging/main m4 armhf 1.4.16-3 [246 kB]
Get:8 wheezy-staging/main flex armhf 2.5.35-10.1 [321 kB]
Get:9 wheezy-staging/main libffi5 armhf 3.0.10-3+b3 [22.9 kB]
Get:10 wheezy-staging/main libglib2.0-0 armhf 2.33.12+really2.32.4-5 [1689 kB]
Get:11 wheezy-staging/main libcroco3 armhf 0.6.6-2+deb7u1 [119 kB]
Get:12 wheezy-staging/main libunistring0 armhf 0.9.3-5 [408 kB]
Get:13 wheezy-staging/main libgettextpo0 armhf [130 kB]
Get:14 wheezy-staging/main liblzo2-2 armhf 2.06-1+deb7u1 [56.0 kB]
Get:15 wheezy-staging/main libxau6 armhf 1:1.0.7-1 [17.6 kB]
Get:16 wheezy-staging/main libxdmcp6 armhf 1:1.1.1-1 [24.6 kB]
Get:17 wheezy-staging/main libxcb1 armhf 1.8.1-2+deb7u1 [42.8 kB]
Get:18 wheezy-staging/main libx11-data all 2:1.5.0-1+deb7u4 [189 kB]
Get:19 wheezy-staging/main libx11-6 armhf 2:1.5.0-1+deb7u4 [838 kB]
Get:20 wheezy-staging/main bsdmainutils armhf 9.0.3 [207 kB]
Get:21 wheezy-staging/main groff-base armhf 1.21-9 [1071 kB]
Get:22 wheezy-staging/main man-db armhf 2.6.2-1 [1027 kB]
Get:23 wheezy-staging/main file armhf 5.11-2+deb7u9 [53.2 kB]
Get:24 wheezy-staging/main gettext-base armhf [138 kB]
Get:25 wheezy-staging/main texinfo armhf 4.13a.dfsg.1-10 [960 kB]
Get:26 wheezy-staging/main html2text armhf 1.3.2a-15 [98.5 kB]
Get:27 wheezy-staging/main gettext armhf [1879 kB]
Get:28 wheezy-staging/main intltool-debian all 0.35.0+20060710.1 [29.8 kB]
Get:29 wheezy-staging/main po-debconf all 1.0.16+nmu2 [223 kB]
Get:30 wheezy-staging/main debhelper all 9.20120909 [705 kB]
Get:31 wheezy-staging/main diffstat armhf 1.55-3 [28.6 kB]
Get:32 wheezy-staging/main liblzo2-dev armhf 2.06-1+deb7u1 [146 kB]
Get:33 wheezy-staging/main libtinfo-dev armhf 5.9-10 [89.6 kB]
Get:34 wheezy-staging/main libncurses5-dev armhf 5.9-10 [202 kB]
Get:35 wheezy-staging/main libncursesw5-dev armhf 5.9-10 [233 kB]
Get:36 wheezy-staging/main libpthread-stubs0 armhf 0.3-3 [3230 B]
Get:37 wheezy-staging/main libpthread-stubs0-dev armhf 0.3-3 [3996 B]
Get:38 wheezy-staging/main xorg-sgml-doctools all 1:1.10-1 [24.1 kB]
Get:39 wheezy-staging/main x11proto-core-dev all 7.0.23-1 [774 kB]
Get:40 wheezy-staging/main libxau-dev armhf 1:1.0.7-1 [21.0 kB]
Get:41 wheezy-staging/main libxdmcp-dev armhf 1:1.1.1-1 [40.8 kB]
Get:42 wheezy-staging/main x11proto-input-dev all 2.2-1 [172 kB]
Get:43 wheezy-staging/main x11proto-kb-dev all 1.0.6-2 [269 kB]
Get:44 wheezy-staging/main xtrans-dev all 1.2.7-1 [112 kB]
Get:45 wheezy-staging/main libxcb1-dev armhf 1.8.1-2+deb7u1 [81.6 kB]
Get:46 wheezy-staging/main libx11-dev armhf 2:1.5.0-1+deb7u4 [957 kB]
Get:47 wheezy-staging/main quilt all 0.60-2 [377 kB]
debconf: delaying package configuration, since apt-utils is not installed
Fetched 15.4 MB in 3s (4293 kB/s)
Selecting previously unselected package libpcre3:armhf.
(Reading database ... 11350 files and directories currently installed.)
Unpacking libpcre3:armhf (from .../libpcre3_1%3a8.30-5_armhf.deb) ...
Selecting previously unselected package libpipeline1:armhf.
Unpacking libpipeline1:armhf (from .../libpipeline1_1.2.1-1_armhf.deb) ...
Selecting previously unselected package libasprintf0c2:armhf.
Unpacking libasprintf0c2:armhf (from .../libasprintf0c2_0.18.1.1-9_armhf.deb) ...
Selecting previously unselected package libmagic1:armhf.
Unpacking libmagic1:armhf (from .../libmagic1_5.11-2+deb7u9_armhf.deb) ...
Selecting previously unselected package libxml2:armhf.
Unpacking libxml2:armhf (from .../libxml2_2.8.0+dfsg1-7+wheezy7_armhf.deb) ...
Selecting previously unselected package m4.
Unpacking m4 (from .../archives/m4_1.4.16-3_armhf.deb) ...
Selecting previously unselected package flex.
Unpacking flex (from .../flex_2.5.35-10.1_armhf.deb) ...
Selecting previously unselected package libffi5:armhf.
Unpacking libffi5:armhf (from .../libffi5_3.0.10-3+b3_armhf.deb) ...
Selecting previously unselected package libglib2.0-0:armhf.
Unpacking libglib2.0-0:armhf (from .../libglib2.0-0_2.33.12+really2.32.4-5_armhf.deb) ...
Selecting previously unselected package libcroco3:armhf.
Unpacking libcroco3:armhf (from .../libcroco3_0.6.6-2+deb7u1_armhf.deb) ...
Selecting previously unselected package libunistring0:armhf.
Unpacking libunistring0:armhf (from .../libunistring0_0.9.3-5_armhf.deb) ...
Selecting previously unselected package libgettextpo0:armhf.
Unpacking libgettextpo0:armhf (from .../libgettextpo0_0.18.1.1-9_armhf.deb) ...
Selecting previously unselected package liblzo2-2:armhf.
Unpacking liblzo2-2:armhf (from .../liblzo2-2_2.06-1+deb7u1_armhf.deb) ...
Selecting previously unselected package libxau6:armhf.
Unpacking libxau6:armhf (from .../libxau6_1%3a1.0.7-1_armhf.deb) ...
Selecting previously unselected package libxdmcp6:armhf.
Unpacking libxdmcp6:armhf (from .../libxdmcp6_1%3a1.1.1-1_armhf.deb) ...
Selecting previously unselected package libxcb1:armhf.
Unpacking libxcb1:armhf (from .../libxcb1_1.8.1-2+deb7u1_armhf.deb) ...
Selecting previously unselected package libx11-data.
Unpacking libx11-data (from .../libx11-data_2%3a1.5.0-1+deb7u4_all.deb) ...
Selecting previously unselected package libx11-6:armhf.
Unpacking libx11-6:armhf (from .../libx11-6_2%3a1.5.0-1+deb7u4_armhf.deb) ...
Selecting previously unselected package bsdmainutils.
Unpacking bsdmainutils (from .../bsdmainutils_9.0.3_armhf.deb) ...
Selecting previously unselected package groff-base.
Unpacking groff-base (from .../groff-base_1.21-9_armhf.deb) ...
Selecting previously unselected package man-db.
Unpacking man-db (from .../man-db_2.6.2-1_armhf.deb) ...
Selecting previously unselected package file.
Unpacking file (from .../file_5.11-2+deb7u9_armhf.deb) ...
Selecting previously unselected package gettext-base.
Unpacking gettext-base (from .../gettext-base_0.18.1.1-9_armhf.deb) ...
Selecting previously unselected package texinfo.
Unpacking texinfo (from .../texinfo_4.13a.dfsg.1-10_armhf.deb) ...
Selecting previously unselected package html2text.
Unpacking html2text (from .../html2text_1.3.2a-15_armhf.deb) ...
Selecting previously unselected package gettext.
Unpacking gettext (from .../gettext_0.18.1.1-9_armhf.deb) ...
Selecting previously unselected package intltool-debian.
Unpacking intltool-debian (from .../intltool-debian_0.35.0+20060710.1_all.deb) ...
Selecting previously unselected package po-debconf.
Unpacking po-debconf (from .../po-debconf_1.0.16+nmu2_all.deb) ...
Selecting previously unselected package debhelper.
Unpacking debhelper (from .../debhelper_9.20120909_all.deb) ...
Selecting previously unselected package diffstat.
Unpacking diffstat (from .../diffstat_1.55-3_armhf.deb) ...
Selecting previously unselected package liblzo2-dev.
Unpacking liblzo2-dev (from .../liblzo2-dev_2.06-1+deb7u1_armhf.deb) ...
Selecting previously unselected package libtinfo-dev:armhf.
Unpacking libtinfo-dev:armhf (from .../libtinfo-dev_5.9-10_armhf.deb) ...
Selecting previously unselected package libncurses5-dev.
Unpacking libncurses5-dev (from .../libncurses5-dev_5.9-10_armhf.deb) ...
Selecting previously unselected package libncursesw5-dev.
Unpacking libncursesw5-dev (from .../libncursesw5-dev_5.9-10_armhf.deb) ...
Selecting previously unselected package libpthread-stubs0:armhf.
Unpacking libpthread-stubs0:armhf (from .../libpthread-stubs0_0.3-3_armhf.deb) ...
Selecting previously unselected package libpthread-stubs0-dev:armhf.
Unpacking libpthread-stubs0-dev:armhf (from .../libpthread-stubs0-dev_0.3-3_armhf.deb) ...
Selecting previously unselected package xorg-sgml-doctools.
Unpacking xorg-sgml-doctools (from .../xorg-sgml-doctools_1%3a1.10-1_all.deb) ...
Selecting previously unselected package x11proto-core-dev.
Unpacking x11proto-core-dev (from .../x11proto-core-dev_7.0.23-1_all.deb) ...
Selecting previously unselected package libxau-dev:armhf.
Unpacking libxau-dev:armhf (from .../libxau-dev_1%3a1.0.7-1_armhf.deb) ...
Selecting previously unselected package libxdmcp-dev:armhf.
Unpacking libxdmcp-dev:armhf (from .../libxdmcp-dev_1%3a1.1.1-1_armhf.deb) ...
Selecting previously unselected package x11proto-input-dev.
Unpacking x11proto-input-dev (from .../x11proto-input-dev_2.2-1_all.deb) ...
Selecting previously unselected package x11proto-kb-dev.
Unpacking x11proto-kb-dev (from .../x11proto-kb-dev_1.0.6-2_all.deb) ...
Selecting previously unselected package xtrans-dev.
Unpacking xtrans-dev (from .../xtrans-dev_1.2.7-1_all.deb) ...
Selecting previously unselected package libxcb1-dev:armhf.
Unpacking libxcb1-dev:armhf (from .../libxcb1-dev_1.8.1-2+deb7u1_armhf.deb) ...
Selecting previously unselected package libx11-dev:armhf.
Unpacking libx11-dev:armhf (from .../libx11-dev_2%3a1.5.0-1+deb7u4_armhf.deb) ...
Selecting previously unselected package quilt.
Unpacking quilt (from .../archives/quilt_0.60-2_all.deb) ...
Selecting previously unselected package sbuild-build-depends-ht-dummy.
Unpacking sbuild-build-depends-ht-dummy (from .../sbuild-build-depends-ht-dummy_0.invalid.0_armhf.deb) ...
Setting up libpcre3:armhf (1:8.30-5) ...
Setting up libpipeline1:armhf (1.2.1-1) ...
Setting up libasprintf0c2:armhf ( ...
Setting up libmagic1:armhf (5.11-2+deb7u9) ...
Setting up libxml2:armhf (2.8.0+dfsg1-7+wheezy7) ...
Setting up m4 (1.4.16-3) ...
Setting up flex (2.5.35-10.1) ...
Setting up libffi5:armhf (3.0.10-3+b3) ...
Setting up libglib2.0-0:armhf (2.33.12+really2.32.4-5) ...
No schema files found: doing nothing.
Setting up libcroco3:armhf (0.6.6-2+deb7u1) ...
Setting up libunistring0:armhf (0.9.3-5) ...
Setting up libgettextpo0:armhf ( ...
Setting up liblzo2-2:armhf (2.06-1+deb7u1) ...
Setting up libxau6:armhf (1:1.0.7-1) ...
Setting up libxdmcp6:armhf (1:1.1.1-1) ...
Setting up libxcb1:armhf (1.8.1-2+deb7u1) ...
Setting up libx11-data (2:1.5.0-1+deb7u4) ...
Setting up libx11-6:armhf (2:1.5.0-1+deb7u4) ...
Setting up bsdmainutils (9.0.3) ...
update-alternatives: using /usr/bin/bsd-write to provide /usr/bin/write (write) in auto mode
update-alternatives: using /usr/bin/bsd-from to provide /usr/bin/from (from) in auto mode
Setting up groff-base (1.21-9) ...
Setting up man-db (2.6.2-1) ...
Building database of manual pages ...
Setting up file (5.11-2+deb7u9) ...
Setting up gettext-base ( ...
Setting up texinfo (4.13a.dfsg.1-10) ...
Setting up html2text (1.3.2a-15) ...
Setting up gettext ( ...
Setting up intltool-debian (0.35.0+20060710.1) ...
Setting up po-debconf (1.0.16+nmu2) ...
Setting up debhelper (9.20120909) ...
Setting up diffstat (1.55-3) ...
Setting up liblzo2-dev (2.06-1+deb7u1) ...
Setting up libtinfo-dev:armhf (5.9-10) ...
Setting up libncurses5-dev (5.9-10) ...
Setting up libncursesw5-dev (5.9-10) ...
Setting up libpthread-stubs0:armhf (0.3-3) ...
Setting up libpthread-stubs0-dev:armhf (0.3-3) ...
Setting up xorg-sgml-doctools (1:1.10-1) ...
Setting up x11proto-core-dev (7.0.23-1) ...
Setting up libxau-dev:armhf (1:1.0.7-1) ...
Setting up libxdmcp-dev:armhf (1:1.1.1-1) ...
Setting up x11proto-input-dev (2.2-1) ...
Setting up x11proto-kb-dev (1.0.6-2) ...
Setting up xtrans-dev (1.2.7-1) ...
Setting up libxcb1-dev:armhf (1.8.1-2+deb7u1) ...
Setting up libx11-dev:armhf (2:1.5.0-1+deb7u4) ...
Setting up quilt (0.60-2) ...
Setting up sbuild-build-depends-ht-dummy (0.invalid.0) ...

| Build environment                                                            |

Kernel: Linux 4.4.0-79-generic armhf (armv8l)
Toolchain package versions: binutils_2.22-8+deb7u3 dpkg-dev_1.16.18+rpi1 g++-4.6_4.6.3-14+rpi1 gcc-4.6_4.6.3-14+rpi1 libc6-dev_2.13-38+rpi2+deb7u11 libstdc++6_4.7.2-5+rpi1 libstdc++6-4.6-dev_4.6.3-14+rpi1 linux-libc-dev_3.2.51-1+rpi1
Package versions: apt_0.9.7.9+rpi1+deb7u7 base-files_7.1wheezy11+rpi1 base-passwd_3.5.26 bash_4.2+dfsg-0.1+deb7u4 binutils_2.22-8+deb7u3 bsdmainutils_9.0.3 bsdutils_1:2.20.1-5.3 build-essential_11.5+b1 bzip2_1.0.6-4 coreutils_8.13-3.5 cpio_2.11+dfsg-0.1+deb7u2 cpp_4:4.6.3-8 cpp-4.6_4.6.3-14+rpi1 dash_0.5.7-3 debconf_1.5.49 debconf-i18n_1.5.49 debfoster_2.7-1.2 debhelper_9.20120909 debianutils_4.3.2 diffstat_1.55-3 diffutils_1:3.2-6 dpkg_1.16.18+rpi1 dpkg-dev_1.16.18+rpi1 e2fslibs_1.42.5-1.1+deb7u1 e2fsprogs_1.42.5-1.1+deb7u1 fakeroot_1.18.4-2 file_5.11-2+deb7u9 findutils_4.4.2-4 flex_2.5.35-10.1 g++_4:4.6.3-8 g++-4.6_4.6.3-14+rpi1 gcc_4:4.6.3-8 gcc-4.5-base_4.5.3-12+rpi1 gcc-4.6_4.6.3-14+rpi1 gcc-4.6-base_4.6.3-14+rpi1 gcc-4.7-base_4.7.2-5+rpi1 gettext_0.18.1.1-9 gettext-base_0.18.1.1-9 gnupg_1.4.12-7+deb7u8 gpgv_1.4.12-7+deb7u8 grep_2.12-2 groff-base_1.21-9 gzip_1.5-1.1 hostname_3.11 html2text_1.3.2a-15 initramfs-tools_0.115~bpo70+1 initscripts_2.88dsf-41+deb7u1 insserv_1.14.0-5 intltool-debian_0.35.0+20060710.1 klibc-utils_2.0.1-3.1+rpi1 kmod_9-3 libacl1_2.2.51-8 libapt-pkg4.12_0.9.7.9+rpi1+deb7u7 libasprintf0c2_0.18.1.1-9 libattr1_1:2.4.46-8 libblkid1_2.20.1-5.3 libbz2-1.0_1.0.6-4 libc-bin_2.13-38+rpi2+deb7u11 libc-dev-bin_2.13-38+rpi2+deb7u11 libc6_2.13-38+rpi2+deb7u11 libc6-dev_2.13-38+rpi2+deb7u11 libclass-isa-perl_0.36-3 libcomerr2_1.42.5-1.1+deb7u1 libcroco3_0.6.6-2+deb7u1 libdb5.1_5.1.29-5 libdbus-1-3_1.6.8-1+deb7u6 libdpkg-perl_1.16.18+rpi1 libffi5_3.0.10-3+b3 libgc1c2_1:7.1-9.1+deb7u1 libgcc1_1:4.7.2-5+rpi1 libgdbm3_1.8.3-11 libgettextpo0_0.18.1.1-9 libglib2.0-0_2.33.12+really2.32.4-5 libgmp10_2:5.0.5+dfsg-2 libgomp1_4.7.2-5+rpi1 libklibc_2.0.1-3.1+rpi1 libkmod2_9-3 liblocale-gettext-perl_1.05-7 liblzma5_5.1.1alpha+20120614-2 liblzo2-2_2.06-1+deb7u1 liblzo2-dev_2.06-1+deb7u1 libmagic1_5.11-2+deb7u9 libmount1_2.20.1-5.3 libmpc2_0.9-4 libmpfr4_3.1.0-5 libncurses5_5.9-10 libncurses5-dev_5.9-10 libncursesw5_5.9-10 libncursesw5-dev_5.9-10 libnih-dbus1_1.0.3-4.1 libnih1_1.0.3-4.1 libpam-modules_1.1.3-7.1 libpam-modules-bin_1.1.3-7.1 libpam-runtime_1.1.3-7.1 libpam0g_1.1.3-7.1 libpcre3_1:8.30-5 libpipeline1_1.2.1-1 libprocps0_1:3.3.3-3 libpthread-stubs0_0.3-3 libpthread-stubs0-dev_0.3-3 libreadline6_6.2+dfsg-0.1 libselinux1_2.1.9-5 libsemanage-common_2.1.6-6 libsemanage1_2.1.6-6 libsepol1_2.1.4-3 libslang2_2.2.4-15 libss2_1.42.5-1.1+deb7u1 libstdc++6_4.7.2-5+rpi1 libstdc++6-4.6-dev_4.6.3-14+rpi1 libswitch-perl_2.16-2 libtext-charwidth-perl_0.04-7 libtext-iconv-perl_1.7-5 libtext-wrapi18n-perl_0.06-7 libtimedate-perl_1.2000-1 libtinfo-dev_5.9-10 libtinfo5_5.9-10 libudev0_175-7.2 libunistring0_0.9.3-5 libusb-0.1-4_2:0.1.12-20+nmu1 libustr-1.0-1_1.0.4-3 libuuid1_2.20.1-5.3 libx11-6_2:1.5.0-1+deb7u4 libx11-data_2:1.5.0-1+deb7u4 libx11-dev_2:1.5.0-1+deb7u4 libxau-dev_1:1.0.7-1 libxau6_1:1.0.7-1 libxcb1_1.8.1-2+deb7u1 libxcb1-dev_1.8.1-2+deb7u1 libxdmcp-dev_1:1.1.1-1 libxdmcp6_1:1.1.1-1 libxml2_2.8.0+dfsg1-7+wheezy7 linux-libc-dev_3.2.51-1+rpi1 login_1: lsb-base_4.1+Debian8+rpi1+deb7u1 m4_1.4.16-3 make_3.81-8.2 makedev_2.3.1-92 man-db_2.6.2-1 mawk_1.3.3-17 mount_2.20.1-5.3 mountall_2.46 multiarch-support_2.13-38+rpi2+deb7u11 ncurses-base_5.9-10 ncurses-bin_5.9-10 passwd_1: patch_2.6.1-3 perl_5.14.2-21+rpi2+deb7u2 perl-base_5.14.2-21+rpi2+deb7u2 perl-modules_5.14.2-21+rpi2+deb7u2 plymouth_0.8.5.1-5 po-debconf_1.0.16+nmu2 procps_1:3.3.3-3 quilt_0.60-2 raspbian-archive-keyring_20120528.2 readline-common_6.2+dfsg-0.1 sbuild-build-depends-core-dummy_0.invalid.0 sbuild-build-depends-ht-dummy_0.invalid.0 sed_4.2.1-10 sensible-utils_0.0.7 sysv-rc_2.88dsf-41+deb7u1 sysvinit_2.88dsf-41+deb7u1 sysvinit-utils_2.88dsf-41+deb7u1 tar_1.26+dfsg-0.1+deb7u1 texinfo_4.13a.dfsg.1-10 tzdata_2017b-0+deb7u1 udev_175-7.2 util-linux_2.20.1-5.3 x11proto-core-dev_7.0.23-1 x11proto-input-dev_2.2-1 x11proto-kb-dev_1.0.6-2 xorg-sgml-doctools_1:1.10-1 xtrans-dev_1.2.7-1 xz-utils_5.1.1alpha+20120614-2 zlib1g_1:1.2.7.dfsg-13

| Build                                                                        |

Unpack source

gpgv: keyblock resource `/sbuild-nonexistent/.gnupg/trustedkeys.gpg': file open error
gpgv: Signature made Sun Jun  3 16:43:31 2012 UTC using RSA key ID 672C8B12
gpgv: Can't check signature: public key not found
dpkg-source: warning: failed to verify signature on ./ht_2.0.20-2.dsc
dpkg-source: info: extracting ht in /<<PKGBUILDDIR>>
dpkg-source: info: unpacking ht_2.0.20.orig.tar.gz
dpkg-source: info: applying ht_2.0.20-2.diff.gz

Check disk space

df: Warning: cannot read table of mounted file systems: No such file or directory
Sufficient free space for build

User Environment



dpkg-buildpackage: source package ht
dpkg-buildpackage: source version 2.0.20-2
 dpkg-source --before-build ht-2.0.20
dpkg-buildpackage: host architecture armhf
 fakeroot debian/rules clean
rm -f build-stamp configure-stamp
[ ! -f Makefile ] || /usr/bin/make -i distclean
QUILT_PATCHES=debian/patches \
		quilt --quiltrc /dev/null pop -a -R || test $? = 2
No patch removed
rm -rf .pc debian/stamp-patched
 debian/rules build-arch
QUILT_PATCHES=debian/patches \
		quilt --quiltrc /dev/null push -a || test $? = 2
Applying patch 10_fix_info_files.diff
patching file doc/ht.texi
patching file doc/Makefile.in
Hunk #1 succeeded at 161 (offset 3 lines).
Hunk #2 succeeded at 332 (offset 15 lines).

Now at patch 10_fix_info_files.diff
touch debian/stamp-patched
./configure --host=arm-linux-gnueabihf --build=arm-linux-gnueabihf \
		    --enable-release --prefix=/usr
checking build system type... arm-unknown-linux-gnueabihf
checking host system type... arm-unknown-linux-gnueabihf
checking target system type... arm-unknown-linux-gnueabihf
checking for a BSD-compatible install... /usr/bin/install -c
checking whether build environment is sane... yes
checking for a thread-safe mkdir -p... /bin/mkdir -p
checking for gawk... no
checking for mawk... mawk
checking whether make sets $(MAKE)... yes
*** LINUX, building POSIX version. we need (n)curses.
checking for arm-linux-gnueabihf-ranlib... no
checking for ranlib... ranlib
checking for gmake... no
checking for make... /usr/bin/make
checking whether /usr/bin/make sets $(MAKE)... yes
checking for arm-linux-gnueabihf-gcc... arm-linux-gnueabihf-gcc
checking whether the C compiler works... yes
checking for C compiler default output file name... a.out
checking for suffix of executables... 
checking whether we are cross compiling... no
checking for suffix of object files... o
checking whether we are using the GNU C compiler... yes
checking whether arm-linux-gnueabihf-gcc accepts -g... yes
checking for arm-linux-gnueabihf-gcc option to accept ISO C89... none needed
checking for style of include used by /usr/bin/make... GNU
checking dependency style of arm-linux-gnueabihf-gcc... gcc3
checking how to run the C preprocessor... arm-linux-gnueabihf-gcc -E
checking for arm-linux-gnueabihf-g++... arm-linux-gnueabihf-g++
checking whether we are using the GNU C++ compiler... yes
checking whether arm-linux-gnueabihf-g++ accepts -g... yes
checking dependency style of arm-linux-gnueabihf-g++... gcc3
checking for bison... no
checking for byacc... no
checking for flex... flex
checking lex output file root... lex.yy
checking lex library... -lfl
checking whether yytext is a pointer... yes
checking for ar... /usr/bin/ar
checking for gar... (cached) /usr/bin/ar
checking whether to use the included lzo compression library... no
checking for lzo1x_1_compress in -llzo2... yes
checking lzo/lzo1x.h usability... yes
checking lzo/lzo1x.h presence... yes
checking for lzo/lzo1x.h... yes
checking for XOpenDisplay in -lX11... yes
checking for ANSI C header files... no
checking stdlib.h usability... yes
checking stdlib.h presence... yes
checking for stdlib.h... yes
checking string.h usability... yes
checking string.h presence... yes
checking for string.h... yes
checking stdint.h usability... yes
checking stdint.h presence... yes
checking for stdint.h... yes
checking ncurses.h usability... yes
checking ncurses.h presence... yes
checking for ncurses.h... yes
checking for an ANSI C-conforming const... yes
checking size of char... 1
checking size of short... 2
checking size of int... 4
checking size of long int... 4
checking for asinh... no
checking for acosh... no
checking for atanh... no
configure: creating ./config.status
config.status: creating Makefile
config.status: creating analyser/Makefile
config.status: creating asm/Makefile
config.status: creating doc/Makefile
config.status: creating eval/Makefile
config.status: creating info/Makefile
config.status: creating io/Makefile
config.status: creating io/posix/Makefile
config.status: creating io/djgpp/Makefile
config.status: creating io/win32/Makefile
config.status: creating minilzo/Makefile
config.status: creating output/Makefile
config.status: creating tools/Makefile
config.status: creating config.h
config.status: executing depfiles commands

./configure successful.

Configuration summary

X11 textmode support available:   yes
enable profiling:                 no
make a release build:             yes
using included minilzo:           no
touch configure-stamp
/usr/bin/make CFLAGS="-pipe -g -Wall -fsigned-char -O2 -fomit-frame-pointer" CXXFLAGS="-pipe -g -Wall -fsigned-char -O2 -fomit-frame-pointer"
make[1]: Entering directory `/<<PKGBUILDDIR>>'
/usr/bin/make  all-recursive
make[2]: Entering directory `/<<PKGBUILDDIR>>'
Making all in tools
make[3]: Entering directory `/<<PKGBUILDDIR>>/tools'
arm-linux-gnueabihf-gcc -DHAVE_CONFIG_H -I. -I..     -pipe -g -Wall -fsigned-char -O2 -fomit-frame-pointer -MT bin2c.o -MD -MP -MF .deps/bin2c.Tpo -c -o bin2c.o bin2c.c
mv -f .deps/bin2c.Tpo .deps/bin2c.Po
arm-linux-gnueabihf-gcc  -pipe -g -Wall -fsigned-char -O2 -fomit-frame-pointer   -o bin2c bin2c.o  
make[3]: Leaving directory `/<<PKGBUILDDIR>>/tools'
Making all in analyser
make[3]: Entering directory `/<<PKGBUILDDIR>>/analyser'
arm-linux-gnueabihf-g++ -DHAVE_CONFIG_H -I. -I.. -I.. -I../asm -I../io/posix -I../io -I../output -I../eval    -pipe -g -Wall -fsigned-char -O2 -fomit-frame-pointer -MT analy.o -MD -MP -MF .deps/analy.Tpo -c -o analy.o analy.cc
mv -f .deps/analy.Tpo .deps/analy.Po
arm-linux-gnueabihf-g++ -DHAVE_CONFIG_H -I. -I.. -I.. -I../asm -I../io/posix -I../io -I../output -I../eval    -pipe -g -Wall -fsigned-char -O2 -fomit-frame-pointer -MT analy_alpha.o -MD -MP -MF .deps/analy_alpha.Tpo -c -o analy_alpha.o analy_alpha.cc
mv -f .deps/analy_alpha.Tpo .deps/analy_alpha.Po
arm-linux-gnueabihf-g++ -DHAVE_CONFIG_H -I. -I.. -I.. -I../asm -I../io/posix -I../io -I../output -I../eval    -pipe -g -Wall -fsigned-char -O2 -fomit-frame-pointer -MT analy_names.o -MD -MP -MF .deps/analy_names.Tpo -c -o analy_names.o analy_names.cc
mv -f .deps/analy_names.Tpo .deps/analy_names.Po
arm-linux-gnueabihf-g++ -DHAVE_CONFIG_H -I. -I.. -I.. -I../asm -I../io/posix -I../io -I../output -I../eval    -pipe -g -Wall -fsigned-char -O2 -fomit-frame-pointer -MT analy_x86.o -MD -MP -MF .deps/analy_x86.Tpo -c -o analy_x86.o analy_x86.cc
analy_x86.cc: In member function 'virtual Address* AnalyX86Disassembler::branchAddr(dis_insn*, branch_enum_t, bool)':
analy_x86.cc:560:44: warning: 'xref' may be used uninitialized in this function [-Wuninitialized]
mv -f .deps/analy_x86.Tpo .deps/analy_x86.Po
arm-linux-gnueabihf-g++ -DHAVE_CONFIG_H -I. -I.. -I.. -I../asm -I../io/posix -I../io -I../output -I../eval    -pipe -g -Wall -fsigned-char -O2 -fomit-frame-pointer -MT code_analy.o -MD -MP -MF .deps/code_analy.Tpo -c -o code_analy.o code_analy.cc
mv -f .deps/code_analy.Tpo .deps/code_analy.Po
arm-linux-gnueabihf-g++ -DHAVE_CONFIG_H -I. -I.. -I.. -I../asm -I../io/posix -I../io -I../output -I../eval    -pipe -g -Wall -fsigned-char -O2 -fomit-frame-pointer -MT data_analy.o -MD -MP -MF .deps/data_analy.Tpo -c -o data_analy.o data_analy.cc
mv -f .deps/data_analy.Tpo .deps/data_analy.Po
arm-linux-gnueabihf-g++ -DHAVE_CONFIG_H -I. -I.. -I.. -I../asm -I../io/posix -I../io -I../output -I../eval    -pipe -g -Wall -fsigned-char -O2 -fomit-frame-pointer -MT language.o -MD -MP -MF .deps/language.Tpo -c -o language.o language.cc
mv -f .deps/language.Tpo .deps/language.Po
arm-linux-gnueabihf-g++ -DHAVE_CONFIG_H -I. -I.. -I.. -I../asm -I../io/posix -I../io -I../output -I../eval    -pipe -g -Wall -fsigned-char -O2 -fomit-frame-pointer -MT pe_analy.o -MD -MP -MF .deps/pe_analy.Tpo -c -o pe_analy.o pe_analy.cc
mv -f .deps/pe_analy.Tpo .deps/pe_analy.Po
arm-linux-gnueabihf-g++ -DHAVE_CONFIG_H -I. -I.. -I.. -I../asm -I../io/posix -I../io -I../output -I../eval    -pipe -g -Wall -fsigned-char -O2 -fomit-frame-pointer -MT stddata.o -MD -MP -MF .deps/stddata.Tpo -c -o stddata.o stddata.cc
mv -f .deps/stddata.Tpo .deps/stddata.Po
arm-linux-gnueabihf-g++ -DHAVE_CONFIG_H -I. -I.. -I.. -I../asm -I../io/posix -I../io -I../output -I../eval    -pipe -g -Wall -fsigned-char -O2 -fomit-frame-pointer -MT elf_analy.o -MD -MP -MF .deps/elf_analy.Tpo -c -o elf_analy.o elf_analy.cc
mv -f .deps/elf_analy.Tpo .deps/elf_analy.Po
arm-linux-gnueabihf-g++ -DHAVE_CONFIG_H -I. -I.. -I.. -I../asm -I../io/posix -I../io -I../output -I../eval    -pipe -g -Wall -fsigned-char -O2 -fomit-frame-pointer -MT analy_register.o -MD -MP -MF .deps/analy_register.Tpo -c -o analy_register.o analy_register.cc
mv -f .deps/analy_register.Tpo .deps/analy_register.Po
arm-linux-gnueabihf-g++ -DHAVE_CONFIG_H -I. -I.. -I.. -I../asm -I../io/posix -I../io -I../output -I../eval    -pipe -g -Wall -fsigned-char -O2 -fomit-frame-pointer -MT coff_analy.o -MD -MP -MF .deps/coff_analy.Tpo -c -o coff_analy.o coff_analy.cc
mv -f .deps/coff_analy.Tpo .deps/coff_analy.Po
arm-linux-gnueabihf-g++ -DHAVE_CONFIG_H -I. -I.. -I.. -I../asm -I../io/posix -I../io -I../output -I../eval    -pipe -g -Wall -fsigned-char -O2 -fomit-frame-pointer -MT analy_java.o -MD -MP -MF .deps/analy_java.Tpo -c -o analy_java.o analy_java.cc
mv -f .deps/analy_java.Tpo .deps/analy_java.Po
arm-linux-gnueabihf-g++ -DHAVE_CONFIG_H -I. -I.. -I.. -I../asm -I../io/posix -I../io -I../output -I../eval    -pipe -g -Wall -fsigned-char -O2 -fomit-frame-pointer -MT class_analy.o -MD -MP -MF .deps/class_analy.Tpo -c -o class_analy.o class_analy.cc
mv -f .deps/class_analy.Tpo .deps/class_analy.Po
arm-linux-gnueabihf-g++ -DHAVE_CONFIG_H -I. -I.. -I.. -I../asm -I../io/posix -I../io -I../output -I../eval    -pipe -g -Wall -fsigned-char -O2 -fomit-frame-pointer -MT ne_analy.o -MD -MP -MF .deps/ne_analy.Tpo -c -o ne_analy.o ne_analy.cc
mv -f .deps/ne_analy.Tpo .deps/ne_analy.Po
arm-linux-gnueabihf-g++ -DHAVE_CONFIG_H -I. -I.. -I.. -I../asm -I../io/posix -I../io -I../output -I../eval    -pipe -g -Wall -fsigned-char -O2 -fomit-frame-pointer -MT analy_il.o -MD -MP -MF .deps/analy_il.Tpo -c -o analy_il.o analy_il.cc
mv -f .deps/analy_il.Tpo .deps/analy_il.Po
arm-linux-gnueabihf-g++ -DHAVE_CONFIG_H -I. -I.. -I.. -I../asm -I../io/posix -I../io -I../output -I../eval    -pipe -g -Wall -fsigned-char -O2 -fomit-frame-pointer -MT analy_ia64.o -MD -MP -MF .deps/analy_ia64.Tpo -c -o analy_ia64.o analy_ia64.cc
mv -f .deps/analy_ia64.Tpo .deps/analy_ia64.Po
arm-linux-gnueabihf-g++ -DHAVE_CONFIG_H -I. -I.. -I.. -I../asm -I../io/posix -I../io -I../output -I../eval    -pipe -g -Wall -fsigned-char -O2 -fomit-frame-pointer -MT le_analy.o -MD -MP -MF .deps/le_analy.Tpo -c -o le_analy.o le_analy.cc
mv -f .deps/le_analy.Tpo .deps/le_analy.Po
arm-linux-gnueabihf-g++ -DHAVE_CONFIG_H -I. -I.. -I.. -I../asm -I../io/posix -I../io -I../output -I../eval    -pipe -g -Wall -fsigned-char -O2 -fomit-frame-pointer -MT analy_ppc.o -MD -MP -MF .deps/analy_ppc.Tpo -c -o analy_ppc.o analy_ppc.cc
mv -f .deps/analy_ppc.Tpo .deps/analy_ppc.Po
arm-linux-gnueabihf-g++ -DHAVE_CONFIG_H -I. -I.. -I.. -I../asm -I../io/posix -I../io -I../output -I../eval    -pipe -g -Wall -fsigned-char -O2 -fomit-frame-pointer -MT macho_analy.o -MD -MP -MF .deps/macho_analy.Tpo -c -o macho_analy.o macho_analy.cc
mv -f .deps/macho_analy.Tpo .deps/macho_analy.Po
arm-linux-gnueabihf-g++ -DHAVE_CONFIG_H -I. -I.. -I.. -I../asm -I../io/posix -I../io -I../output -I../eval    -pipe -g -Wall -fsigned-char -O2 -fomit-frame-pointer -MT flt_analy.o -MD -MP -MF .deps/flt_analy.Tpo -c -o flt_analy.o flt_analy.cc
mv -f .deps/flt_analy.Tpo .deps/flt_analy.Po
arm-linux-gnueabihf-g++ -DHAVE_CONFIG_H -I. -I.. -I.. -I../asm -I../io/posix -I../io -I../output -I../eval    -pipe -g -Wall -fsigned-char -O2 -fomit-frame-pointer -MT xbe_analy.o -MD -MP -MF .deps/xbe_analy.Tpo -c -o xbe_analy.o xbe_analy.cc
mv -f .deps/xbe_analy.Tpo .deps/xbe_analy.Po
arm-linux-gnueabihf-g++ -DHAVE_CONFIG_H -I. -I.. -I.. -I../asm -I../io/posix -I../io -I../output -I../eval    -pipe -g -Wall -fsigned-char -O2 -fomit-frame-pointer -MT pef_analy.o -MD -MP -MF .deps/pef_analy.Tpo -c -o pef_analy.o pef_analy.cc
pef_analy.cc: In member function 'virtual const char* PEFAnalyser::getSegmentNameByAddress(Address*)':
pef_analy.cc:448:53: warning: comparison between signed and unsigned integer expressions [-Wsign-compare]
mv -f .deps/pef_analy.Tpo .deps/pef_analy.Po
arm-linux-gnueabihf-g++ -DHAVE_CONFIG_H -I. -I.. -I.. -I../asm -I../io/posix -I../io -I../output -I../eval    -pipe -g -Wall -fsigned-char -O2 -fomit-frame-pointer -MT analy_arm.o -MD -MP -MF .deps/analy_arm.Tpo -c -o analy_arm.o analy_arm.cc
mv -f .deps/analy_arm.Tpo .deps/analy_arm.Po
arm-linux-gnueabihf-g++ -DHAVE_CONFIG_H -I. -I.. -I.. -I../asm -I../io/posix -I../io -I../output -I../eval    -pipe -g -Wall -fsigned-char -O2 -fomit-frame-pointer -MT xex_analy.o -MD -MP -MF .deps/xex_analy.Tpo -c -o xex_analy.o xex_analy.cc
xex_analy.cc: In member function 'virtual void XEXAnalyser::beginAnalysis()':
xex_analy.cc:73:7: warning: unused variable 'buffer' [-Wunused-variable]
xex_analy.cc: In member function 'virtual bool XEXAnalyser::validAddress(Address*, tsectype)':
xex_analy.cc:294:6: warning: unused variable 'sec' [-Wunused-variable]
mv -f .deps/xex_analy.Tpo .deps/xex_analy.Po
rm -f libanalyser.a
/usr/bin/ar cru libanalyser.a analy.o analy_alpha.o analy_names.o analy_x86.o code_analy.o data_analy.o language.o pe_analy.o stddata.o elf_analy.o analy_register.o coff_analy.o analy_java.o class_analy.o ne_analy.o analy_il.o analy_ia64.o le_analy.o analy_ppc.o macho_analy.o flt_analy.o xbe_analy.o pef_analy.o analy_arm.o xex_analy.o 
ranlib libanalyser.a
make[3]: Leaving directory `/<<PKGBUILDDIR>>/analyser'
Making all in asm
make[3]: Entering directory `/<<PKGBUILDDIR>>/asm'
arm-linux-gnueabihf-g++ -DHAVE_CONFIG_H -I. -I.. -I.. -I../io/posix -I../io    -pipe -g -Wall -fsigned-char -O2 -fomit-frame-pointer -MT alphadis.o -MD -MP -MF .deps/alphadis.Tpo -c -o alphadis.o alphadis.cc
mv -f .deps/alphadis.Tpo .deps/alphadis.Po
arm-linux-gnueabihf-g++ -DHAVE_CONFIG_H -I. -I.. -I.. -I../io/posix -I../io    -pipe -g -Wall -fsigned-char -O2 -fomit-frame-pointer -MT alphaopc.o -MD -MP -MF .deps/alphaopc.Tpo -c -o alphaopc.o alphaopc.cc
mv -f .deps/alphaopc.Tpo .deps/alphaopc.Po
arm-linux-gnueabihf-g++ -DHAVE_CONFIG_H -I. -I.. -I.. -I../io/posix -I../io    -pipe -g -Wall -fsigned-char -O2 -fomit-frame-pointer -MT asm.o -MD -MP -MF .deps/asm.Tpo -c -o asm.o asm.cc
mv -f .deps/asm.Tpo .deps/asm.Po
arm-linux-gnueabihf-g++ -DHAVE_CONFIG_H -I. -I.. -I.. -I../io/posix -I../io    -pipe -g -Wall -fsigned-char -O2 -fomit-frame-pointer -MT x86asm.o -MD -MP -MF .deps/x86asm.Tpo -c -o x86asm.o x86asm.cc
mv -f .deps/x86asm.Tpo .deps/x86asm.Po
arm-linux-gnueabihf-g++ -DHAVE_CONFIG_H -I. -I.. -I.. -I../io/posix -I../io    -pipe -g -Wall -fsigned-char -O2 -fomit-frame-pointer -MT x86dis.o -MD -MP -MF .deps/x86dis.Tpo -c -o x86dis.o x86dis.cc
x86dis.cc: In member function 'void x86dis::decode_sib(x86_insn_op*, int)':
x86dis.cc:283:1: error: unrecognizable insn:
(insn 151 150 152 6 (set (subreg:SI (reg:DI 200 [ this_4(D)->disp ]) 0)
        (sign_extend:SI (mem/s:QI (plus:SI (reg/f:SI 169 [ this ])
                    (const_int 600 [0x258])) [6 this_4(D)->disp+0 S1 A64]))) x86dis.cc:276 -1
x86dis.cc:283:1: internal compiler error: in extract_insn, at recog.c:2109
Please submit a full bug report,
with preprocessed source if appropriate.
See <file:///usr/share/doc/gcc-4.6/README.Bugs> for instructions.
Preprocessed source stored into /tmp/ccSfFpp4.out file, please attach this to your bugreport.
make[3]: *** [x86dis.o] Error 1
make[3]: Leaving directory `/<<PKGBUILDDIR>>/asm'
make[2]: *** [all-recursive] Error 1
make[2]: Leaving directory `/<<PKGBUILDDIR>>'
make[1]: *** [all] Error 2
make[1]: Leaving directory `/<<PKGBUILDDIR>>'
make: *** [build-stamp] Error 2
dpkg-buildpackage: error: debian/rules build-arch gave error exit status 2
Build finished at 2017-06-18T13:40:47Z


| Cleanup                                                                      |

Purging /<<BUILDDIR>>
Not cleaning session: cloned chroot in use
E: Build failure (dpkg-buildpackage died)

| Summary                                                                      |

Build Architecture: armhf
Build-Space: 10192
Build-Time: 40
Distribution: wheezy-staging
Fail-Stage: build
Host Architecture: armhf
Install-Time: 91
Job: ht_2.0.20-2
Machine Architecture: armhf
Package: ht
Package-Time: 147
Source-Version: 2.0.20-2
Space: 10192
Status: attempted
Version: 2.0.20-2
Finished at 2017-06-18T13:40:47Z
Build needed 00:02:27, 10192k disk space